Open Energy Ontology
type: Ontology
version IRI: oeo.owl
contributor: (0001) Lukas Emele (@l-emele)
contributor: (0002) Mirjam Stappel (@stap-m)
contributor: (0003) Anna Kleinau (@akleinau)
contributor: (0004) Janna Hastings (@jannahastings)
contributor: (0005) Vera Sehn (@Vera-IER)
contributor: (0006) Hannah Förster (@han-f)
contributor: (0007) Patrick Kuckertz (@p-kuckertz)
contributor: (0008) Carsten Hoyer-Klick (@carstenhoyerklick)
contributor: (0009) Christian Hofmann (@christian-rli)
contributor: (0010) Kevin Knosala (@k-knosala)
contributor: (0011) Ludwig Hülk (@Ludee)
contributor: (0012) Izzet Kilicarslan (@Izzet91)
contributor: (0013) Franziska Drathschmidt (@fradra)
contributor: (0014) Simon Flügel (@sfluegel05)
contributor: (0015) Ulrich Frey (@litotes18)
contributor: (0016) Christoph Muschner (@chrwm)
contributor: (0017) Christian Winger (@wingechr)
contributor: (0018) Fabian Neuhaus (@fabianneuhaus)
contributor: (0019) Lara Christmann (@solar-c)
contributor: (0020) Martin Glauer (@MGlauer)
contributor: (0021) Pierre-Francois Duc (@Bachibouzouk)
contributor: (0022) Sebastian Cordes (@sebcordes)
contributor: (0023) Michaja Pehl (@0UmfHxcvx5J7JoaOhFSs5mncnisTJJ6q)
contributor: (0024) Kai Schnepf (@KaiSchnepf)
contributor: (0025) Till Mossakowski (@tillmo)
contributor: (0026) Alexander Stage (@stage1407)
contributor: (0027) Hedda Gardian (@heddaelisabethgardian)
contributor: (0028) Eugenio Salvador Arellano Ruiz (@areleu)
contributor: (0029) Markus Rothkötter (@markus-rothkoetter)
contributor: (0030) Linda Rülicke (@rue-l)
contributor: (0031) Alexandra Seibicke (@Alex2448)
contributor: (0032) Ludwig Mittermeier (@lumi321)
contributor: (0033) Ulf Müller (@u-mueller)
contributor: (0034) Nele Köhler (@nelekoehler)
contributor: (0035) Hannah Spinde (@h-spinde)
contributor: (0036) Viktor Wichern (@viktorwichern)
contributor: (0037) Norman Zielke (@NormanZielke)
contributor: (0038) Uwe Stucky (@UStucky)
contributor: (0039) Madeleine Breitkreutz (@madbkr)
contributor: (0040) Lilly Gerlach (@LillyG901)
contributor: (0041) Colin Heidfeld (@ColinHDev)
contributor: (0042) Jan Sören Schwarz (@schwarzatoffis)
contributor: (0043) Finn Niklas Peters (@f-innatech)
contributor: (0044) Amanda Wein (@amanda-wein)
contributor: (0045) Ahlem Rhayem (@AhlemRhayem)
description: The Open Energy Ontology is an ontology for all aspects of the energy modelling domain. It is developed in four main modules: 'oeo-model', a module for all entities related to models and modelling; 'oeo-physical', a module for all entities related to the world of energy and energy generation; 'oeo-social', a module for all relevant social and economic aspects of the energy domain; 'oeo-shared', a module to cover entities and relations needed in all of the modules above to prevent them getting implemented multiple times. A supplementary module is the oeo-physical-axioms module, which contains general class axioms.
creator: OEO Developer Team <https://github.com/OpenEnergyPlatform/ontology/blob/master/CITATION.cff>
license: http://creativecommons.org/publicdomain/zero/1.0/
version info: 2.11.0

BFO OWL specification label
type: AnnotationProperty
definition: Relates an entity in the ontology to the name of the variable that is used to represent it in the code that generates the BFO OWL file from the lispy specification.
curator note: Really of interest to developers only
sub property of: label

BFO CLIF specification label
type: AnnotationProperty
definition: Relates an entity in the ontology to the term that is used to represent it in the the CLIF specification of BFO2
definition source: Person:Alan Ruttenberg
curator note: Really of interest to developers only
sub property of: label

editor preferred term
type: AnnotationProperty
editor preferred term: editor preferred term
has curation status: IAO_0000122
definition: The concise, meaningful, and human-friendly name for a class or property preferred by the ontology developers. (US-English)
term editor: PERSON:Daniel Schober
definition source: GROUP:OBI:<http://purl.obolibrary.org/obo/obi>

Axiom
annotated source: editor preferred term
annotated property: label
annotated target: editor preferred term

Axiom
annotated source: editor preferred term
annotated property: editor preferred term
annotated target: editor preferred term

Axiom
annotated source: editor preferred term
annotated property: definition
annotated target: The concise, meaningful, and human-friendly name for a class or property preferred by the ontology developers. (US-English)

Axiom
annotated source: editor preferred term
annotated property: term editor
annotated target: PERSON:Daniel Schober

Axiom
annotated source: editor preferred term
annotated property: definition source
annotated target: GROUP:OBI:<http://purl.obolibrary.org/obo/obi>

example of usage
type: AnnotationProperty
editor preferred term: example of usage
has curation status: IAO_0000122
definition: A phrase describing how a term should be used and/or a citation to a work which uses it. May also include other kinds of examples that facilitate immediate understanding, such as widely know prototypes or instances of a class, or cases where a relation is said to hold.
term editor: PERSON:Daniel Schober
definition source: GROUP:OBI:<http://purl.obolibrary.org/obo/obi>

Axiom
annotated source: example of usage
annotated property: editor preferred term
annotated target: example of usage

Axiom
annotated source: example of usage
annotated property: definition
annotated target: A phrase describing how a term should be used and/or a citation to a work which uses it. May also include other kinds of examples that facilitate immediate understanding, such as widely know prototypes or instances of a class, or cases where a relation is said to hold.

Axiom
annotated source: example of usage
annotated property: term editor
annotated target: PERSON:Daniel Schober

Axiom
annotated source: example of usage
annotated property: definition source
annotated target: GROUP:OBI:<http://purl.obolibrary.org/obo/obi>

Axiom
annotated source: example of usage
annotated property: label
annotated target: example of usage

has curation status
type: AnnotationProperty
editor preferred term: has curation status
term editor: PERSON:Alan Ruttenberg
term editor: PERSON:Bill Bug
term editor: PERSON:Melanie Courtot

Axiom
annotated source: has curation status
annotated property: editor preferred term
annotated target: has curation status

Axiom
annotated source: has curation status
annotated property: term editor
annotated target: PERSON:Alan Ruttenberg

Axiom
annotated source: has curation status
annotated property: term editor
annotated target: PERSON:Bill Bug

Axiom
annotated source: has curation status
annotated property: term editor
annotated target: PERSON:Melanie Courtot

Axiom
annotated source: has curation status
annotated property: label
annotated target: has curation status

definition
type: AnnotationProperty
editor preferred term: definition
has curation status: IAO_0000122
definition: The official definition, explaining the meaning of a class or property. Shall be Aristotelian, formalized and normalized. Can be augmented with colloquial definitions.
editor note: 2012-04-05: Barry Smith The official OBI definition, explaining the meaning of a class or property: 'Shall be Aristotelian, formalized and normalized. Can be augmented with colloquial definitions' is terrible. Can you fix to something like: A statement of necessary and sufficient conditions explaining the meaning of an expression referring to a class or property. Alan Ruttenberg Your proposed definition is a reasonable candidate, except that it is very common that necessary and sufficient conditions are not given. Mostly they are necessary, occasionally they are necessary and sufficient or just sufficient. Often they use terms that are not themselves defined and so they effectively can't be evaluated by those criteria. On the specifics of the proposed definition: We don't have definitions of 'meaning' or 'expression' or 'property'. For 'reference' in the intended sense I think we use the term 'denotation'. For 'expression', I think we you mean symbol, or identifier. For 'meaning' it differs for class and property. For class we want documentation that let's the intended reader determine whether an entity is instance of the class, or not. For property we want documentation that let's the intended reader determine, given a pair of potential relata, whether the assertion that the relation holds is true. The 'intended reader' part suggests that we also specify who, we expect, would be able to understand the definition, and also generalizes over human and computer reader to include textual and logical definition. Personally, I am more comfortable weakening definition to documentation, with instructions as to what is desirable. We also have the outstanding issue of how to aim different definitions to different audiences. A clinical audience reading chebi wants a different sort of definition documentation/definition from a chemistry trained audience, and similarly there is a need for a definition that is adequate for an ontologist to work with.
term editor: PERSON:Daniel Schober
definition source: GROUP:OBI:<http://purl.obolibrary.org/obo/obi>

Axiom
annotated source: definition
annotated property: editor preferred term
annotated target: definition

Axiom
annotated source: definition
annotated property: definition
annotated target: The official definition, explaining the meaning of a class or property. Shall be Aristotelian, formalized and normalized. Can be augmented with colloquial definitions.

Axiom
annotated source: definition
annotated property: editor note
annotated target: 2012-04-05: Barry Smith The official OBI definition, explaining the meaning of a class or property: 'Shall be Aristotelian, formalized and normalized. Can be augmented with colloquial definitions' is terrible. Can you fix to something like: A statement of necessary and sufficient conditions explaining the meaning of an expression referring to a class or property. Alan Ruttenberg Your proposed definition is a reasonable candidate, except that it is very common that necessary and sufficient conditions are not given. Mostly they are necessary, occasionally they are necessary and sufficient or just sufficient. Often they use terms that are not themselves defined and so they effectively can't be evaluated by those criteria. On the specifics of the proposed definition: We don't have definitions of 'meaning' or 'expression' or 'property'. For 'reference' in the intended sense I think we use the term 'denotation'. For 'expression', I think we you mean symbol, or identifier. For 'meaning' it differs for class and property. For class we want documentation that let's the intended reader determine whether an entity is instance of the class, or not. For property we want documentation that let's the intended reader determine, given a pair of potential relata, whether the assertion that the relation holds is true. The 'intended reader' part suggests that we also specify who, we expect, would be able to understand the definition, and also generalizes over human and computer reader to include textual and logical definition. Personally, I am more comfortable weakening definition to documentation, with instructions as to what is desirable. We also have the outstanding issue of how to aim different definitions to different audiences. A clinical audience reading chebi wants a different sort of definition documentation/definition from a chemistry trained audience, and similarly there is a need for a definition that is adequate for an ontologist to work with.

Axiom
annotated source: definition
annotated property: term editor
annotated target: PERSON:Daniel Schober

Axiom
annotated source: definition
annotated property: definition source
annotated target: GROUP:OBI:<http://purl.obolibrary.org/obo/obi>

Axiom
annotated source: definition
annotated property: label
annotated target: definition

Axiom
annotated source: definition
annotated property: label
annotated target: definition

Axiom
annotated source: definition
annotated property: label
annotated target: definition

Axiom
annotated source: definition
annotated property: label
annotated target: definition

editor note
type: AnnotationProperty
editor preferred term: editor note
has curation status: IAO_0000122
definition: An administrative note intended for its editor. It may not be included in the publication version of the ontology, so it should contain nothing necessary for end users to understand the ontology.
term editor: PERSON:Daniel Schober
definition source: GROUP:OBI:<http://purl.obofoundry.org/obo/obi>

Axiom
annotated source: editor note
annotated property: editor preferred term
annotated target: editor note

Axiom
annotated source: editor note
annotated property: definition
annotated target: An administrative note intended for its editor. It may not be included in the publication version of the ontology, so it should contain nothing necessary for end users to understand the ontology.

Axiom
annotated source: editor note
annotated property: term editor
annotated target: PERSON:Daniel Schober

Axiom
annotated source: editor note
annotated property: definition source
annotated target: GROUP:OBI:<http://purl.obofoundry.org/obo/obi>

Axiom
annotated source: editor note
annotated property: label
annotated target: editor note

term editor
type: AnnotationProperty
editor preferred term: term editor
has curation status: IAO_0000122
definition: Name of editor entering the term in the file. The term editor is a point of contact for information regarding the term. The term editor may be, but is not always, the author of the definition, which may have been worked upon by several people
editor note: 20110707, MC: label update to term editor and definition modified accordingly. See https://github.com/information-artifact-ontology/IAO/issues/115.
term editor: PERSON:Daniel Schober
definition source: GROUP:OBI:<http://purl.obolibrary.org/obo/obi>

Axiom
annotated source: term editor
annotated property: editor preferred term
annotated target: term editor

Axiom
annotated source: term editor
annotated property: definition
annotated target: Name of editor entering the term in the file. The term editor is a point of contact for information regarding the term. The term editor may be, but is not always, the author of the definition, which may have been worked upon by several people

Axiom
annotated source: term editor
annotated property: editor note
annotated target: 20110707, MC: label update to term editor and definition modified accordingly. See https://github.com/information-artifact-ontology/IAO/issues/115.

Axiom
annotated source: term editor
annotated property: term editor
annotated target: PERSON:Daniel Schober

Axiom
annotated source: term editor
annotated property: definition source
annotated target: GROUP:OBI:<http://purl.obolibrary.org/obo/obi>

Axiom
annotated source: term editor
annotated property: label
annotated target: term editor

alternative label
type: AnnotationProperty
editor preferred term: alternative label
has curation status: IAO_0000125
definition: A label for a class or property that can be used to refer to the class or property instead of the preferred rdfs:label. Alternative labels should be used to indicate community- or context-specific labels, abbreviations, shorthand forms and the like.
term editor: OBO Operations committee
term editor: PERSON:Daniel Schober
definition source: GROUP:OBI:<http://purl.obolibrary.org/obo/obi>
comment: Consider re-defing to: An alternative name for a class or property which can mean the same thing as the preferred name (semantically equivalent, narrow, broad or related).
comment: In the OEO, we don't follow the definition strictly. We use alternative term for synonyms and ambiguous terms as well. See https://github.com/OpenEnergyPlatform/ontology/wiki/Handling-ambiguous-terms
label: alternative term

Axiom
annotated source: alternative label
annotated property: editor preferred term
annotated target: alternative label

Axiom
annotated source: alternative label
annotated property: definition
annotated target: A label for a class or property that can be used to refer to the class or property instead of the preferred rdfs:label. Alternative labels should be used to indicate community- or context-specific labels, abbreviations, shorthand forms and the like.

Axiom
annotated source: alternative label
annotated property: term editor
annotated target: OBO Operations committee

Axiom
annotated source: alternative label
annotated property: term editor
annotated target: PERSON:Daniel Schober

Axiom
annotated source: alternative label
annotated property: definition source
annotated target: GROUP:OBI:<http://purl.obolibrary.org/obo/obi>

Axiom
annotated source: alternative label
annotated property: comment
annotated target: Consider re-defing to: An alternative name for a class or property which can mean the same thing as the preferred name (semantically equivalent, narrow, broad or related).

Axiom
annotated source: alternative label
annotated property: label
annotated target: alternative label

definition source
type: AnnotationProperty
editor preferred term: definition source
has curation status: IAO_0000122
definition: Formal citation, e.g. identifier in external database to indicate / attribute source(s) for the definition. Free text indicate / attribute source(s) for the definition. EXAMPLE: Author Name, URI, MeSH Term C04, PUBMED ID, Wiki uri on 31.01.2007
term editor: PERSON:Daniel Schober
definition source: Discussion on obo-discuss mailing-list, see http://bit.ly/hgm99w
definition source: GROUP:OBI:<http://purl.obolibrary.org/obo/obi>

Axiom
annotated source: definition source
annotated property: editor preferred term
annotated target: definition source

Axiom
annotated source: definition source
annotated property: definition
annotated target: Formal citation, e.g. identifier in external database to indicate / attribute source(s) for the definition. Free text indicate / attribute source(s) for the definition. EXAMPLE: Author Name, URI, MeSH Term C04, PUBMED ID, Wiki uri on 31.01.2007

Axiom
annotated source: definition source
annotated property: term editor
annotated target: PERSON:Daniel Schober

Axiom
annotated source: definition source
annotated property: definition source
annotated target: Discussion on obo-discuss mailing-list, see http://bit.ly/hgm99w

Axiom
annotated source: definition source
annotated property: definition source
annotated target: GROUP:OBI:<http://purl.obolibrary.org/obo/obi>

Axiom
annotated source: definition source
annotated property: label
annotated target: definition source

curator note
type: AnnotationProperty
editor preferred term: curator note
has curation status: IAO_0000122
definition: An administrative note of use for a curator but of no use for a user
term editor: PERSON:Alan Ruttenberg

Axiom
annotated source: curator note
annotated property: label
annotated target: curator note

Axiom
annotated source: curator note
annotated property: editor preferred term
annotated target: curator note

Axiom
annotated source: curator note
annotated property: definition
annotated target: An administrative note of use for a curator but of no use for a user

Axiom
annotated source: curator note
annotated property: term editor
annotated target: PERSON:Alan Ruttenberg

term tracker item
type: AnnotationProperty
editor preferred term: term tracker item
example of usage: the URI for an OBI Terms ticket at sourceforge, such as https://sourceforge.net/p/obi/obi-terms/772/
has curation status: IAO_0000125
definition: An IRI or similar locator for a request or discussion of an ontology term.
term editor: Person: Jie Zheng, Chris Stoeckert, Alan Ruttenberg
definition source: Person: Jie Zheng, Chris Stoeckert, Alan Ruttenberg
comment: The 'tracker item' can associate a tracker with a specific ontology term.

Axiom
annotated source: term tracker item
annotated property: editor preferred term
annotated target: term tracker item

Axiom
annotated source: term tracker item
annotated property: example of usage
annotated target: the URI for an OBI Terms ticket at sourceforge, such as https://sourceforge.net/p/obi/obi-terms/772/

Axiom
annotated source: term tracker item
annotated property: definition
annotated target: An IRI or similar locator for a request or discussion of an ontology term.

Axiom
annotated source: term tracker item
annotated property: term editor
annotated target: Person: Jie Zheng, Chris Stoeckert, Alan Ruttenberg

Axiom
annotated source: term tracker item
annotated property: definition source
annotated target: Person: Jie Zheng, Chris Stoeckert, Alan Ruttenberg

Axiom
annotated source: term tracker item
annotated property: comment
annotated target: The 'tracker item' can associate a tracker with a specific ontology term.

Axiom
annotated source: term tracker item
annotated property: label
annotated target: term tracker item

ontology term requester
type: AnnotationProperty
editor preferred term: ontology term requester
has curation status: IAO_0000125
definition: The name of the person, project, or organization that motivated inclusion of an ontology term by requesting its addition.
term editor: Person: Jie Zheng, Chris Stoeckert, Alan Ruttenberg
definition source: Person: Jie Zheng, Chris Stoeckert, Alan Ruttenberg
comment: The 'term requester' can credit the person, organization or project who request the ontology term.

Axiom
annotated source: ontology term requester
annotated property: editor preferred term
annotated target: ontology term requester

Axiom
annotated source: ontology term requester
annotated property: definition
annotated target: The name of the person, project, or organization that motivated inclusion of an ontology term by requesting its addition.

Axiom
annotated source: ontology term requester
annotated property: term editor
annotated target: Person: Jie Zheng, Chris Stoeckert, Alan Ruttenberg

Axiom
annotated source: ontology term requester
annotated property: definition source
annotated target: Person: Jie Zheng, Chris Stoeckert, Alan Ruttenberg

Axiom
annotated source: ontology term requester
annotated property: comment
annotated target: The 'term requester' can credit the person, organization or project who request the ontology term.

Axiom
annotated source: ontology term requester
annotated property: label
annotated target: ontology term requester

imported from
type: AnnotationProperty
editor preferred term: imported from
has curation status: IAO_0000125
definition: For external terms/classes, the ontology from which the term was imported
term editor: PERSON:Alan Ruttenberg
term editor: PERSON:Melanie Courtot
definition source: GROUP:OBI:<http://purl.obolibrary.org/obo/obi>

Axiom
annotated source: imported from
annotated property: editor preferred term
annotated target: imported from

Axiom
annotated source: imported from
annotated property: definition
annotated target: For external terms/classes, the ontology from which the term was imported

Axiom
annotated source: imported from
annotated property: term editor
annotated target: PERSON:Alan Ruttenberg

Axiom
annotated source: imported from
annotated property: term editor
annotated target: PERSON:Melanie Courtot

Axiom
annotated source: imported from
annotated property: definition source
annotated target: GROUP:OBI:<http://purl.obolibrary.org/obo/obi>

Axiom
annotated source: imported from
annotated property: label
annotated target: imported from

OBO foundry unique label
type: AnnotationProperty
has curation status: IAO_0000125

Axiom
annotated source: OBO foundry unique label
annotated property: label
annotated target: OBO foundry unique label

Axiom
annotated source: OBO foundry unique label
annotated property: label
annotated target: OBO foundry unique label

elucidation
type: AnnotationProperty

Axiom
annotated source: elucidation
annotated property: label
annotated target: elucidation

has associated axiom(nl)
type: AnnotationProperty

has associated axiom(fol)
type: AnnotationProperty

Axiom
annotated source: has associated axiom(fol)
annotated property: label
annotated target: has associated axiom(fol)

may be identical to
type: AnnotationProperty
editor preferred term: may be identical to
definition: A annotation relationship between two terms in an ontology that may refer to the same (natural) type but where more evidence is required before terms are merged.
term editor: David Osumi-Sutherland
term tracker item: #40
ontology term requester: VFB
comment: Edges asserting this should be annotated with to record evidence supporting the assertion and its provenance.

Axiom
annotated source: may be identical to
annotated property: editor preferred term
annotated target: may be identical to

Axiom
annotated source: may be identical to
annotated property: definition
annotated target: A annotation relationship between two terms in an ontology that may refer to the same (natural) type but where more evidence is required before terms are merged.

Axiom
annotated source: may be identical to
annotated property: term editor
annotated target: David Osumi-Sutherland

Axiom
annotated source: may be identical to
annotated property: term tracker item
annotated target: #40

Axiom
annotated source: may be identical to
annotated property: ontology term requester
annotated target: VFB

Axiom
annotated source: may be identical to
annotated property: comment
annotated target: Edges asserting this should be annotated with to record evidence supporting the assertion and its provenance.

Axiom
annotated source: may be identical to
annotated property: label
annotated target: may be identical to

has axiom label
type: AnnotationProperty

temporal interpretation
type: AnnotationProperty
definition: An assertion that holds between an OWL Object Property and a temporal interpretation that elucidates how OWL Class Axioms that use this property are to be interpreted in a temporal context.

Axiom
annotated source: temporal interpretation
annotated property: definition
annotated target: An assertion that holds between an OWL Object Property and a temporal interpretation that elucidates how OWL Class Axioms that use this property are to be interpreted in a temporal context.

Axiom
annotated source: temporal interpretation
annotated property: definition
annotated target: An assertion that holds between an OWL Object Property and a temporal interpretation that elucidates how OWL Class Axioms that use this property are to be interpreted in a temporal context.

Axiom
annotated source: temporal interpretation
annotated property: label
annotated target: temporal interpretation

Axiom
annotated source: temporal interpretation
annotated property: label
annotated target: temporal interpretation

is homeomorphic for
type: AnnotationProperty
example of usage: part-of is homeomorphic for independent continuants.
definition: R is homemorphic for C iff (1) there exists some x,y such that x R y, and x and y instantiate C and (2) for all x, if x is an instance of C, and there exists some y some such that x R y, then it follows that y is an instance of C.
created by: https://orcid.org/0000-0002-6601-2165
creation date: 2018-10-21T19:46:34Z
comment: R homeomorphic-for C expands to: C SubClassOf R only C. Additionally, for any class D that is disjoint with C, we can also expand to C DisjointWith R some D, D DisjointWith R some C.

Axiom
annotated source: is homeomorphic for
annotated property: example of usage
annotated target: part-of is homeomorphic for independent continuants.

Axiom
annotated source: is homeomorphic for
annotated property: definition
annotated target: R is homemorphic for C iff (1) there exists some x,y such that x R y, and x and y instantiate C and (2) for all x, if x is an instance of C, and there exists some y some such that x R y, then it follows that y is an instance of C.

Axiom
annotated source: is homeomorphic for
annotated property: creation date
annotated target: 2018-10-21T19:46:34Z

Axiom
annotated source: is homeomorphic for
annotated property: comment
annotated target: R homeomorphic-for C expands to: C SubClassOf R only C. Additionally, for any class D that is disjoint with C, we can also expand to C DisjointWith R some D, D DisjointWith R some C.

Axiom
annotated source: is homeomorphic for
annotated property: label
annotated target: is homeomorphic for

STATO alternative term
type: AnnotationProperty
definition: an alternative term used for STATO statistical ontology and ISA team
term editor: Alejandra Gonzalez-Beltran
term editor: Orlaith Burke
term editor: Philippe Rocca-Serra

Axiom
annotated source: STATO alternative term
annotated property: definition
annotated target: an alternative term used for STATO statistical ontology and ISA team

Axiom
annotated source: STATO alternative term
annotated property: term editor
annotated target: Alejandra Gonzalez-Beltran

Axiom
annotated source: STATO alternative term
annotated property: term editor
annotated target: Orlaith Burke

Axiom
annotated source: STATO alternative term
annotated property: term editor
annotated target: Philippe Rocca-Serra

Axiom
annotated source: STATO alternative term
annotated property: label
annotated target: STATO alternative term

has_related_synonym
type: AnnotationProperty

Axiom
annotated source: has_related_synonym
annotated property: label
annotated target: has_related_synonym

isDefinedBy
type: AnnotationProperty
OBO foundry unique label: is defined by

Axiom
annotated source: isDefinedBy
annotated property: OBO foundry unique label
annotated target: is defined by
comment: This is an experimental annotation

Axiom
annotated source: isDefinedBy
annotated property: OBO foundry unique label
annotated target: is defined by
comment: This is an experimental annotation

unique individual identifier
type: AnnotationProperty
definition: A unique individual identifier is an identifier that is unique for one individual of a class. Unique individual identifiers follow usually a structure defined e.g. by a sector division.
term tracker annotation: issue: https://github.com/OpenEnergyPlatform/ontology/issues/461 pull request: https://github.com/OpenEnergyPlatform/ontology/pull/523
sub property of: identifier

oekg annotation
type: AnnotationProperty
definition: An oekg specific annotation that indicates how an entity should be used by the OEKG.
comment: allowed value: "study descriptor"
term tracker annotation: issue: https://github.com/OpenEnergyPlatform/ontology/issues/1529 pull request: https://github.com/OpenEnergyPlatform/ontology/pull/1897

term tracker annotation
type: AnnotationProperty
definition: A term tracker annotation is an editor note used to track the history of an entity. For each change, it records the related GitHub issue and pull request.
editor note: This annotation property was added to replace the previously used "term tracker item" http://purl.obolibrary.org/obo/IAO_0000233.
term tracker annotation: Replace term tracker item issue: https://github.com/OpenEnergyPlatform/ontology/issues/1850 pull request: https://github.com/OpenEnergyPlatform/ontology/pull/1913 pull request: https://github.com/OpenEnergyPlatform/ontology/pull/1922 pull request: https://github.com/OpenEnergyPlatform/ontology/pull/1923
sub property of: editor note

has associated axiom(sparql)
type: AnnotationProperty

belongs to module
type: AnnotationProperty
editor note: This annotation property was used to describe in which module a class was implemented. With OEO version 2.0.0 this annotation property gets deprecated.
term tracker annotation: Make the annotation property deprecated Pull request: https://github.com/OpenEnergyPlatform/ontology/pull/1732

mathematical expression
type: AnnotationProperty
definition: A mathematical expression is an annotation property that describes the class with a mathematical formula in LaTeX syntax.
term tracker annotation: issue: https://github.com/OpenEnergyPlatform/ontology/issues/987 pull request: https://github.com/OpenEnergyPlatform/ontology/pull/990

acronym
type: AnnotationProperty
definition: An Alternative Label that consists of a shortened or abbreviated form of the rdfs:label and is used to denote the entity.
is curated in ontology: https://www.commoncoreontologies.org/ExtendedRelationOntology

Axiom
annotated source: acronym
annotated property: label
annotated target: acronym

Axiom
annotated source: acronym
annotated property: definition
annotated target: An Alternative Label that consists of a shortened or abbreviated form of the rdfs:label and is used to denote the entity.

definition source
type: AnnotationProperty
definition: A citation of where all or some of the information used to create the term's Definition was acquired from.
is curated in ontology: https://www.commoncoreontologies.org/ExtendedRelationOntology

Axiom
annotated source: definition source
annotated property: label
annotated target: definition source

Axiom
annotated source: definition source
annotated property: definition
annotated target: A citation of where all or some of the information used to create the term's Definition was acquired from.

is curated in ontology
type: AnnotationProperty
definition: An annotation property that links a class, property, or named individual to the URI of the ontology where it is located.
is curated in ontology: https://www.commoncoreontologies.org/ExtendedRelationOntology

Axiom
annotated source: is curated in ontology
annotated property: label
annotated target: is curated in ontology

Axiom
annotated source: is curated in ontology
annotated property: definition
annotated target: An annotation property that links a class, property, or named individual to the URI of the ontology where it is located.

part of
type: ObjectProperty
sub property of: topObjectProperty
inverse of: has part
editor preferred term: is part of
example of usage: my brain is part of my body (continuant parthood, two material entities)
example of usage: my stomach cavity is part of my stomach (continuant parthood, immaterial entity is part of material entity)
example of usage: this day is part of this year (occurrent parthood)
definition: a core relation that holds between a part and its whole
editor note: Everything is part of itself. Any part of any part of a thing is itself part of that thing. Two distinct things cannot be part of each other.
editor note: Occurrents are not subject to change and so parthood between occurrents holds for all the times that the part exists. Many continuants are subject to change, so parthood between continuants will only hold at certain times, but this is difficult to specify in OWL. See http://purl.obolibrary.org/obo/ro/docs/temporal-semantics/
editor note: Parthood requires the part and the whole to have compatible classes: only an occurrent can be part of an occurrent; only a process can be part of a process; only a continuant can be part of a continuant; only an independent continuant can be part of an independent continuant; only an immaterial entity can be part of an immaterial entity; only a specifically dependent continuant can be part of a specifically dependent continuant; only a generically dependent continuant can be part of a generically dependent continuant. (This list is not exhaustive.) A continuant cannot be part of an occurrent: use 'participates in'. An occurrent cannot be part of a continuant: use 'has participant'. A material entity cannot be part of an immaterial entity: use 'has location'. A specifically dependent continuant cannot be part of an independent continuant: use 'inheres in'. An independent continuant cannot be part of a specifically dependent continuant: use 'bearer of'.
alternative label: part_of
temporal interpretation: RO_0001901
is homeomorphic for: continuant
is homeomorphic for: occurrent
is homeomorphic for: independent continuant
is homeomorphic for: realizable entity
is homeomorphic for: quality
is homeomorphic for: specifically dependent continuant
is homeomorphic for: generically dependent continuant
term tracker annotation: issue https://github.com/OpenEnergyPlatform/ontology/issues/596 Pull request https://github.com/OpenEnergyPlatform/ontology/pull/599 Pull request https://github.com/OpenEnergyPlatform/ontology/pull/603

Axiom
annotated source: part of
annotated property: editor preferred term
annotated target: is part of

Axiom
annotated source: part of
annotated property: example of usage
annotated target: my brain is part of my body (continuant parthood, two material entities)

Axiom
annotated source: part of
annotated property: example of usage
annotated target: my stomach cavity is part of my stomach (continuant parthood, immaterial entity is part of material entity)

Axiom
annotated source: part of
annotated property: example of usage
annotated target: this day is part of this year (occurrent parthood)

Axiom
annotated source: part of
annotated property: definition
annotated target: a core relation that holds between a part and its whole

Axiom
annotated source: part of
annotated property: editor note
annotated target: Everything is part of itself. Any part of any part of a thing is itself part of that thing. Two distinct things cannot be part of each other.

Axiom
annotated source: part of
annotated property: editor note
annotated target: Occurrents are not subject to change and so parthood between occurrents holds for all the times that the part exists. Many continuants are subject to change, so parthood between continuants will only hold at certain times, but this is difficult to specify in OWL. See http://purl.obolibrary.org/obo/ro/docs/temporal-semantics/

Axiom
annotated source: part of
annotated property: editor note
annotated target: Parthood requires the part and the whole to have compatible classes: only an occurrent can be part of an occurrent; only a process can be part of a process; only a continuant can be part of a continuant; only an independent continuant can be part of an independent continuant; only an immaterial entity can be part of an immaterial entity; only a specifically dependent continuant can be part of a specifically dependent continuant; only a generically dependent continuant can be part of a generically dependent continuant. (This list is not exhaustive.) A continuant cannot be part of an occurrent: use 'participates in'. An occurrent cannot be part of a continuant: use 'has participant'. A material entity cannot be part of an immaterial entity: use 'has location'. A specifically dependent continuant cannot be part of an independent continuant: use 'inheres in'. An independent continuant cannot be part of a specifically dependent continuant: use 'bearer of'.

Axiom
annotated source: part of
annotated property: alternative label
annotated target: part_of

Axiom
annotated source: part of
annotated property: label
annotated target: part of

has part
type: ObjectProperty
sub property of: topObjectProperty
editor preferred term: has part
example of usage: my body has part my brain (continuant parthood, two material entities)
example of usage: my stomach has part my stomach cavity (continuant parthood, material entity has part immaterial entity)
example of usage: this year has part this day (occurrent parthood)
definition: a core relation that holds between a whole and its part
editor note: Everything has itself as a part. Any part of any part of a thing is itself part of that thing. Two distinct things cannot have each other as a part.
editor note: Occurrents are not subject to change and so parthood between occurrents holds for all the times that the part exists. Many continuants are subject to change, so parthood between continuants will only hold at certain times, but this is difficult to specify in OWL. See http://purl.obolibrary.org/obo/ro/docs/temporal-semantics/
editor note: Parthood requires the part and the whole to have compatible classes: only an occurrent have an occurrent as part; only a process can have a process as part; only a continuant can have a continuant as part; only an independent continuant can have an independent continuant as part; only a specifically dependent continuant can have a specifically dependent continuant as part; only a generically dependent continuant can have a generically dependent continuant as part. (This list is not exhaustive.) A continuant cannot have an occurrent as part: use 'participates in'. An occurrent cannot have a continuant as part: use 'has participant'. An immaterial entity cannot have a material entity as part: use 'location of'. An independent continuant cannot have a specifically dependent continuant as part: use 'bearer of'. A specifically dependent continuant cannot have an independent continuant as part: use 'inheres in'.
alternative label: has_part
temporal interpretation: RO_0001901
term tracker annotation: issue https://github.com/OpenEnergyPlatform/ontology/issues/596 Pull request https://github.com/OpenEnergyPlatform/ontology/pull/599 Pull request https://github.com/OpenEnergyPlatform/ontology/pull/603 fix duplicate implementation of `Inverse Of` issue https://github.com/OpenEnergyPlatform/ontology/issues/979 pull request https://github.com/OpenEnergyPlatform/ontology/pull/1086

Axiom
annotated source: has part
annotated property: editor preferred term
annotated target: has part

Axiom
annotated source: has part
annotated property: example of usage
annotated target: my body has part my brain (continuant parthood, two material entities)

Axiom
annotated source: has part
annotated property: example of usage
annotated target: my stomach has part my stomach cavity (continuant parthood, material entity has part immaterial entity)

Axiom
annotated source: has part
annotated property: example of usage
annotated target: this year has part this day (occurrent parthood)

Axiom
annotated source: has part
annotated property: definition
annotated target: a core relation that holds between a whole and its part

Axiom
annotated source: has part
annotated property: editor note
annotated target: Everything has itself as a part. Any part of any part of a thing is itself part of that thing. Two distinct things cannot have each other as a part.

Axiom
annotated source: has part
annotated property: editor note
annotated target: Occurrents are not subject to change and so parthood between occurrents holds for all the times that the part exists. Many continuants are subject to change, so parthood between continuants will only hold at certain times, but this is difficult to specify in OWL. See http://purl.obolibrary.org/obo/ro/docs/temporal-semantics/

Axiom
annotated source: has part
annotated property: editor note
annotated target: Parthood requires the part and the whole to have compatible classes: only an occurrent have an occurrent as part; only a process can have a process as part; only a continuant can have a continuant as part; only an independent continuant can have an independent continuant as part; only a specifically dependent continuant can have a specifically dependent continuant as part; only a generically dependent continuant can have a generically dependent continuant as part. (This list is not exhaustive.) A continuant cannot have an occurrent as part: use 'participates in'. An occurrent cannot have a continuant as part: use 'has participant'. An immaterial entity cannot have a material entity as part: use 'location of'. An independent continuant cannot have a specifically dependent continuant as part: use 'bearer of'. A specifically dependent continuant cannot have an independent continuant as part: use 'inheres in'.

Axiom
annotated source: has part
annotated property: alternative label
annotated target: has_part

Axiom
annotated source: has part
annotated property: label
annotated target: has part

realized in
type: ObjectProperty
sub property of: topObjectProperty
editor preferred term: realized in
example of usage: this disease is realized in this disease course
example of usage: this fragility is realized in this shattering
example of usage: this investigator role is realized in this investigation
alternative label: is realized by
alternative label: realized_in
elucidation: [copied from inverse property 'realizes'] to say that b realizes c at t is to assert that there is some material entity d & b is a process which has participant d at t & c is a disposition or role of which d is bearer_of at t& the type instantiated by b is correlated with the type instantiated by c. (axiom label in BFO2 Reference: [059-003])
comment: Paraphrase of elucidation: a relation between a realizable entity and a process, where there is some material entity that is bearer of the realizable entity and participates in the process, and the realizable entity comes to be realized in the course of the process

Axiom
annotated source: realized in
annotated property: editor preferred term
annotated target: realized in

Axiom
annotated source: realized in
annotated property: example of usage
annotated target: this disease is realized in this disease course

Axiom
annotated source: realized in
annotated property: example of usage
annotated target: this fragility is realized in this shattering

Axiom
annotated source: realized in
annotated property: example of usage
annotated target: this investigator role is realized in this investigation

Axiom
annotated source: realized in
annotated property: alternative label
annotated target: is realized by

Axiom
annotated source: realized in
annotated property: alternative label
annotated target: realized_in

Axiom
annotated source: realized in
annotated property: elucidation
annotated target: [copied from inverse property 'realizes'] to say that b realizes c at t is to assert that there is some material entity d & b is a process which has participant d at t & c is a disposition or role of which d is bearer_of at t& the type instantiated by b is correlated with the type instantiated by c. (axiom label in BFO2 Reference: [059-003])

Axiom
annotated source: realized in
annotated property: comment
annotated target: Paraphrase of elucidation: a relation between a realizable entity and a process, where there is some material entity that is bearer of the realizable entity and participates in the process, and the realizable entity comes to be realized in the course of the process

Axiom
annotated source: realized in
annotated property: label
annotated target: realized in

preceded by
type: ObjectProperty
sub property of: ends after
editor preferred term: preceded by
definition: x is preceded by y if and only if the time point at which y ends is before or equivalent to the time point at which x starts. Formally: x preceded by y iff ω(y) <= α(x), where α is a function that maps a process to a start point, and ω is a function that maps a process to an end point.
editor note: An example is: translation preceded_by transcription; aging preceded_by development (not however death preceded_by aging). Where derives_from links classes of continuants, preceded_by links classes of processes. Clearly, however, these two relations are not independent of each other. Thus if cells of type C1 derive_from cells of type C, then any cell division involving an instance of C1 in a given lineage is preceded_by cellular processes involving an instance of C. The assertion P preceded_by P1 tells us something about Ps in general: that is, it tells us something about what happened earlier, given what we know about what happened later. Thus it does not provide information pointing in the opposite direction, concerning instances of P1 in general; that is, that each is such as to be succeeded by some instance of P. Note that an assertion to the effect that P preceded_by P1 is rather weak; it tells us little about the relations between the underlying instances in virtue of which the preceded_by relation obtains. Typically we will be interested in stronger relations, for example in the relation immediately_preceded_by, or in relations which combine preceded_by with a condition to the effect that the corresponding instances of P and P1 share participants, or that their participants are connected by relations of derivation, or (as a first step along the road to a treatment of causality) that the one process in some way affects (for example, initiates or regulates) the other.
alternative label: is preceded by
alternative label: preceded_by
source: http://www.obofoundry.org/ro/#OBO_REL:preceded_by

Axiom
annotated source: preceded by
annotated property: editor preferred term
annotated target: preceded by

Axiom
annotated source: preceded by
annotated property: definition
annotated target: x is preceded by y if and only if the time point at which y ends is before or equivalent to the time point at which x starts. Formally: x preceded by y iff ω(y) <= α(x), where α is a function that maps a process to a start point, and ω is a function that maps a process to an end point.

Axiom
annotated source: preceded by
annotated property: editor note
annotated target: An example is: translation preceded_by transcription; aging preceded_by development (not however death preceded_by aging). Where derives_from links classes of continuants, preceded_by links classes of processes. Clearly, however, these two relations are not independent of each other. Thus if cells of type C1 derive_from cells of type C, then any cell division involving an instance of C1 in a given lineage is preceded_by cellular processes involving an instance of C. The assertion P preceded_by P1 tells us something about Ps in general: that is, it tells us something about what happened earlier, given what we know about what happened later. Thus it does not provide information pointing in the opposite direction, concerning instances of P1 in general; that is, that each is such as to be succeeded by some instance of P. Note that an assertion to the effect that P preceded_by P1 is rather weak; it tells us little about the relations between the underlying instances in virtue of which the preceded_by relation obtains. Typically we will be interested in stronger relations, for example in the relation immediately_preceded_by, or in relations which combine preceded_by with a condition to the effect that the corresponding instances of P and P1 share participants, or that their participants are connected by relations of derivation, or (as a first step along the road to a treatment of causality) that the one process in some way affects (for example, initiates or regulates) the other.

Axiom
annotated source: preceded by
annotated property: alternative label
annotated target: is preceded by

Axiom
annotated source: preceded by
annotated property: alternative label
annotated target: preceded_by

Axiom
annotated source: preceded by
annotated property: label
annotated target: preceded by

precedes
type: ObjectProperty
sub property of: temporally related to
editor preferred term: precedes
definition: x precedes y if and only if the time point at which x ends is before or equivalent to the time point at which y starts. Formally: x precedes y iff ω(x) <= α(y), where α is a function that maps a process to a start point, and ω is a function that maps a process to an end point.

Axiom
annotated source: precedes
annotated property: editor preferred term
annotated target: precedes

Axiom
annotated source: precedes
annotated property: definition
annotated target: x precedes y if and only if the time point at which x ends is before or equivalent to the time point at which y starts. Formally: x precedes y iff ω(x) <= α(y), where α is a function that maps a process to a start point, and ω is a function that maps a process to an end point.

Axiom
annotated source: precedes
annotated property: label
annotated target: precedes

has occurrent part
type: ObjectProperty
inverse of: occurrent part of
definition: b has occurrent part c =Def c occurrent part of b
example: Mary's life has occurrent part Mary's 5th birthday
term tracker annotation: issue https://github.com/OpenEnergyPlatform/ontology/issues/2014 pull request: https://github.com/OpenEnergyPlatform/ontology/pull/2016

Axiom
annotated source: has occurrent part
annotated property: identifier
annotated target: 202-BFO

Axiom
annotated source: has occurrent part
annotated property: label
annotated target: has occurrent part

Axiom
annotated source: has occurrent part
annotated property: definition
annotated target: b has occurrent part c =Def c occurrent part of b

Axiom
annotated source: has occurrent part
annotated property: example
annotated target: Mary's life has occurrent part Mary's 5th birthday

has temporal part
type: ObjectProperty
sub property of: has occurrent part
inverse of: temporal part of
definition: b has temporal part c =Def c temporal part of b
example: Your life has temporal part the first year of your life
term tracker annotation: issue https://github.com/OpenEnergyPlatform/ontology/issues/2014 pull request: https://github.com/OpenEnergyPlatform/ontology/pull/2016

Axiom
annotated source: has temporal part
annotated property: identifier
annotated target: 211-BFO

Axiom
annotated source: has temporal part
annotated property: label
annotated target: has temporal part

Axiom
annotated source: has temporal part
annotated property: definition
annotated target: b has temporal part c =Def c temporal part of b

Axiom
annotated source: has temporal part
annotated property: example
annotated target: Your life has temporal part the first year of your life

occurrent part of
type: ObjectProperty
definition: (Elucidation) occurrent part of is a relation between occurrents b and c when b is part of c
example: Mary's 5th birthday is an occurrent part of Mary's life; the first set of the tennis match is an occurrent part of the tennis match
term tracker annotation: issue https://github.com/OpenEnergyPlatform/ontology/issues/2014 pull request: https://github.com/OpenEnergyPlatform/ontology/pull/2016

Axiom
annotated source: occurrent part of
annotated property: identifier
annotated target: 003-BFO

Axiom
annotated source: occurrent part of
annotated property: label
annotated target: occurrent part of

Axiom
annotated source: occurrent part of
annotated property: definition
annotated target: (Elucidation) occurrent part of is a relation between occurrents b and c when b is part of c

Axiom
annotated source: occurrent part of
annotated property: example
annotated target: Mary's 5th birthday is an occurrent part of Mary's life; the first set of the tennis match is an occurrent part of the tennis match

temporal part of
type: ObjectProperty
sub property of: occurrent part of
definition: b temporal part of c =Def b occurrent part of c & (b and c are temporal regions) or (b and c are spatiotemporal regions & b temporally projects onto an occurrent part of the temporal region that c temporally projects onto) or (b and c are processes or process boundaries & b occupies a temporal region that is an occurrent part of the temporal region that c occupies)
example: Your heart beating from 4pm to 5pm today is a temporal part of the process of your heart beating; the 4th year of your life is a temporal part of your life, as is the process boundary which separates the 3rd and 4th years of your life; the first quarter of a game of football is a temporal part of the whole game
term tracker annotation: issue https://github.com/OpenEnergyPlatform/ontology/issues/2014 pull request: https://github.com/OpenEnergyPlatform/ontology/pull/2016

Axiom
annotated source: temporal part of
annotated property: identifier
annotated target: 078-BFO

Axiom
annotated source: temporal part of
annotated property: label
annotated target: temporal part of

Axiom
annotated source: temporal part of
annotated property: definition
annotated target: b temporal part of c =Def b occurrent part of c & (b and c are temporal regions) or (b and c are spatiotemporal regions & b temporally projects onto an occurrent part of the temporal region that c temporally projects onto) or (b and c are processes or process boundaries & b occupies a temporal region that is an occurrent part of the temporal region that c occupies)

Axiom
annotated source: temporal part of
annotated property: example
annotated target: Your heart beating from 4pm to 5pm today is a temporal part of the process of your heart beating; the 4th year of your life is a temporal part of your life, as is the process boundary which separates the 3rd and 4th years of your life; the first quarter of a game of football is a temporal part of the whole game

is about
type: ObjectProperty
sub property of: topObjectProperty
inverse of: is subject of
domain: information content entity
example of usage: This document is about information artifacts and their representations
has curation status: IAO_0000125
definition: A (currently) primitive relation that relates an information artifact to an entity.
editor note: 7/6/2009 Alan Ruttenberg. Following discussion with Jonathan Rees, and introduction of "mentions" relation. Weaken the is_about relationship to be primitive. We will try to build it back up by elaborating the various subproperties that are more precisely defined. Some currently missing phenomena that should be considered "about" are predications - "The only person who knows the answer is sitting beside me" , Allegory, Satire, and other literary forms that can be topical without explicitly mentioning the topic.
term editor: person:Alan Ruttenberg
definition source: Smith, Ceusters, Ruttenberg, 2000 years of philosophy

Axiom
annotated source: is about
annotated property: example of usage
annotated target: This document is about information artifacts and their representations

Axiom
annotated source: is about
annotated property: definition
annotated target: A (currently) primitive relation that relates an information artifact to an entity.

Axiom
annotated source: is about
annotated property: editor note
annotated target: 7/6/2009 Alan Ruttenberg. Following discussion with Jonathan Rees, and introduction of "mentions" relation. Weaken the is_about relationship to be primitive. We will try to build it back up by elaborating the various subproperties that are more precisely defined. Some currently missing phenomena that should be considered "about" are predications - "The only person who knows the answer is sitting beside me" , Allegory, Satire, and other literary forms that can be topical without explicitly mentioning the topic.

Axiom
annotated source: is about
annotated property: term editor
annotated target: person:Alan Ruttenberg

Axiom
annotated source: is about
annotated property: definition source
annotated target: Smith, Ceusters, Ruttenberg, 2000 years of philosophy

Axiom
annotated source: is about
annotated property: label
annotated target: is about

has time stamp
type: ObjectProperty
sub property of: has part
domain: time stamped measurement datum
has curation status: IAO_0000123
definition: relates a time stamped measurement datum to the time measurement datum that denotes the time when the measurement was taken
editor note: IAO declared "time measurement datum" as range, which is (not yet) imported by OEO. Therefore the range declaration is missing here.
term editor: Alan Ruttenberg

Axiom
annotated source: has time stamp
annotated property: definition
annotated target: relates a time stamped measurement datum to the time measurement datum that denotes the time when the measurement was taken

Axiom
annotated source: has time stamp
annotated property: term editor
annotated target: Alan Ruttenberg

Axiom
annotated source: has time stamp
annotated property: label
annotated target: has time stamp

characteristic of
type: ObjectProperty
sub property of: characteristic of part of
inverse of: has characteristic
editor preferred term: inheres in
example of usage: this fragility is a characteristic of this vase
example of usage: this red color is a characteristic of this apple
definition: a relation between a specifically dependent continuant (the characteristic) and any other entity (the bearer), in which the characteristic depends on the bearer for its existence.
alternative label: inheres_in
temporal interpretation: RO_0001901
comment: Note that this relation was previously called "inheres in", but was changed to be called "characteristic of" because BFO2 uses "inheres in" in a more restricted fashion. This relation differs from BFO2:inheres_in in two respects: (1) it does not impose a range constraint, and thus it allows qualities of processes, as well as of information entities, whereas BFO2 restricts inheres_in to only apply to independent continuants (2) it is declared functional, i.e. something can only be a characteristic of one thing.
term tracker annotation: add inverse: issue: https://github.com/OpenEnergyPlatform/ontology/issues/1844 pull request: https://github.com/OpenEnergyPlatform/ontology/pull/1852

Axiom
annotated source: characteristic of
annotated property: editor preferred term
annotated target: inheres in

Axiom
annotated source: characteristic of
annotated property: example of usage
annotated target: this fragility is a characteristic of this vase

Axiom
annotated source: characteristic of
annotated property: example of usage
annotated target: this red color is a characteristic of this apple

Axiom
annotated source: characteristic of
annotated property: definition
annotated target: a relation between a specifically dependent continuant (the characteristic) and any other entity (the bearer), in which the characteristic depends on the bearer for its existence.

Axiom
annotated source: characteristic of
annotated property: alternative label
annotated target: inheres_in

Axiom
annotated source: characteristic of
annotated property: comment
annotated target: Note that this relation was previously called "inheres in", but was changed to be called "characteristic of" because BFO2 uses "inheres in" in a more restricted fashion. This relation differs from BFO2:inheres_in in two respects: (1) it does not impose a range constraint, and thus it allows qualities of processes, as well as of information entities, whereas BFO2 restricts inheres_in to only apply to independent continuants (2) it is declared functional, i.e. something can only be a characteristic of one thing.

Axiom
annotated source: characteristic of
annotated property: label
annotated target: characteristic of

has characteristic
type: ObjectProperty
range: specifically dependent continuant
editor preferred term: bearer of
example of usage: this apple is bearer of this red color
example of usage: this vase is bearer of this fragility
definition: Inverse of characteristic_of
editor note: A bearer can have many dependents, and its dependents can exist for different periods of time, but none of its dependents can exist when the bearer does not exist.
alternative label: bearer_of
alternative label: has characteristic
alternative label: is bearer of
temporal interpretation: RO_0001901
term tracker annotation: update inverse: issue: https://github.com/OpenEnergyPlatform/ontology/issues/1844 pull request: https://github.com/OpenEnergyPlatform/ontology/pull/1852

Axiom
annotated source: has characteristic
annotated property: editor preferred term
annotated target: bearer of

Axiom
annotated source: has characteristic
annotated property: example of usage
annotated target: this apple is bearer of this red color

Axiom
annotated source: has characteristic
annotated property: example of usage
annotated target: this vase is bearer of this fragility

Axiom
annotated source: has characteristic
annotated property: definition
annotated target: Inverse of characteristic_of

Axiom
annotated source: has characteristic
annotated property: editor note
annotated target: A bearer can have many dependents, and its dependents can exist for different periods of time, but none of its dependents can exist when the bearer does not exist.

Axiom
annotated source: has characteristic
annotated property: alternative label
annotated target: bearer_of

Axiom
annotated source: has characteristic
annotated property: alternative label
annotated target: is bearer of

Axiom
annotated source: has characteristic
annotated property: label
annotated target: has characteristic

participates in
type: ObjectProperty
sub property of: topObjectProperty
inverse of: has participant
domain: continuant
range: occurrent
editor preferred term: participates in
example of usage: this blood clot participates in this blood coagulation
example of usage: this input material (or this output material) participates in this process
example of usage: this investigator participates in this investigation
definition: a relation between a continuant and a process, in which the continuant is somehow involved in the process
alternative label: participates_in
term tracker annotation: make inverse of has participant issue https://github.com/OpenEnergyPlatform/ontology/issues/979 pull request https://github.com/OpenEnergyPlatform/ontology/pull/1086

Axiom
annotated source: participates in
annotated property: editor preferred term
annotated target: participates in

Axiom
annotated source: participates in
annotated property: example of usage
annotated target: this blood clot participates in this blood coagulation

Axiom
annotated source: participates in
annotated property: example of usage
annotated target: this input material (or this output material) participates in this process

Axiom
annotated source: participates in
annotated property: example of usage
annotated target: this investigator participates in this investigation

Axiom
annotated source: participates in
annotated property: definition
annotated target: a relation between a continuant and a process, in which the continuant is somehow involved in the process

Axiom
annotated source: participates in
annotated property: alternative label
annotated target: participates_in

Axiom
annotated source: participates in
annotated property: label
annotated target: participates in

has participant
type: ObjectProperty
sub property of: topObjectProperty
domain: occurrent
range: continuant
editor preferred term: has participant
example of usage: this blood coagulation has participant this blood clot
example of usage: this investigation has participant this investigator
example of usage: this process has participant this input material (or this output material)
definition: a relation between a process and a continuant, in which the continuant is somehow involved in the process
editor note: Has_participant is a primitive instance-level relation between a process, a continuant, and a time at which the continuant participates in some way in the process. The relation obtains, for example, when this particular process of oxygen exchange across this particular alveolar membrane has_participant this particular sample of hemoglobin at this particular time.
alternative label: has_participant
source: http://www.obofoundry.org/ro/#OBO_REL:has_participant
term tracker annotation: make inverse of participates in issue https://github.com/OpenEnergyPlatform/ontology/issues/979 pull request https://github.com/OpenEnergyPlatform/ontology/pull/1086 Add range axiom for `has participant` issue: https://github.com/OpenEnergyPlatform/ontology/issues/1157 pull request: https://github.com/OpenEnergyPlatform/ontology/pull/1225

Axiom
annotated source: has participant
annotated property: editor preferred term
annotated target: has participant

Axiom
annotated source: has participant
annotated property: example of usage
annotated target: this blood coagulation has participant this blood clot

Axiom
annotated source: has participant
annotated property: example of usage
annotated target: this investigation has participant this investigator

Axiom
annotated source: has participant
annotated property: example of usage
annotated target: this process has participant this input material (or this output material)

Axiom
annotated source: has participant
annotated property: definition
annotated target: a relation between a process and a continuant, in which the continuant is somehow involved in the process

Axiom
annotated source: has participant
annotated property: editor note
annotated target: Has_participant is a primitive instance-level relation between a process, a continuant, and a time at which the continuant participates in some way in the process. The relation obtains, for example, when this particular process of oxygen exchange across this particular alveolar membrane has_participant this particular sample of hemoglobin at this particular time.

Axiom
annotated source: has participant
annotated property: alternative label
annotated target: has_participant

Axiom
annotated source: has participant
annotated property: label
annotated target: has participant

function of
type: ObjectProperty
sub property of: characteristic of
example of usage: this catalysis function is a function of this enzyme
definition: a relation between a function and an independent continuant (the bearer), in which the function specifically depends on the bearer for its existence
editor note: A function inheres in its bearer at all times for which the function exists, however the function need not be realized at all the times that the function exists.
alternative label: function_of
alternative label: is function of
comment: This relation is modeled after the BFO relation of the same name which was in BFO2, but is used in a more restricted sense - specifically, we model this relation as functional (inherited from characteristic-of). Note that this relation is now removed from BFO2020.

Axiom
annotated source: function of
annotated property: example of usage
annotated target: this catalysis function is a function of this enzyme

Axiom
annotated source: function of
annotated property: definition
annotated target: a relation between a function and an independent continuant (the bearer), in which the function specifically depends on the bearer for its existence

Axiom
annotated source: function of
annotated property: editor note
annotated target: A function inheres in its bearer at all times for which the function exists, however the function need not be realized at all the times that the function exists.

Axiom
annotated source: function of
annotated property: alternative label
annotated target: function_of

Axiom
annotated source: function of
annotated property: alternative label
annotated target: is function of

Axiom
annotated source: function of
annotated property: comment
annotated target: This relation is modeled after the BFO relation of the same name which was in BFO2, but is used in a more restricted sense - specifically, we model this relation as functional (inherited from characteristic-of). Note that this relation is now removed from BFO2020.

Axiom
annotated source: function of
annotated property: label
annotated target: function of

quality of
type: ObjectProperty
sub property of: characteristic of
example of usage: this red color is a quality of this apple
definition: a relation between a quality and an independent continuant (the bearer), in which the quality specifically depends on the bearer for its existence
editor note: A quality inheres in its bearer at all times for which the quality exists.
alternative label: is quality of
alternative label: quality_of
comment: This relation is modeled after the BFO relation of the same name which was in BFO2, but is used in a more restricted sense - specifically, we model this relation as functional (inherited from characteristic-of). Note that this relation is now removed from BFO2020.

Axiom
annotated source: quality of
annotated property: example of usage
annotated target: this red color is a quality of this apple

Axiom
annotated source: quality of
annotated property: definition
annotated target: a relation between a quality and an independent continuant (the bearer), in which the quality specifically depends on the bearer for its existence

Axiom
annotated source: quality of
annotated property: editor note
annotated target: A quality inheres in its bearer at all times for which the quality exists.

Axiom
annotated source: quality of
annotated property: alternative label
annotated target: is quality of

Axiom
annotated source: quality of
annotated property: alternative label
annotated target: quality_of

Axiom
annotated source: quality of
annotated property: comment
annotated target: This relation is modeled after the BFO relation of the same name which was in BFO2, but is used in a more restricted sense - specifically, we model this relation as functional (inherited from characteristic-of). Note that this relation is now removed from BFO2020.

Axiom
annotated source: quality of
annotated property: label
annotated target: quality of

role of
type: ObjectProperty
sub property of: characteristic of
inverse of: has role
domain: role
range: continuant
example of usage: this investigator role is a role of this person
definition: a relation between a role and an independent continuant (the bearer), in which the role specifically depends on the bearer for its existence
editor note: A role inheres in its bearer at all times for which the role exists, however the role need not be realized at all the times that the role exists.
alternative label: is role of
alternative label: role_of
comment: This relation is modeled after the BFO relation of the same name which was in BFO2, but is used in a more restricted sense - specifically, we model this relation as functional (inherited from characteristic-of). Note that this relation is now removed from BFO2020.
term tracker annotation: add domain and range: issue: https://github.com/OpenEnergyPlatform/ontology/issues/1844 pull request: https://github.com/OpenEnergyPlatform/ontology/pull/1852

Axiom
annotated source: role of
annotated property: example of usage
annotated target: this investigator role is a role of this person

Axiom
annotated source: role of
annotated property: definition
annotated target: a relation between a role and an independent continuant (the bearer), in which the role specifically depends on the bearer for its existence

Axiom
annotated source: role of
annotated property: editor note
annotated target: A role inheres in its bearer at all times for which the role exists, however the role need not be realized at all the times that the role exists.

Axiom
annotated source: role of
annotated property: alternative label
annotated target: is role of

Axiom
annotated source: role of
annotated property: alternative label
annotated target: role_of

Axiom
annotated source: role of
annotated property: comment
annotated target: This relation is modeled after the BFO relation of the same name which was in BFO2, but is used in a more restricted sense - specifically, we model this relation as functional (inherited from characteristic-of). Note that this relation is now removed from BFO2020.

Axiom
annotated source: role of
annotated property: label
annotated target: role of

has function
type: ObjectProperty
sub property of: has characteristic
domain: independent continuant
range: function
example of usage: this enzyme has function this catalysis function (more colloquially: this enzyme has this catalysis function)
definition: a relation between an independent continuant (the bearer) and a function, in which the function specifically depends on the bearer for its existence
editor note: A bearer can have many functions, and its functions can exist for different periods of time, but none of its functions can exist when the bearer does not exist. A function need not be realized at all the times that the function exists.
alternative label: has_function

Axiom
annotated source: has function
annotated property: example of usage
annotated target: this enzyme has function this catalysis function (more colloquially: this enzyme has this catalysis function)

Axiom
annotated source: has function
annotated property: definition
annotated target: a relation between an independent continuant (the bearer) and a function, in which the function specifically depends on the bearer for its existence

Axiom
annotated source: has function
annotated property: editor note
annotated target: A bearer can have many functions, and its functions can exist for different periods of time, but none of its functions can exist when the bearer does not exist. A function need not be realized at all the times that the function exists.

Axiom
annotated source: has function
annotated property: alternative label
annotated target: has_function

Axiom
annotated source: has function
annotated property: label
annotated target: has function

has quality
type: ObjectProperty
sub property of: has characteristic
domain: continuant
range: quality
example of usage: this apple has quality this red color
definition: a relation between an independent continuant (the bearer) and a quality, in which the quality specifically depends on the bearer for its existence
editor note: A bearer can have many qualities, and its qualities can exist for different periods of time, but none of its qualities can exist when the bearer does not exist.
alternative label: has_quality

Axiom
annotated source: has quality
annotated property: example of usage
annotated target: this apple has quality this red color

Axiom
annotated source: has quality
annotated property: definition
annotated target: a relation between an independent continuant (the bearer) and a quality, in which the quality specifically depends on the bearer for its existence

Axiom
annotated source: has quality
annotated property: editor note
annotated target: A bearer can have many qualities, and its qualities can exist for different periods of time, but none of its qualities can exist when the bearer does not exist.

Axiom
annotated source: has quality
annotated property: alternative label
annotated target: has_quality

Axiom
annotated source: has quality
annotated property: label
annotated target: has quality

has role
type: ObjectProperty
sub property of: has characteristic
range: role
example of usage: this person has role this investigator role (more colloquially: this person has this role of investigator)
definition: a relation between an independent continuant (the bearer) and a role, in which the role specifically depends on the bearer for its existence
editor note: A bearer can have many roles, and its roles can exist for different periods of time, but none of its roles can exist when the bearer does not exist. A role need not be realized at all the times that the role exists.
editor note: In contrast to the original RO class, the domain was extended to independent continuant or energy. This is due to the special role that energy plays for the OEO and the difficulty of classifying it properly.
alternative label: has_role
term tracker annotation: extend domain / definition issue: https://github.com/OpenEnergyPlatform/ontology/issues/1030 pull request: https://github.com/OpenEnergyPlatform/ontology/pull/1101

Axiom
annotated source: has role
annotated property: example of usage
annotated target: this person has role this investigator role (more colloquially: this person has this role of investigator)

Axiom
annotated source: has role
annotated property: definition
annotated target: a relation between an independent continuant (the bearer) and a role, in which the role specifically depends on the bearer for its existence

Axiom
annotated source: has role
annotated property: editor note
annotated target: A bearer can have many roles, and its roles can exist for different periods of time, but none of its roles can exist when the bearer does not exist. A role need not be realized at all the times that the role exists.

Axiom
annotated source: has role
annotated property: alternative label
annotated target: has_role

Axiom
annotated source: has role
annotated property: label
annotated target: has role

has disposition
type: ObjectProperty
sub property of: has characteristic
domain: independent continuant
range: disposition
definition: a relation between an independent continuant (the bearer) and a disposition, in which the disposition specifically depends on the bearer for its existence

Axiom
annotated source: has disposition
annotated property: definition
annotated target: a relation between an independent continuant (the bearer) and a disposition, in which the disposition specifically depends on the bearer for its existence

Axiom
annotated source: has disposition
annotated property: label
annotated target: has disposition

disposition of
type: ObjectProperty
sub property of: characteristic of
definition: inverse of has disposition
comment: This relation is modeled after the BFO relation of the same name which was in BFO2, but is used in a more restricted sense - specifically, we model this relation as functional (inherited from characteristic-of). Note that this relation is now removed from BFO2020.

Axiom
annotated source: disposition of
annotated property: definition
annotated target: inverse of has disposition

Axiom
annotated source: disposition of
annotated property: comment
annotated target: This relation is modeled after the BFO relation of the same name which was in BFO2, but is used in a more restricted sense - specifically, we model this relation as functional (inherited from characteristic-of). Note that this relation is now removed from BFO2020.

Axiom
annotated source: disposition of
annotated property: label
annotated target: disposition of

location of
type: ObjectProperty
sub property of: topObjectProperty
inverse of: located in
editor preferred term: is location of
example of usage: my head is the location of my brain
example of usage: this cage is the location of this rat
definition: a relation between two independent continuants, the location and the target, in which the target is entirely within the location
editor note: Most location relations will only hold at certain times, but this is difficult to specify in OWL. See http://purl.obolibrary.org/obo/ro/docs/temporal-semantics/
alternative label: location_of
temporal interpretation: RO_0001901
term tracker annotation: add `Inverse Of` issue https://github.com/OpenEnergyPlatform/ontology/issues/979 pull request https://github.com/OpenEnergyPlatform/ontology/pull/1086

Axiom
annotated source: location of
annotated property: editor preferred term
annotated target: is location of

Axiom
annotated source: location of
annotated property: example of usage
annotated target: my head is the location of my brain

Axiom
annotated source: location of
annotated property: example of usage
annotated target: this cage is the location of this rat

Axiom
annotated source: location of
annotated property: definition
annotated target: a relation between two independent continuants, the location and the target, in which the target is entirely within the location

Axiom
annotated source: location of
annotated property: editor note
annotated target: Most location relations will only hold at certain times, but this is difficult to specify in OWL. See http://purl.obolibrary.org/obo/ro/docs/temporal-semantics/

Axiom
annotated source: location of
annotated property: alternative label
annotated target: location_of

Axiom
annotated source: location of
annotated property: label
annotated target: location of

located in
type: ObjectProperty
sub property of: topObjectProperty
domain: independent continuant
range: independent continuant
editor preferred term: located in
example of usage: my brain is located in my head
example of usage: this rat is located in this cage
definition: a relation between two independent continuants, the target and the location, in which the target is entirely within the location
editor note: Location as a relation between instances: The primitive instance-level relation c located_in r at t reflects the fact that each continuant is at any given time associated with exactly one spatial region, namely its exact location. Following we can use this relation to define a further instance-level location relation - not between a continuant and the region which it exactly occupies, but rather between one continuant and another. c is located in c1, in this sense, whenever the spatial region occupied by c is part_of the spatial region occupied by c1. Note that this relation comprehends both the relation of exact location between one continuant and another which obtains when r and r1 are identical (for example, when a portion of fluid exactly fills a cavity), as well as those sorts of inexact location relations which obtain, for example, between brain and head or between ovum and uterus
editor note: Most location relations will only hold at certain times, but this is difficult to specify in OWL. See http://purl.obolibrary.org/obo/ro/docs/temporal-semantics/
alternative label: located_in
temporal interpretation: RO_0001901
source: http://www.obofoundry.org/ro/#OBO_REL:located_in
term tracker annotation: add `Inverse Of` issue https://github.com/OpenEnergyPlatform/ontology/issues/979 pull request https://github.com/OpenEnergyPlatform/ontology/pull/1086

Axiom
annotated source: located in
annotated property: editor preferred term
annotated target: located in

Axiom
annotated source: located in
annotated property: example of usage
annotated target: my brain is located in my head

Axiom
annotated source: located in
annotated property: example of usage
annotated target: this rat is located in this cage

Axiom
annotated source: located in
annotated property: definition
annotated target: a relation between two independent continuants, the target and the location, in which the target is entirely within the location

Axiom
annotated source: located in
annotated property: editor note
annotated target: Location as a relation between instances: The primitive instance-level relation c located_in r at t reflects the fact that each continuant is at any given time associated with exactly one spatial region, namely its exact location. Following we can use this relation to define a further instance-level location relation - not between a continuant and the region which it exactly occupies, but rather between one continuant and another. c is located in c1, in this sense, whenever the spatial region occupied by c is part_of the spatial region occupied by c1. Note that this relation comprehends both the relation of exact location between one continuant and another which obtains when r and r1 are identical (for example, when a portion of fluid exactly fills a cavity), as well as those sorts of inexact location relations which obtain, for example, between brain and head or between ovum and uterus

Axiom
annotated source: located in
annotated property: editor note
annotated target: Most location relations will only hold at certain times, but this is difficult to specify in OWL. See http://purl.obolibrary.org/obo/ro/docs/temporal-semantics/

Axiom
annotated source: located in
annotated property: alternative label
annotated target: located_in

Axiom
annotated source: located in
annotated property: label
annotated target: located in

before or simultaneous with
type: ObjectProperty
sub property of: temporally related to
term editor: David Osumi-Sutherland
alternative label: <=
comment: Primitive instance level timing relation between events

Axiom
annotated source: before or simultaneous with
annotated property: term editor
annotated target: David Osumi-Sutherland

Axiom
annotated source: before or simultaneous with
annotated property: alternative label
annotated target: <=

Axiom
annotated source: before or simultaneous with
annotated property: comment
annotated target: Primitive instance level timing relation between events

Axiom
annotated source: before or simultaneous with
annotated property: label
annotated target: before or simultaneous with

simultaneous with
type: ObjectProperty
sub property of: before or simultaneous with
term editor: https://orcid.org/0000-0002-7073-9172
term editor: David Osumi-Sutherland
comment: t1 simultaneous_with t2 iff:= t1 before_or_simultaneous_with t2 and not (t1 before t2)

Axiom
annotated source: simultaneous with
annotated property: term editor
annotated target: David Osumi-Sutherland

Axiom
annotated source: simultaneous with
annotated property: comment
annotated target: t1 simultaneous_with t2 iff:= t1 before_or_simultaneous_with t2 and not (t1 before t2)

Axiom
annotated source: simultaneous with
annotated property: label
annotated target: simultaneous with

before
type: ObjectProperty
sub property of: before or simultaneous with
term editor: David Osumi-Sutherland
comment: t1 before t2 iff:= t1 before_or_simulataneous_with t2 and not (t1 simultaeous_with t2)

Axiom
annotated source: before
annotated property: term editor
annotated target: David Osumi-Sutherland

Axiom
annotated source: before
annotated property: comment
annotated target: t1 before t2 iff:= t1 before_or_simulataneous_with t2 and not (t1 simultaeous_with t2)

Axiom
annotated source: before
annotated property: label
annotated target: before

ends after
type: ObjectProperty
sub property of: temporally related to
term editor: David Osumi-Sutherland
comment: X ends_after Y iff: end(Y) before_or_simultaneous_with end(X)

Axiom
annotated source: ends after
annotated property: term editor
annotated target: David Osumi-Sutherland

Axiom
annotated source: ends after
annotated property: comment
annotated target: X ends_after Y iff: end(Y) before_or_simultaneous_with end(X)

Axiom
annotated source: ends after
annotated property: label
annotated target: ends after

starts before
type: ObjectProperty
sub property of: temporally related to
term editor: David Osumi-Sutherland

Axiom
annotated source: starts before
annotated property: term editor
annotated target: David Osumi-Sutherland

Axiom
annotated source: starts before
annotated property: label
annotated target: starts before

starts during
type: ObjectProperty
sub property of: temporally related to
term editor: David Osumi-Sutherland
alternative label: io
comment: X starts_during Y iff: (start(Y) before_or_simultaneous_with start(X)) AND (start(X) before_or_simultaneous_with end(Y))

Axiom
annotated source: starts during
annotated property: term editor
annotated target: David Osumi-Sutherland

Axiom
annotated source: starts during
annotated property: alternative label
annotated target: io

Axiom
annotated source: starts during
annotated property: comment
annotated target: X starts_during Y iff: (start(Y) before_or_simultaneous_with start(X)) AND (start(X) before_or_simultaneous_with end(Y))

Axiom
annotated source: starts during
annotated property: label
annotated target: starts during

happens during
type: ObjectProperty
sub property of: starts during
sub property of: ends during
term editor: David Osumi-Sutherland
alternative label: d
alternative label: during
comment: X happens_during Y iff: (start(Y) before_or_simultaneous_with start(X)) AND (end(X) before_or_simultaneous_with end(Y))

Axiom
annotated source: happens during
annotated property: term editor
annotated target: David Osumi-Sutherland

Axiom
annotated source: happens during
annotated property: alternative label
annotated target: d

Axiom
annotated source: happens during
annotated property: alternative label
annotated target: during

Axiom
annotated source: happens during
annotated property: comment
annotated target: X happens_during Y iff: (start(Y) before_or_simultaneous_with start(X)) AND (end(X) before_or_simultaneous_with end(Y))

Axiom
annotated source: happens during
annotated property: label
annotated target: happens during

ends during
type: ObjectProperty
sub property of: temporally related to
term editor: David Osumi-Sutherland
alternative label: o
alternative label: overlaps
comment: X ends_during Y iff: ((start(Y) before_or_simultaneous_with end(X)) AND end(X) before_or_simultaneous_with end(Y).

Axiom
annotated source: ends during
annotated property: term editor
annotated target: David Osumi-Sutherland

Axiom
annotated source: ends during
annotated property: alternative label
annotated target: o

Axiom
annotated source: ends during
annotated property: alternative label
annotated target: overlaps

Axiom
annotated source: ends during
annotated property: comment
annotated target: X ends_during Y iff: ((start(Y) before_or_simultaneous_with end(X)) AND end(X) before_or_simultaneous_with end(Y).

Axiom
annotated source: ends during
annotated property: label
annotated target: ends during

temporally related to
type: ObjectProperty
sub property of: topObjectProperty
domain: occurrent
range: occurrent
has curation status: IAO_0000125
term editor: https://orcid.org/0000-0002-6601-2165
definition source: Allen's interval algebra
curator note: Do not use this relation directly. It is ended as a grouping for relations between occurrents involving the relative timing of their starts and ends.
source: https://docs.google.com/document/d/1kBv1ep_9g3sTR-SD3jqzFqhuwo9TPNF-l-9fUDbO6rM/edit
comment: A relation that holds between two occurrents. This is a grouping relation that collects together all the Allen relations.

Axiom
annotated source: temporally related to
annotated property: curator note
annotated target: Do not use this relation directly. It is ended as a grouping for relations between occurrents involving the relative timing of their starts and ends.

Axiom
annotated source: temporally related to
annotated property: comment
annotated target: A relation that holds between two occurrents. This is a grouping relation that collects together all the Allen relations.

Axiom
annotated source: temporally related to
annotated property: label
annotated target: temporally related to

starts
type: ObjectProperty
sub property of: topObjectProperty
inverse of: starts with
has curation status: IAO_0000125
definition: inverse of starts with
term editor: https://orcid.org/0000-0002-6601-2165
term editor: Chris Mungall
definition source: Allen
term tracker annotation: add `Inverse Of` issue https://github.com/OpenEnergyPlatform/ontology/issues/979 pull request https://github.com/OpenEnergyPlatform/ontology/pull/1086

Axiom
annotated source: starts
annotated property: definition
annotated target: inverse of starts with

Axiom
annotated source: starts
annotated property: term editor
annotated target: Chris Mungall

Axiom
annotated source: starts
annotated property: definition source
annotated target: Allen

Axiom
annotated source: starts
annotated property: label
annotated target: starts

starts with
type: ObjectProperty
sub property of: topObjectProperty
example of usage: Every insulin receptor signaling pathway starts with the binding of a ligand to the insulin receptor
has curation status: IAO_0000125
definition: x starts with y if and only if x has part y and the time point at which x starts is equivalent to the time point at which y starts. Formally: α(y) = α(x) ∧ ω(y) < ω(x), where α is a function that maps a process to a start point, and ω is a function that maps a process to an end point.
term editor: https://orcid.org/0000-0002-6601-2165
term editor: Chris Mungall
alternative label: started by
term tracker annotation: add `Inverse Of` issue https://github.com/OpenEnergyPlatform/ontology/issues/979 pull request https://github.com/OpenEnergyPlatform/ontology/pull/1086

Axiom
annotated source: starts with
annotated property: example of usage
annotated target: Every insulin receptor signaling pathway starts with the binding of a ligand to the insulin receptor

Axiom
annotated source: starts with
annotated property: definition
annotated target: x starts with y if and only if x has part y and the time point at which x starts is equivalent to the time point at which y starts. Formally: α(y) = α(x) ∧ ω(y) < ω(x), where α is a function that maps a process to a start point, and ω is a function that maps a process to an end point.

Axiom
annotated source: starts with
annotated property: term editor
annotated target: Chris Mungall

Axiom
annotated source: starts with
annotated property: alternative label
annotated target: started by

Axiom
annotated source: starts with
annotated property: label
annotated target: starts with

ends
type: ObjectProperty
sub property of: topObjectProperty
inverse of: ends with
has curation status: IAO_0000125
definition: inverse of ends with
term editor: https://orcid.org/0000-0002-6601-2165
term editor: Chris Mungall
term tracker annotation: add `Inverse Of` issue https://github.com/OpenEnergyPlatform/ontology/issues/979 pull request https://github.com/OpenEnergyPlatform/ontology/pull/1086

Axiom
annotated source: ends
annotated property: definition
annotated target: inverse of ends with

Axiom
annotated source: ends
annotated property: term editor
annotated target: Chris Mungall

Axiom
annotated source: ends
annotated property: label
annotated target: ends

ends with
type: ObjectProperty
sub property of: topObjectProperty
has curation status: IAO_0000125
definition: x ends with y if and only if x has part y and the time point at which x ends is equivalent to the time point at which y ends. Formally: α(y) > α(x) ∧ ω(y) = ω(x), where α is a function that maps a process to a start point, and ω is a function that maps a process to an end point.
term editor: https://orcid.org/0000-0002-6601-2165
term editor: Chris Mungall
alternative label: finished by
term tracker annotation: add `Inverse Of` issue https://github.com/OpenEnergyPlatform/ontology/issues/979 pull request https://github.com/OpenEnergyPlatform/ontology/pull/1086

Axiom
annotated source: ends with
annotated property: definition
annotated target: x ends with y if and only if x has part y and the time point at which x ends is equivalent to the time point at which y ends. Formally: α(y) > α(x) ∧ ω(y) = ω(x), where α is a function that maps a process to a start point, and ω is a function that maps a process to an end point.

Axiom
annotated source: ends with
annotated property: term editor
annotated target: Chris Mungall

Axiom
annotated source: ends with
annotated property: alternative label
annotated target: finished by

Axiom
annotated source: ends with
annotated property: label
annotated target: ends with

has input
type: ObjectProperty
sub property of: has participant
inverse of: input of
domain: process
has curation status: IAO_0000125
definition: p has input c iff: p is a process, c is a material entity, c is a participant in p, c is present at the start of p, and the state of c is modified during p.
term editor: https://orcid.org/0000-0002-6601-2165
alternative label: consumes
comment: OEO adjustment: The range of this property has been changed from material entity to continuant. A subclass "has physical input" has been added for material entities and energies.
term tracker annotation: issue: https://github.com/OpenEnergyPlatform/ontology/issues/664 pull request: https://github.com/OpenEnergyPlatform/ontology/pull/702

Axiom
annotated source: has input
annotated property: definition
annotated target: p has input c iff: p is a process, c is a material entity, c is a participant in p, c is present at the start of p, and the state of c is modified during p.

Axiom
annotated source: has input
annotated property: alternative label
annotated target: consumes

Axiom
annotated source: has input
annotated property: label
annotated target: has input

has output
type: ObjectProperty
sub property of: has participant
inverse of: output of
has curation status: IAO_0000125
definition: p has output c iff c is a participant in p, c is present at the end of p, and c is not present in the same state at the beginning of p.
term editor: https://orcid.org/0000-0002-6601-2165
alternative label: produces
term tracker annotation: add inverse issue https://github.com/OpenEnergyPlatform/ontology/issues/979 pull request https://github.com/OpenEnergyPlatform/ontology/pull/1086

Axiom
annotated source: has output
annotated property: definition
annotated target: p has output c iff c is a participant in p, c is present at the end of p, and c is not present in the same state at the beginning of p.

Axiom
annotated source: has output
annotated property: alternative label
annotated target: produces

Axiom
annotated source: has output
annotated property: label
annotated target: has output

characteristic of part of
type: ObjectProperty
sub property of: depends on
definition: q characteristic of part of w if and only if there exists some p such that q inheres in p and p part of w.
editor note: Because part_of is transitive, inheres in is a sub-relation of characteristic of part of
term editor: https://orcid.org/0000-0002-6601-2165
alternative label: inheres in part of
definition source: http://www.ncbi.nlm.nih.gov/pubmed/20064205
temporal interpretation: RO_0001901

Axiom
annotated source: characteristic of part of
annotated property: definition
annotated target: q characteristic of part of w if and only if there exists some p such that q inheres in p and p part of w.

Axiom
annotated source: characteristic of part of
annotated property: editor note
annotated target: Because part_of is transitive, inheres in is a sub-relation of characteristic of part of

Axiom
annotated source: characteristic of part of
annotated property: alternative label
annotated target: inheres in part of

Axiom
annotated source: characteristic of part of
annotated property: label
annotated target: characteristic of part of

functionally related to
type: ObjectProperty
sub property of: topObjectProperty
definition: A grouping relationship for any relationship directly involving a function, or that holds because of a function of one of the related entities.
term editor: https://orcid.org/0000-0002-6601-2165
curator note: This is a grouping relation that collects relations used for the purpose of connecting structure and function

Axiom
annotated source: functionally related to
annotated property: definition
annotated target: A grouping relationship for any relationship directly involving a function, or that holds because of a function of one of the related entities.

Axiom
annotated source: functionally related to
annotated property: curator note
annotated target: This is a grouping relation that collects relations used for the purpose of connecting structure and function

Axiom
annotated source: functionally related to
annotated property: label
annotated target: functionally related to

input of
type: ObjectProperty
sub property of: participates in
sub property of: functionally related to
definition: inverse of has input
term editor: https://orcid.org/0000-0002-6601-2165

Axiom
annotated source: input of
annotated property: definition
annotated target: inverse of has input

Axiom
annotated source: input of
annotated property: label
annotated target: input of

output of
type: ObjectProperty
sub property of: participates in
sub property of: functionally related to
definition: inverse of has output
term editor: https://orcid.org/0000-0002-6601-2165
term tracker annotation: add inverse issue https://github.com/OpenEnergyPlatform/ontology/issues/979 pull request https://github.com/OpenEnergyPlatform/ontology/pull/1086

Axiom
annotated source: output of
annotated property: definition
annotated target: inverse of has output

Axiom
annotated source: output of
annotated property: label
annotated target: output of

causally related to
type: ObjectProperty
sub property of: topObjectProperty
definition: relation that links two events, processes, states, or objects such that one event, process, state, or object (a cause) contributes to the production of another event, process, state, or object (an effect) where the cause is partly or wholly responsible for the effect, and the effect is partly or wholly dependent on the cause.
editor note: This branch of the ontology deals with causal relations between entities. It is divided into two branches: causal relations between occurrents/processes, and causal relations between material entities. We take an 'activity flow-centric approach', with the former as primary, and define causal relations between material entities in terms of causal relations between occurrents. To define causal relations in an activity-flow type network, we make use of 3 primitives: * Temporal: how do the intervals of the two occurrents relate? * Is the causal relation regulatory? * Is the influence positive or negative? The first of these can be formalized in terms of the Allen Interval Algebra. Informally, the 3 bins we care about are 'direct', 'indirect' or overlapping. Note that all causal relations should be classified under a RO temporal relation (see the branch under 'temporally related to'). Note that all causal relations are temporal, but not all temporal relations are causal. Two occurrents can be related in time without being causally connected. We take causal influence to be primitive, elucidated as being such that has the upstream changed, some qualities of the donwstream would necessarily be modified. For the second, we consider a relationship to be regulatory if the system in which the activities occur is capable of altering the relationship to achieve some objective. This could include changing the rate of production of a molecule. For the third, we consider the effect of the upstream process on the output(s) of the downstream process. If the level of output is increased, or the rate of production of the output is increased, then the direction is increased. Direction can be positive, negative or neutral or capable of either direction. Two positives in succession yield a positive, two negatives in succession yield a positive, otherwise the default assumption is that the net effect is canceled and the influence is neutral. Each of these 3 primitives can be composed to yie…
term editor: https://orcid.org/0000-0002-6601-2165
curator note: Do not use this relation directly. It is intended as a grouping for a diverse set of relations, all involving cause and effect.
term tracker annotation: Removed class expression (process or 'material entity') both as domain and as range issue: https://github.com/OpenEnergyPlatform/ontology/issues/2103 pull request: https://github.com/OpenEnergyPlatform/ontology/pull/2104

Axiom
annotated source: causally related to
annotated property: definition
annotated target: relation that links two events, processes, states, or objects such that one event, process, state, or object (a cause) contributes to the production of another event, process, state, or object (an effect) where the cause is partly or wholly responsible for the effect, and the effect is partly or wholly dependent on the cause.
has db xref: https://en.wikipedia.org/wiki/Causality

Axiom
annotated source: causally related to
annotated property: editor note
annotated target: This branch of the ontology deals with causal relations between entities. It is divided into two branches: causal relations between occurrents/processes, and causal relations between material entities. We take an 'activity flow-centric approach', with the former as primary, and define causal relations between material entities in terms of causal relations between occurrents. To define causal relations in an activity-flow type network, we make use of 3 primitives: * Temporal: how do the intervals of the two occurrents relate? * Is the causal relation regulatory? * Is the influence positive or negative? The first of these can be formalized in terms of the Allen Interval Algebra. Informally, the 3 bins we care about are 'direct', 'indirect' or overlapping. Note that all causal relations should be classified under a RO temporal relation (see the branch under 'temporally related to'). Note that all causal relations are temporal, but not all temporal relations are causal. Two occurrents can be related in time without being causally connected. We take causal influence to be primitive, elucidated as being such that has the upstream changed, some qualities of the donwstream would necessarily be modified. For the second, we consider a relationship to be regulatory if the system in which the activities occur is capable of altering the relationship to achieve some objective. This could include changing the rate of production of a molecule. For the third, we consider the effect of the upstream process on the output(s) of the downstream process. If the level of output is increased, or the rate of production of the output is increased, then the direction is increased. Direction can be positive, negative or neutral or capable of either direction. Two positives in succession yield a positive, two negatives in succession yield a positive, otherwise the default assumption is that the net effect is canceled and the influence is neutral. Each of these 3 primitives can be composed to yie…

Axiom
annotated source: causally related to
annotated property: curator note
annotated target: Do not use this relation directly. It is intended as a grouping for a diverse set of relations, all involving cause and effect.

Axiom
annotated source: causally related to
annotated property: label
annotated target: causally related to

causally upstream of or within
type: ObjectProperty
sub property of: causal relation between processes
inverse of: causally downstream of or within
type: TransitiveProperty
definition: p is 'causally upstream or within' q iff p is causally related to q, and the end of p precedes, or is coincident with, the end of q.
editor note: We would like to make this disjoint with 'preceded by', but this is prohibited in OWL2
term editor: https://orcid.org/0000-0002-6601-2165
alternative label: influences (processual)
has_related_synonym: affects
term tracker annotation: add subset of relation below 'causally related to' issue: https://github.com/OpenEnergyPlatform/ontology/issues/1079 pull-request: https://github.com/OpenEnergyPlatform/ontology/pull/1136 marked as transitive and added 'inverse of 'causally downstream of or within'' issue: https://github.com/OpenEnergyPlatform/ontology/issues/2106 pull-request: https://github.com/OpenEnergyPlatform/ontology/pull/2109

Axiom
annotated source: causally upstream of or within
annotated property: definition
annotated target: p is 'causally upstream or within' q iff p is causally related to q, and the end of p precedes, or is coincident with, the end of q.

Axiom
annotated source: causally upstream of or within
annotated property: editor note
annotated target: We would like to make this disjoint with 'preceded by', but this is prohibited in OWL2

Axiom
annotated source: causally upstream of or within
annotated property: alternative label
annotated target: influences (processual)

Axiom
annotated source: causally upstream of or within
annotated property: has_related_synonym
annotated target: affects

Axiom
annotated source: causally upstream of or within
annotated property: label
annotated target: causally upstream of or within

causally downstream of or within
type: ObjectProperty
sub property of: causal relation between processes
type: TransitiveProperty
definition: inverse of causally upstream of or within
term editor: https://orcid.org/0000-0002-6601-2165
definition source: causal-relations
term tracker annotation: add subset of relation below 'causally related to' issue: https://github.com/OpenEnergyPlatform/ontology/issues/1079 pull-request: https://github.com/OpenEnergyPlatform/ontology/pull/1136 marked as transitive issue: https://github.com/OpenEnergyPlatform/ontology/issues/2106 pull-request: https://github.com/OpenEnergyPlatform/ontology/pull/2109

Axiom
annotated source: causally downstream of or within
annotated property: definition
annotated target: inverse of causally upstream of or within

Axiom
annotated source: causally downstream of or within
annotated property: label
annotated target: causally downstream of or within

causal relation between processes
type: ObjectProperty
sub property of: causally related to
domain: process
range: process
definition: p is causally related to q if and only if p or any part of p and q or any part of q are linked by a chain of events where each event pair is one where the execution of p influences the execution of q. p may be upstream, downstream, part of, or a container of q.
term editor: https://orcid.org/0000-0002-6601-2165
definition source: causal-relations
curator note: Do not use this relation directly. It is intended as a grouping for a diverse set of relations, all involving cause and effect.

Axiom
annotated source: causal relation between processes
annotated property: domain
annotated target: process
term tracker annotation: add domain and range issue: https://github.com/OpenEnergyPlatform/ontology/issues/1079 pull-request: https://github.com/OpenEnergyPlatform/ontology/pull/1136

Axiom
annotated source: causal relation between processes
annotated property: range
annotated target: process
term tracker annotation: add domain and range issue: https://github.com/OpenEnergyPlatform/ontology/issues/1079 pull-request: https://github.com/OpenEnergyPlatform/ontology/pull/1136

Axiom
annotated source: causal relation between processes
annotated property: definition
annotated target: p is causally related to q if and only if p or any part of p and q or any part of q are linked by a chain of events where each event pair is one where the execution of p influences the execution of q. p may be upstream, downstream, part of, or a container of q.

Axiom
annotated source: causal relation between processes
annotated property: curator note
annotated target: Do not use this relation directly. It is intended as a grouping for a diverse set of relations, all involving cause and effect.

Axiom
annotated source: causal relation between processes
annotated property: label
annotated target: causal relation between processes

depends on
type: ObjectProperty
sub property of: topObjectProperty
term editor: https://orcid.org/0000-0002-6601-2165

Axiom
annotated source: depends on
annotated property: label
annotated target: depends on

has intermediate
type: ObjectProperty
sub property of: has participant
example of usage: 'lysine biosynthetic process via diaminopimelate' SubClassOf has_intermediate some diaminopimelate
definition: p has intermediate c if and only if p has parts p1, p2 and p1 has output c, and p2 has input c
term editor: https://orcid.org/0000-0002-6601-2165
alternative label: has intermediate product

Axiom
annotated source: has intermediate
annotated property: example of usage
annotated target: 'lysine biosynthetic process via diaminopimelate' SubClassOf has_intermediate some diaminopimelate

Axiom
annotated source: has intermediate
annotated property: definition
annotated target: p has intermediate c if and only if p has parts p1, p2 and p1 has output c, and p2 has input c

Axiom
annotated source: has intermediate
annotated property: alternative label
annotated target: has intermediate product

Axiom
annotated source: has intermediate
annotated property: label
annotated target: has intermediate

has model
type: ObjectProperty
sub property of: topObjectProperty
inverse of: has role in modeling
definition: Inverse of is-model-of
comment: The original RO definition seems to be wrong. It should be: Inverse of 'has role in modeling', according to the inverse relation given in RO.

Axiom
annotated source: has model
annotated property: definition
annotated target: Inverse of is-model-of

Axiom
annotated source: has model
annotated property: label
annotated target: has model

produces
type: ObjectProperty
sub property of: topObjectProperty
has curation status: IAO_0000125
definition: a produces b if some process that occurs_in a has_output b, where a and b are material entities. Examples: hybridoma cell line produces monoclonal antibody reagent; chondroblast produces avascular GAG-rich matrix.
editor note: As produces relates to an material entity, but energy is a quality in the OEO, produces cannot be used to describe the energy output of a process. Use 'has energy output' instead.
term editor: https://orcid.org/0000-0001-9114-8737
comment: Note that this definition doesn't quite distinguish the output of a transformation process from a production process, which is related to the identity/granularity issue.

Axiom
annotated source: produces
annotated property: definition
annotated target: a produces b if some process that occurs_in a has_output b, where a and b are material entities. Examples: hybridoma cell line produces monoclonal antibody reagent; chondroblast produces avascular GAG-rich matrix.

Axiom
annotated source: produces
annotated property: editor note
annotated target: As produces relates to an material entity, but energy is a quality in the OEO, produces cannot be used to describe the energy output of a process. Use 'has energy output' instead.
term tracker annotation: issue: https://github.com/OpenEnergyPlatform/ontology/issues/994 pull request: https://github.com/OpenEnergyPlatform/ontology/pull/1006

Axiom
annotated source: produces
annotated property: comment
annotated target: Note that this definition doesn't quite distinguish the output of a transformation process from a production process, which is related to the identity/granularity issue.

Axiom
annotated source: produces
annotated property: label
annotated target: produces

produced by
type: ObjectProperty
sub property of: topObjectProperty
has curation status: IAO_0000125
definition: a produced_by b iff some process that occurs_in b has_output a.
term editor: https://orcid.org/0000-0001-9114-8737

Axiom
annotated source: produced by
annotated property: definition
annotated target: a produced_by b iff some process that occurs_in b has_output a.

Axiom
annotated source: produced by
annotated property: label
annotated target: produced by

has role in modeling
type: ObjectProperty
sub property of: topObjectProperty
definition: A relation between a biological, experimental, or computational artifact and an entity it is used to study, in virtue of its replicating or approximating features of the studied entity.
term editor: https://orcid.org/0000-0002-1048-5019
alternative label: is used to study
comment: The primary use case for this relation was to link a biological model system such as a cell line or model organism to a disease it is used to investigate, in virtue of the model system exhibiting features similar to that of the disease of interest. But the relation is defined more broadly to support other use cases, such as linking genes in which alterations are made to create model systems to the condition the system is used to interrogate, or computational models to real-world phenomena they are defined to simulate.

Axiom
annotated source: has role in modeling
annotated property: definition
annotated target: A relation between a biological, experimental, or computational artifact and an entity it is used to study, in virtue of its replicating or approximating features of the studied entity.

Axiom
annotated source: has role in modeling
annotated property: alternative label
annotated target: is used to study

Axiom
annotated source: has role in modeling
annotated property: comment
annotated target: The primary use case for this relation was to link a biological model system such as a cell line or model organism to a disease it is used to investigate, in virtue of the model system exhibiting features similar to that of the disease of interest. But the relation is defined more broadly to support other use cases, such as linking genes in which alterations are made to create model systems to the condition the system is used to interrogate, or computational models to real-world phenomena they are defined to simulate.

Axiom
annotated source: has role in modeling
annotated property: label
annotated target: has role in modeling

has primary input or output
type: ObjectProperty
sub property of: has participant
definition: p 'has primary input ot output' c iff either (a) p 'has primary input' c or (b) p 'has primary output' c.
created by: https://orcid.org/0000-0002-6601-2165
creation date: 2018-12-13T11:26:17Z

Axiom
annotated source: has primary input or output
annotated property: definition
annotated target: p 'has primary input ot output' c iff either (a) p 'has primary input' c or (b) p 'has primary output' c.

Axiom
annotated source: has primary input or output
annotated property: creation date
annotated target: 2018-12-13T11:26:17Z

Axiom
annotated source: has primary input or output
annotated property: label
annotated target: has primary input or output

has primary output
type: ObjectProperty
sub property of: has output
sub property of: has primary input or output
definition: p has primary output c if (a) p has output c and (b) the goal of process is to modify, produce, or transform c.
created by: https://orcid.org/0000-0002-6601-2165
creation date: 2018-12-13T11:26:32Z

Axiom
annotated source: has primary output
annotated property: definition
annotated target: p has primary output c if (a) p has output c and (b) the goal of process is to modify, produce, or transform c.
has db xref: GOC:cjm
has db xref: GOC:dph
has db xref: GOC:kva
has db xref: GOC:pt
comment: PMID:27812932

Axiom
annotated source: has primary output
annotated property: creation date
annotated target: 2018-12-13T11:26:32Z

Axiom
annotated source: has primary output
annotated property: label
annotated target: has primary output

has primary input
type: ObjectProperty
sub property of: has input
sub property of: has primary input or output
definition: p has primary input c if (a) p has input c and (b) the goal of process is to modify, consume, or transform c.
created by: https://orcid.org/0000-0002-6601-2165
creation date: 2018-12-13T11:26:56Z

Axiom
annotated source: has primary input
annotated property: definition
annotated target: p has primary input c if (a) p has input c and (b) the goal of process is to modify, consume, or transform c.
has db xref: GOC:cjm
has db xref: GOC:dph
has db xref: GOC:kva
has db xref: GOC:pt
comment: PMID:27812932

Axiom
annotated source: has primary input
annotated property: creation date
annotated target: 2018-12-13T11:26:56Z

Axiom
annotated source: has primary input
annotated property: label
annotated target: has primary input

regulates characteristic
type: ObjectProperty
sub property of: causally related to
domain: process
range: quality
definition: A relationship that holds between a process and a characteristic in which process (P) regulates characteristic (C) iff: P results in the existence of C OR affects the intensity or magnitude of C.
contributor: https://orcid.org/0000-0002-8688-6599
term tracker annotation: import from RO issue: https://github.com/OpenEnergyPlatform/ontology/issues/2053 pull request: https://github.com/OpenEnergyPlatform/ontology/pull/2094

Axiom
annotated source: regulates characteristic
annotated property: definition
annotated target: A relationship that holds between a process and a characteristic in which process (P) regulates characteristic (C) iff: P results in the existence of C OR affects the intensity or magnitude of C.

Axiom
annotated source: regulates characteristic
annotated property: label
annotated target: regulates characteristic

positively regulates characteristic
type: ObjectProperty
sub property of: regulates characteristic
definition: A relationship that holds between a process and a characteristic in which process (P) positively regulates characteristic (C) iff: P results in an increase in the intensity or magnitude of C.
contributor: https://orcid.org/0000-0002-8688-6599
term tracker annotation: import from RO issue: https://github.com/OpenEnergyPlatform/ontology/issues/2053 pull request: https://github.com/OpenEnergyPlatform/ontology/pull/2094

Axiom
annotated source: positively regulates characteristic
annotated property: definition
annotated target: A relationship that holds between a process and a characteristic in which process (P) positively regulates characteristic (C) iff: P results in an increase in the intensity or magnitude of C.

Axiom
annotated source: positively regulates characteristic
annotated property: label
annotated target: positively regulates characteristic

negatively regulates characteristic
type: ObjectProperty
sub property of: regulates characteristic
definition: A relationship that holds between a process and a characteristic in which process (P) negatively regulates characteristic (C) iff: P results in a decrease in the intensity or magnitude of C.
contributor: https://orcid.org/0000-0002-8688-6599
term tracker annotation: import from RO issue: https://github.com/OpenEnergyPlatform/ontology/issues/2053 pull request: https://github.com/OpenEnergyPlatform/ontology/pull/2094

Axiom
annotated source: negatively regulates characteristic
annotated property: definition
annotated target: A relationship that holds between a process and a characteristic in which process (P) negatively regulates characteristic (C) iff: P results in a decrease in the intensity or magnitude of C.

Axiom
annotated source: negatively regulates characteristic
annotated property: label
annotated target: negatively regulates characteristic

is unit of
type: ObjectProperty
domain: unit
definition: A relation to connect a unit to a quantifiable entity that it is the unit of.
comment: This relation has been imported from UO.
term tracker annotation: change domain and range to oeo:unit issue: https://github.com/OpenEnergyPlatform/ontology/issues/2135 pull request: https://github.com/OpenEnergyPlatform/ontology/pull/2141

has process attribute
type: ObjectProperty
inverse of: process attribute of
domain: process
range: process attribute
definition: A relation between a process and a process attribute that existentially depends on it.
term tracker annotation: issue: https://github.com/OpenEnergyPlatform/ontology/issues/66 pull requests: https://github.com/OpenEnergyPlatform/ontology/pull/472 issue: https://github.com/OpenEnergyPlatform/ontology/issues/205 pull request: https://github.com/OpenEnergyPlatform/ontology/pull/386 add domain and range; move to oeo-shared issue: https://github.com/OpenEnergyPlatform/ontology/issues/850 pull request: https://github.com/OpenEnergyPlatform/ontology/pull/871

is used by
type: ObjectProperty
inverse of: uses
domain: continuant
range: continuant
definition: A relation that holds between a continuant c1 and a continuant c2, where c1 is required by c2 as input to work.
comment: issue: https://github.com/OpenEnergyPlatform/ontology/issues/66 pull requests: https://github.com/OpenEnergyPlatform/ontology/pull/472 add def and domain and range issue: https://github.com/OpenEnergyPlatform/ontology/issues/1117 pull requests: https://github.com/OpenEnergyPlatform/ontology/pull/1508

process attribute of
type: ObjectProperty
domain: process attribute
range: process
definition: A relation between a process attribute and the process it existentially depends on.
term tracker annotation: issue: https://github.com/OpenEnergyPlatform/ontology/issues/66 pull requests: https://github.com/OpenEnergyPlatform/ontology/pull/472 issue: https://github.com/OpenEnergyPlatform/ontology/issues/205 pull request: https://github.com/OpenEnergyPlatform/ontology/pull/386 add domains and ranges: issue: https://github.com/OpenEnergyPlatform/ontology/issues/973 issue: https://github.com/OpenEnergyPlatform/ontology/pull/1085

uses
type: ObjectProperty
domain: continuant
range: continuant
definition: A relation that holds between a continuant c1 and a continuant c2, where c1 requires c2 as input to work.
term tracker annotation: issue: https://github.com/OpenEnergyPlatform/ontology/issues/66 pull requests: https://github.com/OpenEnergyPlatform/ontology/pull/452 (delete unused subclass) https://github.com/OpenEnergyPlatform/ontology/pull/472 (move to oeo-shared) https://github.com/OpenEnergyPlatform/ontology/pull/478 (add definition) https://github.com/OpenEnergyPlatform/ontology/pull/871 (add domain and range) change def issue: https://github.com/OpenEnergyPlatform/ontology/issues/1117 pull requests: https://github.com/OpenEnergyPlatform/ontology/pull/1508

is defined by
type: ObjectProperty
range: continuant
definition: A relation between a continuant (A) and a continuant or occurent (B) in which (A) determines the semantic of (B)
term tracker annotation: issue: https://github.com/OpenEnergyPlatform/ontology/issues/460 pull request: https://github.com/OpenEnergyPlatform/ontology/pull/480/ domain: issue: https://github.com/OpenEnergyPlatform/ontology/issues/850 pull request: https://github.com/OpenEnergyPlatform/ontology/pull/871 adapt domains and ranges: issue: https://github.com/OpenEnergyPlatform/ontology/issues/973 issue: https://github.com/OpenEnergyPlatform/ontology/pull/1085 Move to oeo-shared: issue: https://github.com/OpenEnergyPlatform/ontology/issues/1400 pull request: https://github.com/OpenEnergyPlatform/ontology/pull/1463

covers sector
type: ObjectProperty
sub property of: covers
domain: study
range: sector
definition: A relation that holds between a study and the sector it covers.
term tracker annotation: update definition issue: https://github.com/OpenEnergyPlatform/ontology/issues/846 pull request: https://github.com/OpenEnergyPlatform/ontology/pull/852

has author
type: ObjectProperty
sub property of: has contributor
domain: information content entity
range: Restriction
  on property: has role
  some values from: author
definition: A relation that holds between an information content entity and its author.
editor note: The construct 'has author' some ('has role' some author) is necessary, because 'has author' has the range 'has role some author' (PR https://github.com/OpenEnergyPlatform/ontology/pull/871). That is an independent continuant, i.e. a person, that takes over writing a text and as such the role of an author.
term tracker annotation: pull request: https://github.com/OpenEnergyPlatform/ontology/pull/626 (extend def for information content entity) pull request: https://github.com/OpenEnergyPlatform/ontology/pull/871 (domain and range; move to oeo-shared) rework module structure issue: https://github.com/OpenEnergyPlatform/ontology/issues/1592 pull request: https://github.com/OpenEnergyPlatform/ontology/pull/1652 change domain and def issue: https://github.com/OpenEnergyPlatform/ontology/issues/1444 pull request: https://github.com/OpenEnergyPlatform/ontology/pull/1707

has client
type: ObjectProperty
sub property of: has contributor
domain: Class
  union of: information content entity
  union of: model
range: Restriction
  on property: has role
  some values from: client
definition: A relation that holds between an information content entity / model and the client that requested its creation.
term tracker annotation: pull request: https://github.com/OpenEnergyPlatform/ontology/pull/626 (extend def for information content entity) pull request: https://github.com/OpenEnergyPlatform/ontology/pull/871 (domain and range; move to oeo-shared) rework module structure issue: https://github.com/OpenEnergyPlatform/ontology/issues/1592 pull request: https://github.com/OpenEnergyPlatform/ontology/pull/1652 change domain issue: https://github.com/OpenEnergyPlatform/ontology/issues/1444 pull request: https://github.com/OpenEnergyPlatform/ontology/pull/1707

has contact person
type: ObjectProperty
sub property of: has contributor
domain: information content entity
range: Restriction
  on property: has role
  some values from: contact person
definition: A relation that holds between an information content entity and the person to contact with issues about it.
term tracker annotation: pull request: https://github.com/OpenEnergyPlatform/ontology/pull/626 (extend def for information content entity) pull request: https://github.com/OpenEnergyPlatform/ontology/pull/871 (domain and range; move to oeo-shared) rework module structure issue: https://github.com/OpenEnergyPlatform/ontology/issues/1592 pull request: https://github.com/OpenEnergyPlatform/ontology/pull/1652 change domain and definition issue: https://github.com/OpenEnergyPlatform/ontology/issues/1444 pull request: https://github.com/OpenEnergyPlatform/ontology/pull/1707

has funding source
type: ObjectProperty
sub property of: topObjectProperty
range: Restriction
definition: A relation that holds between an entity and its source of funding.
term tracker annotation: issue: https://github.com/OpenEnergyPlatform/ontology/issues/530 pull request: https://github.com/OpenEnergyPlatform/ontology/pull/556

Axiom
annotated source: has funding source
annotated property: range
annotated target: Restriction
comment: issue: https://github.com/OpenEnergyPlatform/ontology/issues/850 pull request: https://github.com/OpenEnergyPlatform/ontology/pull/871

has organisation
type: ObjectProperty
sub property of: has contributor
domain: information content entity
range: Restriction
  on property: has role
  some values from: organisation role
definition: A relation that holds between an information content entity and the organisation in which it was created.
term tracker annotation: pull request: https://github.com/OpenEnergyPlatform/ontology/pull/626 (extend def for information content entity) pull request: https://github.com/OpenEnergyPlatform/ontology/pull/871 (domain and range; move to oeo-shared) improve definition: https://github.com/OpenEnergyPlatform/ontology/issues/1038 https://github.com/OpenEnergyPlatform/ontology/pull/1042 Replace `institution` as range by `organisation role` issue: https://github.com/OpenEnergyPlatform/ontology/issues/1161 pull request: https://github.com/OpenEnergyPlatform/ontology/pull/1200 Relabel to `has organisation` issue: https://github.com/OpenEnergyPlatform/ontology/issues/1161 pull request: https://github.com/OpenEnergyPlatform/ontology/pull/1226 rework module structure issue: https://github.com/OpenEnergyPlatform/ontology/issues/1592 pull request: https://github.com/OpenEnergyPlatform/ontology/pull/1652 change domain and definition issue: https://github.com/OpenEnergyPlatform/ontology/issues/1444 pull request: https://github.com/OpenEnergyPlatform/ontology/pull/1707

has objective
type: ObjectProperty
domain: optimisation
range: Class
  union of: objective function
  union of: OEO_00240004
definition: A relation that holds between an optimisation and its objective function or objective variable.
term tracker annotation: correct spelling optimisation and add range 'objective variable' issue: https://github.com/OpenEnergyPlatform/ontology/issues/848 pull request: https://github.com/OpenEnergyPlatform/ontology/pull/878

has objective function
type: ObjectProperty
sub property of: has objective
domain: optimisation
range: objective function
definition: A relation that holds between an optimisation and its objective function.

has objective variable
type: ObjectProperty
sub property of: has objective
domain: optimisation
range: OEO_00240004
definition: A relation that holds between an optimisation and its objective variable.
term tracker annotation: add range 'objective variable' issue: https://github.com/OpenEnergyPlatform/ontology/issues/848 pull request: https://github.com/OpenEnergyPlatform/ontology/pull/878

has resolution
type: ObjectProperty
domain: data set
range: resolution
definition: A relation that holds between a data set and the resolution it depicts.
term tracker annotation: issue https://github.com/OpenEnergyPlatform/ontology/issues/622 Pull request https://github.com/OpenEnergyPlatform/ontology/pull/626 rework issue https://github.com/OpenEnergyPlatform/ontology/issues/849 Pull request https://github.com/OpenEnergyPlatform/ontology/pull/912 add domain and range Pull request https://github.com/OpenEnergyPlatform/ontology/pull/972 rework module structure issue: https://github.com/OpenEnergyPlatform/ontology/issues/1592 pull request: https://github.com/OpenEnergyPlatform/ontology/pull/1652

has spatial resolution
type: ObjectProperty
sub property of: has resolution
domain: data set
range: spatial resolution
definition: A relation between a data set and the spatial resolution it uses.
term tracker annotation: issue https://github.com/OpenEnergyPlatform/ontology/issues/622 Pull request https://github.com/OpenEnergyPlatform/ontology/pull/626 def and axioms Pull request https://github.com/OpenEnergyPlatform/ontology/pull/912 add domain and range Pull request https://github.com/OpenEnergyPlatform/ontology/pull/972 rework module structure issue: https://github.com/OpenEnergyPlatform/ontology/issues/1592 pull request: https://github.com/OpenEnergyPlatform/ontology/pull/1652

has temporal resolution
type: ObjectProperty
sub property of: has resolution
domain: data set
range: temporal resolution
definition: A relation that holds between data set and the temporal resolution it uses.
term tracker annotation: issue https://github.com/OpenEnergyPlatform/ontology/issues/622 Pull request https://github.com/OpenEnergyPlatform/ontology/pull/626 def and axioms Pull request https://github.com/OpenEnergyPlatform/ontology/pull/912 fix def and add domain and range Pull request https://github.com/OpenEnergyPlatform/ontology/pull/972 rework module structure issue: https://github.com/OpenEnergyPlatform/ontology/issues/1592 pull request: https://github.com/OpenEnergyPlatform/ontology/pull/1652

has constraint
type: ObjectProperty
sub property of: has information input
domain: transformation
range: constraint
definition: A relation that holds between a transformation and the constraints it has to fulfil.
term tracker annotation: issue: https://github.com/OpenEnergyPlatform/ontology/issues/618 pull request: https://github.com/OpenEnergyPlatform/ontology/pull/716

applies technology
type: ObjectProperty
inverse of: is applied to object
domain: artificial object
range: technology
definition: the property of an artificial object to apply to a technology.

covers
type: ObjectProperty
domain: study
definition: A relation that holds between a study and the thing it covers.
term tracker annotation: issue: https://github.com/OpenEnergyPlatform/ontology/issues/66 pull requests: https://github.com/OpenEnergyPlatform/ontology/pull/452 (delete unused subclasses) pull requests: https://github.com/OpenEnergyPlatform/ontology/pull/584 pull requests: https://github.com/OpenEnergyPlatform/ontology/pull/626 (extend for study) issue: https://github.com/OpenEnergyPlatform/ontology/issues/415 pull request: https://github.com/OpenEnergyPlatform/ontology/pull/821 (restrict to study)

covers energy carrier
type: ObjectProperty
sub property of: covers
domain: study
range: energy carrier
definition: A relation that holds between a study and the energy carrier it covers.
term tracker annotation: change range issue: https://github.com/OpenEnergyPlatform/ontology/pull/721 pull request: https://github.com/OpenEnergyPlatform/ontology/pull/722 update definition issue: https://github.com/OpenEnergyPlatform/ontology/issues/846 pull request: https://github.com/OpenEnergyPlatform/ontology/pull/852 rework module structure issue: https://github.com/OpenEnergyPlatform/ontology/issues/1592 pull request: https://github.com/OpenEnergyPlatform/ontology/pull/1652

has global warming potential
type: ObjectProperty
sub property of: has quantity value
domain: greenhouse gas
range: global warming potential
definition: A relation between a greenhouse gas and the global warming potential it has.
term tracker annotation: issue: https://github.com/OpenEnergyPlatform/ontology/issues/66 pull request: https://github.com/OpenEnergyPlatform/ontology/pull/478 issue: https://github.com/OpenEnergyPlatform/ontology/issues/420 pull request: https://github.com/OpenEnergyPlatform/ontology/pull/651 issue: https://github.com/OpenEnergyPlatform/ontology/issues/420 pull request: https://github.com/OpenEnergyPlatform/ontology/pull/683 move to oeo-shared: https://github.com/OpenEnergyPlatform/ontology/pull/1410 rework module structure issue: https://github.com/OpenEnergyPlatform/ontology/issues/1592 pull request: https://github.com/OpenEnergyPlatform/ontology/pull/1652

Axiom
annotated source: has global warming potential
annotated property: subPropertyOf
annotated target: has quantity value
term tracker annotation: issue: https://github.com/OpenEnergyPlatform/ontology/issues/858 pull request: https://github.com/OpenEnergyPlatform/ontology/pull/965

is applied to object
type: ObjectProperty
domain: technology
range: artificial object
definition: The property of a technology to be applied to an artificial object.

is connected to
type: ObjectProperty
sub property of: topObjectProperty
type: SymmetricProperty
domain: grid node
range: grid node
definition: A relation that holds between two neighbouring grid nodes in a supply grid.
term tracker annotation: issue: https://github.com/OpenEnergyPlatform/ontology/issues/66 pull requests: https://github.com/OpenEnergyPlatform/ontology/pull/478 issue: https://github.com/OpenEnergyPlatform/ontology/issues/1116 pull requests: https://github.com/OpenEnergyPlatform/ontology/pull/1762

has sink
type: ObjectProperty
sub property of: is connected to
domain: supply grid
range: grid node
property disjoint with: has source
definition: A relation that holds between a supply grid g and a grid node n, in which n is part of g and n works as an extraction point of the supply system.
term tracker annotation: issue: https://github.com/OpenEnergyPlatform/ontology/issues/66 pull requests: https://github.com/OpenEnergyPlatform/ontology/pull/478 issue: https://github.com/OpenEnergyPlatform/ontology/issues/1116 pull requests: https://github.com/OpenEnergyPlatform/ontology/pull/1762

has source
type: ObjectProperty
sub property of: is connected to
domain: supply grid
range: grid node
definition: A relation that holds between a supply grid g and a grid node n, in which n is part of g and n works as entry point to the supply system.
term tracker annotation: issue: https://github.com/OpenEnergyPlatform/ontology/issues/66 pull requests: https://github.com/OpenEnergyPlatform/ontology/pull/478 issue: https://github.com/OpenEnergyPlatform/ontology/issues/1116 pull requests: https://github.com/OpenEnergyPlatform/ontology/pull/1762

has normal state of matter
type: ObjectProperty
sub property of: has state of matter
domain: portion of matter
range: state of matter
definition: x has normal state of matter y if and only if a portion of x occurs in state y under normal pressure (1 bar) and normal temperature (0°C)
term tracker annotation: make subproperty of 'has state of matter' issue: https://github.com/OpenEnergyPlatform/ontology/issues/989 pull request: https://github.com/OpenEnergyPlatform/ontology/pull/1001 move to oeo-shared: issue: https://github.com/OpenEnergyPlatform/ontology/issues/1384 pull request: https://github.com/OpenEnergyPlatform/ontology/pull/1390 rework module structure issue: https://github.com/OpenEnergyPlatform/ontology/issues/1592 pull request: https://github.com/OpenEnergyPlatform/ontology/pull/1652

has origin
type: ObjectProperty
sub property of: has quality
domain: Class
  union of: energy
  union of: portion of matter
range: origin
definition: x has the origin of y
term tracker annotation: move to oeo-shared: issue: https://github.com/OpenEnergyPlatform/ontology/issues/1384 pull request: https://github.com/OpenEnergyPlatform/ontology/pull/1390 rework module structure issue: https://github.com/OpenEnergyPlatform/ontology/issues/1592 pull request: https://github.com/OpenEnergyPlatform/ontology/pull/1652

has state of matter
type: ObjectProperty
sub property of: has quality
domain: portion of matter
range: state of matter
definition: A relation between a portion of matter (x) and a state of matter (y) that indicates the state y of matter x under certain given conditions.
term tracker annotation: issue: https://github.com/OpenEnergyPlatform/ontology/issues/989 pull request: https://github.com/OpenEnergyPlatform/ontology/pull/1001 rework module structure issue: https://github.com/OpenEnergyPlatform/ontology/issues/1592 pull request: https://github.com/OpenEnergyPlatform/ontology/pull/1652

has physical input
type: ObjectProperty
sub property of: has input
type: AsymmetricProperty
type: IrreflexiveProperty
domain: process
range: material entity
definition: p has physical input c iff: p has input c, and c is a material entity
term tracker annotation: issue: https://github.com/OpenEnergyPlatform/ontology/issues/664 pull request: https://github.com/OpenEnergyPlatform/ontology/pull/702 restrict range to 'material entity': https://github.com/OpenEnergyPlatform/ontology/issues/994 https://github.com/OpenEnergyPlatform/ontology/pull/1041 move to oeo-shared: issue: https://github.com/OpenEnergyPlatform/ontology/issues/1384 pull request: https://github.com/OpenEnergyPlatform/ontology/pull/1390

has physical output
type: ObjectProperty
sub property of: has output
inverse of: physical output of
domain: process
range: material entity
definition: p has physical output c iff: p has output c, and c is a material entity
term tracker annotation: issue: https://github.com/OpenEnergyPlatform/ontology/issues/618 pull request: https://github.com/OpenEnergyPlatform/ontology/pull/716 restrict range to 'material entity': issue: https://github.com/OpenEnergyPlatform/ontology/issues/994 pull request: https://github.com/OpenEnergyPlatform/ontology/pull/1041 move to oeo-shared: issue: https://github.com/OpenEnergyPlatform/ontology/issues/1384 pull request: https://github.com/OpenEnergyPlatform/ontology/pull/1390

Axiom
annotated source: has physical output
annotated property: domain
annotated target: process
term tracker annotation: issue: https://github.com/OpenEnergyPlatform/ontology/issues/394 pull request: https://github.com/OpenEnergyPlatform/ontology/pull/838

Axiom
annotated source: has physical output
annotated property: range
annotated target: material entity
term tracker annotation: issue: https://github.com/OpenEnergyPlatform/ontology/issues/394 pull request: https://github.com/OpenEnergyPlatform/ontology/pull/838

guides
type: ObjectProperty
sub property of: is about
domain: policy instrument
range: transformative measure
definition: A relation between a policy instrument and a transformative measure where a policy instrument guides a transformative measure.
term tracker annotation: issue: https://github.com/OpenEnergyPlatform/ontology/issues/444 pull request: https://github.com/OpenEnergyPlatform/ontology/pull/853 Make subproperty of 'is about': issue: https://github.com/OpenEnergyPlatform/ontology/issues/1507 pull request: https://github.com/OpenEnergyPlatform/ontology/pull/1563 move to oeo-shared issue: https://github.com/OpenEnergyPlatform/ontology/issues/1329 pull request: https://github.com/OpenEnergyPlatform/ontology/pull/1614 rework module structure issue: https://github.com/OpenEnergyPlatform/ontology/issues/1592 pull request: https://github.com/OpenEnergyPlatform/ontology/pull/1652

obsolete has bearer
type: ObjectProperty
domain: specifically dependent continuant
range: Class
  union of: independent continuant
  union of: energy
definition: OBSOLETE: A relation between a specifically dependent continuant (the dependent) and an independent continuant or energy (the bearer), in which the dependent is specifically reliant on the bearer for its existence
comment: The relation was replaced by RO_0000052 (characteristic of). Please use this relation and its subrelations in the future.
deprecated: true
term tracker annotation: issue: https://github.com/OpenEnergyPlatform/ontology/issues/444 pull request: issue: https://github.com/OpenEnergyPlatform/ontology/pull/853 add domains and ranges: issue: https://github.com/OpenEnergyPlatform/ontology/issues/973 pull request: https://github.com/OpenEnergyPlatform/ontology/pull/985 extend range to energy: issue: https://github.com/OpenEnergyPlatform/ontology/issues/973 pull request: https://github.com/OpenEnergyPlatform/ontology/pull/985 correct definition with respect to energy: issue: https://github.com/OpenEnergyPlatform/ontology/issues/1305 pull request: https://github.com/OpenEnergyPlatform/ontology/pull/1484 remove inverse: issue: https://github.com/OpenEnergyPlatform/ontology/issues/1844 pull request: https://github.com/OpenEnergyPlatform/ontology/pull/1852 obsoletion / replacement with characteristic of issue: https://github.com/OpenEnergyPlatform/ontology/issues/1907 pull request: https://github.com/OpenEnergyPlatform/ontology/pull/1928

governs
type: ObjectProperty
domain: Class
  union of: policy
  union of: policy instrument
definition: A relation that holds between a policy or policy instrument and the thing it governs.
term tracker annotation: issue: https://github.com/OpenEnergyPlatform/ontology/issues/855 pull request: https://github.com/OpenEnergyPlatform/ontology/pull/868

is subject of
type: ObjectProperty
range: information content entity
definition: A relation between an entity and an information artifact.
term tracker annotation: issue: https://github.com/OpenEnergyPlatform/ontology/issues/858 pull request: https://github.com/OpenEnergyPlatform/ontology/pull/965 renamed from 'has information content entity' to 'is subject of' issue: https://github.com/OpenEnergyPlatform/ontology/issues/2088 pull request: https://github.com/OpenEnergyPlatform/ontology/pull/2092

has memo item
type: ObjectProperty
sub property of: is subject of
domain: sector
range: memo item
definition: A relation between a sector and a memo item.
term tracker annotation: issue: https://github.com/OpenEnergyPlatform/ontology/issues/858 pull request: https://github.com/OpenEnergyPlatform/ontology/pull/967 move to oeo-sector issue: https://github.com/OpenEnergyPlatform/ontology/issues/1399 pull request: https://github.com/OpenEnergyPlatform/ontology/pull/1724

has energy input
type: ObjectProperty
sub property of: has energy participant
domain: Class
  union of: process
  union of: artificial object
range: energy
definition: A relation between an artificial object or a process and an energy, where the energy is an input of the artificial object or process.
term tracker annotation: issue: https://github.com/OpenEnergyPlatform/ontology/issues/994 pull request: https://github.com/OpenEnergyPlatform/ontology/pull/1006 move to oeo-shared: issue: https://github.com/OpenEnergyPlatform/ontology/issues/1384 pull request: https://github.com/OpenEnergyPlatform/ontology/pull/1390 rework module structure issue: https://github.com/OpenEnergyPlatform/ontology/issues/1592 pull request: https://github.com/OpenEnergyPlatform/ontology/pull/1652

has energy output
type: ObjectProperty
sub property of: has energy participant
domain: Class
  union of: process
  union of: artificial object
range: energy
definition: A relation between an artificial object or a process and an energy, where the energy is an output of the artificial object or process.
term tracker annotation: issue: https://github.com/OpenEnergyPlatform/ontology/issues/994 pull request: https://github.com/OpenEnergyPlatform/ontology/pull/1006 move to oeo-shared: issue: https://github.com/OpenEnergyPlatform/ontology/issues/1384 pull request: https://github.com/OpenEnergyPlatform/ontology/pull/1390 rework module structure issue: https://github.com/OpenEnergyPlatform/ontology/issues/1592 pull request: https://github.com/OpenEnergyPlatform/ontology/pull/1652

is sector of
type: ObjectProperty
domain: sector
range: Class
  union of: process
  union of: material entity
definition: A relation that holds between a sector and the processes or material entities it covers.
term tracker annotation: issue: https://github.com/OpenEnergyPlatform/ontology/issues/864 pull request: https://github.com/OpenEnergyPlatform/ontology/pull/1321

has spatial region
type: ObjectProperty
sub property of: is about
domain: information content entity
range: spatial region
definition: An is-about-relation between an information content entity and a spatial region that describes that the information content entity is about a spatial region.
term tracker annotation: issue: https://github.com/OpenEnergyPlatform/ontology/issues/1404 pull request: https://github.com/OpenEnergyPlatform/ontology/pull/1441

subsector of
type: ObjectProperty
sub property of: part of
inverse of: has subsector
domain: subsector
range: sector
definition: A part of relation between a sector and its parent sector.
term tracker annotation: issue: https://github.com/OpenEnergyPlatform/ontology/issues/1333 pull request: https://github.com/OpenEnergyPlatform/ontology/pull/1788

has subsector
type: ObjectProperty
sub property of: has part
domain: sector
range: subsector
definition: A has part relation between a sector and its subsector.
term tracker annotation: issue: https://github.com/OpenEnergyPlatform/ontology/issues/1333 pull request: https://github.com/OpenEnergyPlatform/ontology/pull/1788

has unit numerator
type: ObjectProperty
sub property of: has part
domain: unit
range: unit
property disjoint with: has unit denominator
definition: A relation between a (composed) unit A and a unit B in which B is in the numerator of unit A.
elucidation: A composed unit is composed of at least two other units. Examples are: m/s has a linear numerator metre and a linear denominator second. kg/m³ has a linear numerator kilogram and a cubed denominator metre. Wh has two linear numerators: Watt and hour
term tracker annotation: issue: https://github.com/OpenEnergyPlatform/ontology/issues/1815 pull request: https://github.com/OpenEnergyPlatform/ontology/pull/1816 change domain and range to oeo:unit issue: https://github.com/OpenEnergyPlatform/ontology/issues/2135 pull request: https://github.com/OpenEnergyPlatform/ontology/pull/2141

has linear unit numerator
type: ObjectProperty
sub property of: has unit numerator
domain: unit
range: unit
property disjoint with: has squared unit numerator
property disjoint with: has cubed unit numerator
property disjoint with: has linear unit denominator
property disjoint with: has squared unit denominator
property disjoint with: has cubed unit denominator
definition: A relation between a (composed) unit A and a unit B in which B is in the numerator of unit A with exponent 1.
elucidation: A composed unit is composed of at least two other units. Examples are: m/s has a linear numerator metre and a linear denominator second. kg/m³ has a linear numerator kilogram and a cubed denominator metre. Wh has two linear numerators: Watt and hour
term tracker annotation: issue: https://github.com/OpenEnergyPlatform/ontology/issues/1815 pull request: https://github.com/OpenEnergyPlatform/ontology/pull/1816 change domain and range to oeo:unit issue: https://github.com/OpenEnergyPlatform/ontology/issues/2135 pull request: https://github.com/OpenEnergyPlatform/ontology/pull/2141

has squared unit numerator
type: ObjectProperty
sub property of: has unit numerator
domain: unit
range: unit
property disjoint with: has cubed unit numerator
property disjoint with: has linear unit denominator
property disjoint with: has squared unit denominator
property disjoint with: has cubed unit denominator
definition: A relation between a (composed) unit A and a unit B in which B is in the numerator of unit A with exponent 2.
elucidation: A composed unit is composed of at least two other units. Examples are: m/s has a linear numerator metre and a linear denominator second. kg/m³ has a linear numerator kilogram and a cubed denominator metre. Wh has two linear numerators: Watt and hour
term tracker annotation: issue: https://github.com/OpenEnergyPlatform/ontology/issues/1815 pull request: https://github.com/OpenEnergyPlatform/ontology/pull/1816 change domain and range to oeo:unit issue: https://github.com/OpenEnergyPlatform/ontology/issues/2135 pull request: https://github.com/OpenEnergyPlatform/ontology/pull/2141

has cubed unit numerator
type: ObjectProperty
sub property of: has unit numerator
domain: unit
range: unit
property disjoint with: has linear unit denominator
property disjoint with: has squared unit denominator
property disjoint with: has cubed unit denominator
definition: A relation between a (composed) unit A and a unit B in which B is in the numerator of unit A with exponent 3.
elucidation: A composed unit is composed of at least two other units. Examples are: m/s has a linear numerator metre and a linear denominator second. kg/m³ has a linear numerator kilogram and a cubed denominator metre. Wh has two linear numerators: Watt and hour
term tracker annotation: issue: https://github.com/OpenEnergyPlatform/ontology/issues/1815 pull request: https://github.com/OpenEnergyPlatform/ontology/pull/1816 change domain and range to oeo:unit issue: https://github.com/OpenEnergyPlatform/ontology/issues/2135 pull request: https://github.com/OpenEnergyPlatform/ontology/pull/2141

has unit denominator
type: ObjectProperty
sub property of: has part
domain: unit
range: unit
definition: A relation between a (composed) unit A and a unit B in which B is in the denominator of unit A.
elucidation: A composed unit is composed of at least two other units. Examples are: m/s has a linear numerator metre and a linear denominator second. kg/m³ has a linear numerator kilogram and a cubed denominator metre. Wh has two linear numerators: Watt and hour
term tracker annotation: issue: https://github.com/OpenEnergyPlatform/ontology/issues/1815 pull request: https://github.com/OpenEnergyPlatform/ontology/pull/1816 change domain and range to oeo:unit issue: https://github.com/OpenEnergyPlatform/ontology/issues/2135 pull request: https://github.com/OpenEnergyPlatform/ontology/pull/2141

has linear unit denominator
type: ObjectProperty
sub property of: has unit denominator
domain: unit
range: unit
property disjoint with: has squared unit denominator
property disjoint with: has cubed unit denominator
definition: A relation between a (composed) unit A and a unit B in which B is in the denominator of unit A with exponent 1.
elucidation: A composed unit is composed of at least two other units. Examples are: m/s has a linear numerator metre and a linear denominator second. kg/m³ has a linear numerator kilogram and a cubed denominator metre. Wh has two linear numerators: Watt and hour
term tracker annotation: issue: https://github.com/OpenEnergyPlatform/ontology/issues/1815 pull request: https://github.com/OpenEnergyPlatform/ontology/pull/1816 correct definition pull request: https://github.com/OpenEnergyPlatform/ontology/pull/2126 change domain and range to oeo:unit issue: https://github.com/OpenEnergyPlatform/ontology/issues/2135 pull request: https://github.com/OpenEnergyPlatform/ontology/pull/2141

has squared unit denominator
type: ObjectProperty
sub property of: has unit denominator
domain: unit
range: unit
property disjoint with: has cubed unit denominator
definition: A relation between a (composed) unit A and a unit B in which B is in the denominator of unit A with exponent 2.
elucidation: A composed unit is composed of at least two other units. Examples are: m/s has a linear numerator metre and a linear denominator second. kg/m³ has a linear numerator kilogram and a cubed denominator metre. Wh has two linear numerators: Watt and hour
term tracker annotation: issue: https://github.com/OpenEnergyPlatform/ontology/issues/1815 pull request: https://github.com/OpenEnergyPlatform/ontology/pull/1816 correct definition pull request: https://github.com/OpenEnergyPlatform/ontology/pull/2126 change domain and range to oeo:unit issue: https://github.com/OpenEnergyPlatform/ontology/issues/2135 pull request: https://github.com/OpenEnergyPlatform/ontology/pull/2141

has cubed unit denominator
type: ObjectProperty
sub property of: has unit denominator
domain: unit
range: unit
definition: A relation between a (composed) unit A and a unit B in which B is in the denominator of unit A with exponent 3.
elucidation: A composed unit is composed of at least two other units. Examples are: m/s has a linear numerator metre and a linear denominator second. kg/m³ has a linear numerator kilogram and a cubed denominator metre. Wh has two linear numerators: Watt and hour
term tracker annotation: issue: https://github.com/OpenEnergyPlatform/ontology/issues/1815 pull request: https://github.com/OpenEnergyPlatform/ontology/pull/1816 change domain and range to oeo:unit issue: https://github.com/OpenEnergyPlatform/ontology/issues/2135 pull request: https://github.com/OpenEnergyPlatform/ontology/pull/2141

has licence provider
type: ObjectProperty
domain: licence
range: licence provider
definition: A relation between a licence and the agent providing the licence to do something.
term tracker annotation: issue: https://github.com/OpenEnergyPlatform/ontology/issues/1873 pull request: https://github.com/OpenEnergyPlatform/ontology/pull/1925

permits
type: ObjectProperty
domain: licence
range: Class
  intersection of: licensee
  intersection of: Restriction
    on property: participates in
    some values from: process
definition: A relation between a licence and a process in which the licence describes under which conditions a licensee can perform a process.
term tracker annotation: issue: https://github.com/OpenEnergyPlatform/ontology/issues/1873 pull request: https://github.com/OpenEnergyPlatform/ontology/pull/1925

quantity value of
type: ObjectProperty
sub property of: is about
inverse of: has quantity value
definition: A relation that relates a quantity value to its entity in reality.
term tracker annotation: issue: https://github.com/OpenEnergyPlatform/ontology/issues/700 pull request: https://github.com/OpenEnergyPlatform/ontology/pull/710

is traded at
type: ObjectProperty
sub property of: topObjectProperty
inverse of: trades
domain: product
range: market exchange
definition: Is traded at is a relation that holds between a product and a market exchange where the product is offered for trade/sale at the market exchange.
term tracker annotation: pull request: https://github.com/OpenEnergyPlatform/ontology/pull/748 change range: issue: https://github.com/OpenEnergyPlatform/ontology/issues/791 pull request: https://github.com/OpenEnergyPlatform/ontology/pull/842 add domain: issue: https://github.com/OpenEnergyPlatform/ontology/issues/973 pull request: https://github.com/OpenEnergyPlatform/ontology/pull/1127 Simplify domain and range by using product: issue: https://github.com/OpenEnergyPlatform/ontology/issues/1239 pull request: https://github.com/OpenEnergyPlatform/ontology/pull/1912

Axiom
annotated source: is traded at
annotated property: domain
annotated target: product
editor note: Extension of domain to financial instrument and other products planned

trades
type: ObjectProperty
sub property of: topObjectProperty
domain: market exchange
range: product
definition: A relation that holds between a product and a market exchange.
term tracker annotation: pull request: https://github.com/OpenEnergyPlatform/ontology/pull/748 add domain and range: issue: https://github.com/OpenEnergyPlatform/ontology/issues/973 pull request: https://github.com/OpenEnergyPlatform/ontology/pull/1127 Simplify domain and range by using product: issue: https://github.com/OpenEnergyPlatform/ontology/issues/1239 pull request: https://github.com/OpenEnergyPlatform/ontology/pull/1912

obsolete economic value of
type: ObjectProperty
sub property of: quantity value of
domain: obsolete economic value
definition: OBSOLETE: A relation that relates an economic value to a related entity in reality.
comment: This relation was made obsolete together with economic value because its definition is rather vague and thus not useful.
deprecated: true
term tracker annotation: issue: https://github.com/OpenEnergyPlatform/ontology/issues/958 pull request: https://github.com/OpenEnergyPlatform/ontology/pull/1034 Make subproperty of 'quantity value of' and add domain: issue: https://github.com/OpenEnergyPlatform/ontology/issues/1411 pull request: https://github.com/OpenEnergyPlatform/ontology/pull/1422 Obsoletion issue: https://github.com/OpenEnergyPlatform/ontology/issues/1917 pull request: https://github.com/OpenEnergyPlatform/ontology/pull/1931

obsolete has economic value
type: ObjectProperty
sub property of: has quantity value
range: obsolete economic value
definition: OBSOLETE: A relation between an entity and an economic value.
comment: This relation was made obsolete together with economic value because its definition is rather vague and thus not useful.
deprecated: true
term tracker annotation: issue: https://github.com/OpenEnergyPlatform/ontology/issues/958 pull request: https://github.com/OpenEnergyPlatform/ontology/pull/1034 Make subproperty of 'has quatity value' and add range: issue: https://github.com/OpenEnergyPlatform/ontology/issues/1411 pull request: https://github.com/OpenEnergyPlatform/ontology/pull/1422 Obsoletion issue: https://github.com/OpenEnergyPlatform/ontology/issues/1917 pull request: https://github.com/OpenEnergyPlatform/ontology/pull/1931

is energy participant of
type: ObjectProperty
inverse of: has energy participant
domain: energy
range: Class
  union of: process
  union of: artificial object
definition: A relation between an energy and an artificial object or a process, where the energy is used in the artificial object or process.
term tracker annotation: issue: https://github.com/OpenEnergyPlatform/ontology/issues/1057 pull request: https://github.com/OpenEnergyPlatform/ontology/pull/1065 move to oeo-shared: issue: https://github.com/OpenEnergyPlatform/ontology/issues/1384 pull request: https://github.com/OpenEnergyPlatform/ontology/pull/1390 rework module structure issue: https://github.com/OpenEnergyPlatform/ontology/issues/1592 pull request: https://github.com/OpenEnergyPlatform/ontology/pull/1652

is energy input to
type: ObjectProperty
sub property of: is energy participant of
definition: A relation between an energy and an artificial object or a process, where the energy is an input of the artificial object or process.
term tracker annotation: issue: https://github.com/OpenEnergyPlatform/ontology/issues/1057 pull request: https://github.com/OpenEnergyPlatform/ontology/pull/1065

is energy output of
type: ObjectProperty
sub property of: is energy participant of
definition: A relation between an energy and an artificial object or a process, where the energy is an output of the artificial object or process.
term tracker annotation: issue: https://github.com/OpenEnergyPlatform/ontology/issues/1057 pull request: https://github.com/OpenEnergyPlatform/ontology/pull/1065

has licence
type: ObjectProperty
sub property of: is subject of
domain: information content entity
range: licence
definition: A relation that holds between an information content entity and a licence.
alternative label: has license
term tracker annotation: issue https://github.com/OpenEnergyPlatform/ontology/issues/1061 pull request https://github.com/OpenEnergyPlatform/ontology/pull/1090 Relabel, redefine and add domain and range: issue: https://github.com/OpenEnergyPlatform/ontology/issues/1275 pull request: https://github.com/OpenEnergyPlatform/ontology/pull/1547

information input of
type: ObjectProperty
sub property of: input of
domain: information content entity
range: process
definition: c is an information input of p iff: c is an input of p, and c is an information content entity
term tracker annotation: issue: https://github.com/OpenEnergyPlatform/ontology/issues/1091 pull request: https://github.com/OpenEnergyPlatform/ontology/pull/1113

information output of
type: ObjectProperty
sub property of: output of
domain: information content entity
range: process
definition: c is an information output of p iff: c is an output of p, and c is an information content entity
term tracker annotation: issue: https://github.com/OpenEnergyPlatform/ontology/issues/1091 pull request: https://github.com/OpenEnergyPlatform/ontology/pull/1113

has study region
type: ObjectProperty
sub property of: has spatial region
domain: scenario
range: study region
definition: An is-about-relation between a scenario and a study region to indicate the study region of a scenario.
term tracker annotation: issue: https://github.com/OpenEnergyPlatform/ontology/issues/1335 pull request: https://github.com/OpenEnergyPlatform/ontology/pull/1347 Make subproperty of 'has spatial region': issue: https://github.com/OpenEnergyPlatform/ontology/issues/1404 pull request: https://github.com/OpenEnergyPlatform/ontology/pull/1441

has considered region
type: ObjectProperty
sub property of: has spatial region
domain: scenario
range: considered region
definition: An is-about-relation between a scenario and a considered region to indicated a considered region of a scenario.
term tracker annotation: issue: https://github.com/OpenEnergyPlatform/ontology/issues/1335 pull request: https://github.com/OpenEnergyPlatform/ontology/pull/1347 Make subproperty of 'has spatial region': issue: https://github.com/OpenEnergyPlatform/ontology/issues/1404 pull request: https://github.com/OpenEnergyPlatform/ontology/pull/1441

has interacting region
type: ObjectProperty
sub property of: has spatial region
domain: scenario
range: interacting region
definition: An is-about-relation between a scenario and an interacting region to indicate an interacting region of a scenario.
term tracker annotation: issue: https://github.com/OpenEnergyPlatform/ontology/issues/1335 pull request: https://github.com/OpenEnergyPlatform/ontology/pull/1347 Make subproperty of 'has spatial region': issue: https://github.com/OpenEnergyPlatform/ontology/issues/1404 pull request: https://github.com/OpenEnergyPlatform/ontology/pull/1441

has study subregion
type: ObjectProperty
sub property of: has spatial region
domain: scenario
range: study subregion
definition: An is-about-relation between a scenario and a study subregion to indicate a study subregion of a scenario.
term tracker annotation: issue: https://github.com/OpenEnergyPlatform/ontology/issues/1335 pull request: https://github.com/OpenEnergyPlatform/ontology/pull/1347 Make subproperty of 'has spatial region': issue: https://github.com/OpenEnergyPlatform/ontology/issues/1404 pull request: https://github.com/OpenEnergyPlatform/ontology/pull/1441

has scenario year
type: ObjectProperty
sub property of: is about
domain: scenario
range: scenario year
definition: An is-about-relation between a scenario and a scenario year to indicate the scenario year of a scenario.
term tracker annotation: issue: https://github.com/OpenEnergyPlatform/ontology/issues/1335 pull request: https://github.com/OpenEnergyPlatform/ontology/pull/1347

is based on
type: ObjectProperty
sub property of: has participant
domain: Class
  union of: scenario study
  union of: scenario projection
range: scenario
definition: A relation between a scenario study or projection and a scenario, that indicates the scenario that provides the assumptions on which the respective scenario study or projection is based on.
term tracker annotation: issue: https://github.com/OpenEnergyPlatform/ontology/issues/1346 pull request: https://github.com/OpenEnergyPlatform/ontology/pull/1391

has main energy input
type: ObjectProperty
sub property of: has energy input
domain: process
range: energy
definition: A relation between a process p and a kind of energy e, where e is required as major energy input for p.
term tracker annotation: issue: https://github.com/OpenEnergyPlatform/ontology/issues/1530 pull request: https://github.com/OpenEnergyPlatform/ontology/pull/1564

has auxilary energy input
type: ObjectProperty
sub property of: has energy input
domain: process
range: energy
definition: A relation between a process p and a kind of energy e, where e is required as input for p, but not as main input.
term tracker annotation: issue: https://github.com/OpenEnergyPlatform/ontology/issues/1530 pull request: https://github.com/OpenEnergyPlatform/ontology/pull/1564

has main energy output
type: ObjectProperty
sub property of: has energy output
domain: process
range: energy
definition: A relation between a process p and a kind of energy e, where e is the intended energy output of p, e.g. for further usage.
term tracker annotation: issue: https://github.com/OpenEnergyPlatform/ontology/issues/1530 pull request: https://github.com/OpenEnergyPlatform/ontology/pull/1564

has waste energy output
type: ObjectProperty
sub property of: has energy output
domain: process
range: energy
definition: A relation between a process p and a kind of energy e, where e is an unintended, unwanted or unevitable output of p, e.g. waste heat.
term tracker annotation: issue: https://github.com/OpenEnergyPlatform/ontology/issues/1530 pull request: https://github.com/OpenEnergyPlatform/ontology/pull/1564

has prefix
type: ObjectProperty
sub property of: has part
domain: unit
range: prefix
definition: A relation between a unit and a prefix that indicate the magnitude of the unit.
may be identical to: http://purl.obolibrary.org/obo/has_prefix
term tracker annotation: issue: https://github.com/OpenEnergyPlatform/ontology/issues/1402 pull request: https://github.com/OpenEnergyPlatform/ontology/pull/1835 change domain to oeo:unit issue: https://github.com/OpenEnergyPlatform/ontology/issues/2135 pull request: https://github.com/OpenEnergyPlatform/ontology/pull/2141

covers energy carrier (shortcut)
type: ObjectProperty
sub property of: topObjectProperty
domain: scenario bundle
range: energy carrier
definition: A relation between a scenario bundle and an energy carrier that is covered by the study the scenario bundle is about. It is a shortcut relation, see elucidation and associated sparql axiom.
elucidation: This is a shortcut relation to relate 'scenatio bundle' to 'energy carrier'. The original relation 'covers energy carrier' relates 'study' (process) to 'energy carrier'. The shortcut relation should be used to represents these statements: ('scenario bundle 'is about' some 'scenario study'`) and ('scenario study' 'covers energy carrier' some 'energy carrier')
term tracker annotation: issue: https://github.com/OpenEnergyPlatform/ontology/issues/2013 pull request: https://github.com/OpenEnergyPlatform/ontology/pull/2023 move to oeo-shared issue: https://github.com/OpenEnergyPlatform/ontology/issues/2119 pull request: https://github.com/OpenEnergyPlatform/ontology/pull/2122 move domain and range to oeo-shared-axioms issue: https://github.com/OpenEnergyPlatform/ontology/issues/2119 pull request: https://github.com/OpenEnergyPlatform/ontology/pull/2195
has associated axiom(sparql): SELECT ?scenariobundle ?energycarrier WHERE { ?scenariobundle IAO:0000136 _:1. _:1 OEO:00000523 ?energycarrier. }

has information output (shortcut)
type: ObjectProperty
sub property of: topObjectProperty
domain: scenario factsheet
range: data set
definition: A relation between a scenario factsheet and a dataset, where the dataset is an output of the scenario projection process the scenario factsheet is about. It is a shortcut relation, see elucidation and associated sparql axiom.
elucidation: This is a shortcut relation to relate 'scenatio factsheet' to 'data set'. The original relation 'has information output' relates 'scenario projection' (process) to 'data set'. The shortcut relation should be used to represents these statements: ('scenario factsheet' 'is about' some scenario) and ('scenario projection' 'is based on' some scenario) and ('scenario projection' 'has information output' some dataset)
term tracker annotation: issue: https://github.com/OpenEnergyPlatform/ontology/issues/2013 pull request: https://github.com/OpenEnergyPlatform/ontology/pull/2023 move to oeo-shared issue: https://github.com/OpenEnergyPlatform/ontology/issues/2119 pull request: https://github.com/OpenEnergyPlatform/ontology/pull/2122 move domain to oeo-shared-axioms issue: https://github.com/OpenEnergyPlatform/ontology/issues/2119 pull request: https://github.com/OpenEnergyPlatform/ontology/pull/2195
has associated axiom(sparql): select ?scenariofactsheet ?dataset where { ?scenariofactsheet IAO:0000136 _:1. _:2 OEO:00020226 _:1. _:2 OEO_00140094 ?dataset. }

has information input (shortcut)
type: ObjectProperty
domain: scenario factsheet
range: data set
elucidation: This is a shortcut relation to relate 'scenatio factsheet' to 'data set'. The original relation 'has information input' relates 'scenario projection' (process) to 'data set'. The shortcut relation should be used to represents these statements: ('scenario factsheet' 'is about' some scenario) and ('scenario projection' 'is based on' some scenario) and ('scenario projection' 'has information input' some dataset)
term tracker annotation: issue: https://github.com/OpenEnergyPlatform/ontology/issues/2013 pull request: https://github.com/OpenEnergyPlatform/ontology/pull/2023 move to oeo-shared issue: https://github.com/OpenEnergyPlatform/ontology/issues/2119 pull request: https://github.com/OpenEnergyPlatform/ontology/pull/2122 move domain to oeo-shared-axioms issue: https://github.com/OpenEnergyPlatform/ontology/issues/2119 pull request: https://github.com/OpenEnergyPlatform/ontology/pull/2195
has associated axiom(sparql): select ?scenariofactsheet ?dataset where { ?scenariofactsheet IAO:0000136 _:1. _:2 OEO:00020226 _:1. _:2 OEO_00140093 ?dataset. }
definition source: A relation between a scenario factsheet and a dataset, where the dataset is an input to the scenario projection process the scenario factsheet is about. It is a shortcut relation, see elucidation and associated sparql axiom.

covers technology (shortcut)
type: ObjectProperty
sub property of: topObjectProperty
domain: scenario bundle
range: technology
definition: A relation between a scenario bundle and a technology that is covered by the study the scenario bundle is about. It is a shortcut relation, see elucidation and associated sparql axiom.
elucidation: This is a shortcut relation to relate 'scenario bundle' to 'technology'. The original relation 'covers technology' relates 'study' (process) to 'technology'. The shortcut relation should be used to represents these statements: ('scenario bundle 'is about' some 'scenario study'`) and ('scenario study' 'covers technology' some 'technology')
term tracker annotation: issue: https://github.com/OpenEnergyPlatform/ontology/issues/2013 pull request: https://github.com/OpenEnergyPlatform/ontology/pull/2023 move to oeo-shared issue: https://github.com/OpenEnergyPlatform/ontology/issues/2119 pull request: https://github.com/OpenEnergyPlatform/ontology/pull/2122 move domain and range to oeo-shared-axioms issue: https://github.com/OpenEnergyPlatform/ontology/issues/2119 pull request: https://github.com/OpenEnergyPlatform/ontology/pull/2195
has associated axiom(sparql): SELECT ?scenariobundle ?technology WHERE { ?scenariobundle IAO:0000136 _:1. _:1 OEO:00390101 ?technology. }

has unit
type: ObjectProperty
domain: quantity value
range: unit
definition: A property that links a quantity value to a unit in which the quantity value has been expressed.
term tracker annotation: change range to oeo:unit issue: https://github.com/OpenEnergyPlatform/ontology/issues/2135 pull request: https://github.com/OpenEnergyPlatform/ontology/pull/2141

has quantity value
type: ObjectProperty
sub property of: is subject of
range: quantity value
definition: A relation between an entity and a quantity value.
term tracker annotation: issue: https://github.com/OpenEnergyPlatform/ontology/issues/505 pull request: https://github.com/OpenEnergyPlatform/ontology/pull/509

Axiom
annotated source: has quantity value
annotated property: subPropertyOf
annotated target: is subject of
term tracker annotation: issue: https://github.com/OpenEnergyPlatform/ontology/issues/858 pull request: https://github.com/OpenEnergyPlatform/ontology/pull/965

Axiom
annotated source: has quantity value
annotated property: range
annotated target: quantity value
comment: issue: https://github.com/OpenEnergyPlatform/ontology/issues/850 pull request: https://github.com/OpenEnergyPlatform/ontology/pull/871

has contributor
type: ObjectProperty
domain: Class
  union of: information content entity
  union of: model
range: continuant
definition: A relation between an information content entity / model and a continuant, in which the continuant is somehow involved in the creation of the information content entity / model.
term tracker annotation: issue: https://github.com/OpenEnergyPlatform/ontology/issues/530 pull request: https://github.com/OpenEnergyPlatform/ontology/pull/556 pull request: https://github.com/OpenEnergyPlatform/ontology/pull/626 (extend def for information content entity) pull request: https://github.com/OpenEnergyPlatform/ontology/pull/871 (domain and range; move to oeo-shared) rework module structure issue: https://github.com/OpenEnergyPlatform/ontology/issues/1592 pull request: https://github.com/OpenEnergyPlatform/ontology/pull/1652 change domain issue: https://github.com/OpenEnergyPlatform/ontology/issues/1444 pull request: https://github.com/OpenEnergyPlatform/ontology/pull/1707

member of
type: ObjectProperty
domain: person
range: organisation
definition: A relation between a person and an organisation where the person is a member of the organisation.
term tracker annotation: issue: https://github.com/OpenEnergyPlatform/ontology/issues/486 pull request: https://github.com/OpenEnergyPlatform/ontology/pull/562
term tracker annotation: issue: https://github.com/OpenEnergyPlatform/ontology/issues/486 pull request: https://github.com/OpenEnergyPlatform/ontology/pull/562 move to oeo-sector issue: https://github.com/OpenEnergyPlatform/ontology/issues/1399 pull request: https://github.com/OpenEnergyPlatform/ontology/pull/1724

has member
type: ObjectProperty
sub property of: topObjectProperty
domain: organisation
range: person
definition: A relation between an organisation and a person where the person is a member of the organisation.
term tracker annotation: issue: https://github.com/OpenEnergyPlatform/ontology/issues/486 pull request: https://github.com/OpenEnergyPlatform/ontology/pull/562

has information input
type: ObjectProperty
sub property of: has input
domain: process
range: information content entity
definition: p has information input c iff: p has input c, and c is an information content entity
term tracker annotation: issue: https://github.com/OpenEnergyPlatform/ontology/issues/618 pull request: https://github.com/OpenEnergyPlatform/ontology/pull/716 moved to oeo-shared pull request: https://github.com/OpenEnergyPlatform/ontology/pull/1113

has information output
type: ObjectProperty
sub property of: has output
domain: process
range: information content entity
definition: p has information output c iff: p has output c, and c is an information content entity
term tracker annotation: issue: https://github.com/OpenEnergyPlatform/ontology/issues/618 pull request: https://github.com/OpenEnergyPlatform/ontology/pull/716 moved to oeo-shared pull request: https://github.com/OpenEnergyPlatform/ontology/pull/1113

has typical computation time
type: ObjectProperty
sub property of: has quantity value
domain: Class
  union of: software
  union of: algorithm
range: time span
definition: A relation between an algorithm or a software and the typical duration of its execution.
term tracker annotation: issue: https://github.com/OpenEnergyPlatform/ontology/issues/527 pull request: https://github.com/OpenEnergyPlatform/ontology/pull/723

has typical computation hardware
type: ObjectProperty
sub property of: uses
domain: Class
  union of: software
  union of: algorithm
range: hardware
definition: A relation between an algorithm or a software and the typical hardware used for its execution.
term tracker annotation: issue: https://github.com/OpenEnergyPlatform/ontology/issues/527 pull request: https://github.com/OpenEnergyPlatform/ontology/pull/723 move axiom to shared-axioms issue: https://github.com/OpenEnergyPlatform/ontology/issues/1703 pull request: https://github.com/OpenEnergyPlatform/ontology/pull/1706

Axiom
annotated source: has typical computation hardware
annotated property: range
annotated target: hardware
term tracker annotation: issue: https://github.com/OpenEnergyPlatform/ontology/issues/749 pull request: https://github.com/OpenEnergyPlatform/ontology/pull/751

models
type: ObjectProperty
domain: model
definition: A relation between a model and the thing it reproduces.
term tracker annotation: issue: https://github.com/OpenEnergyPlatform/ontology/issues/415 pull request: https://github.com/OpenEnergyPlatform/ontology/pull/821 rework module structure issue: https://github.com/OpenEnergyPlatform/ontology/issues/1592 pull request: https://github.com/OpenEnergyPlatform/ontology/pull/1652 change domain issue: https://github.com/OpenEnergyPlatform/ontology/issues/1444 pull request: https://github.com/OpenEnergyPlatform/ontology/pull/1707 change range and domain issue:https://github.com/OpenEnergyPlatform/ontology/issues/1060 pull request: https://github.com/OpenEnergyPlatform/ontology/pull/2007

has gross output
type: ObjectProperty
sub property of: has energy output
domain: Class
  union of: process
  union of: artificial object
range: energy
definition: p has gross output c iff: p has energy output c, and c is the total amount of energy generated during the process.
term tracker annotation: issue: https://github.com/OpenEnergyPlatform/ontology/issues/394 pull request: https://github.com/OpenEnergyPlatform/ontology/pull/838 make subproperty of 'has energy output' and add domain: issue: https://github.com/OpenEnergyPlatform/ontology/issues/994 pull request: https://github.com/OpenEnergyPlatform/ontology/pull/1006

has net output
type: ObjectProperty
sub property of: has energy output
domain: Class
  union of: process
  union of: artificial object
range: energy
definition: p has net output c iff: p has energy output c, and c is the amount of energy delivered to the consumer or fed into a supply grid.
term tracker annotation: issue: https://github.com/OpenEnergyPlatform/ontology/issues/394 pull request: https://github.com/OpenEnergyPlatform/ontology/pull/838 make subproperty of 'has energy output' and add domain: issue: https://github.com/OpenEnergyPlatform/ontology/issues/994 pull request: https://github.com/OpenEnergyPlatform/ontology/pull/1006

physical output of
type: ObjectProperty
sub property of: output of
domain: material entity
range: process
definition: c is physical output of p iff: c output of p, and c is a material entity
term tracker annotation: issue: https://github.com/OpenEnergyPlatform/ontology/issues/1053 pull request: https://github.com/OpenEnergyPlatform/ontology/pull/1082 move to oeo-shared: issue: https://github.com/OpenEnergyPlatform/ontology/issues/1384 pull request: https://github.com/OpenEnergyPlatform/ontology/pull/1390

has aggregation type
type: ObjectProperty
definition: A relation between a data item or data set and an aggregation type that indicates the method of data aggregation applied to the data set.
term tracker annotation: Added issue: https://github.com/OpenEnergyPlatform/ontology/issues/1901 pull request: https://github.com/OpenEnergyPlatform/ontology/pull/1944

has time stamp alignment
type: ObjectProperty
definition: A relation between a time stamp or time series and a time stamp alignment that indicates the position of the time stamps that refer to the time step(s).
term tracker annotation: Added issue: https://github.com/OpenEnergyPlatform/ontology/issues/1901 pull request: https://github.com/OpenEnergyPlatform/ontology/pull/1944

structured by
type: ObjectProperty
sub property of: has participant
domain: process
range: plan specification
definition: A relationship between a process and a plan specification, in which the process is predefined or planned by the plan specification.
term tracker annotation: Add: issue: https://github.com/OpenEnergyPlatform/ontology/issues/1891 pull request: https://github.com/OpenEnergyPlatform/ontology/pull/1940

has study descriptor tag
type: ObjectProperty
domain: scenario bundle
range: entity
definition: has study descriptor tag is a relation between a scenario bundle and an oeo class which is used as a study descriptor.
elucidation: OEO classes that are used as study descriptors are annotated by the annotation property "oekg annotation" with value "study descriptor".
term tracker annotation: add issue: https://github.com/OpenEnergyPlatform/ontology/issues/2013 pull request: https://github.com/OpenEnergyPlatform/ontology/pull/2020

has scenario type
type: ObjectProperty
domain: scenario factsheet
range: scenario
definition: has scenario type is a relation between a scenario factsheet and a subclass of scenario.
term tracker annotation: add issue: https://github.com/OpenEnergyPlatform/ontology/issues/2013 pull request: https://github.com/OpenEnergyPlatform/ontology/pull/2020

has reference
type: ObjectProperty
domain: continuant
range: reference
example of usage: http://openenergyplatform.org/ontology/oekg/region/Albania has reference https://www.omg.org/spec/LCC/Countries/ISO3166-1-CountryCodes/Albania Here the region Albania in the oekg references the region Albania in the LCC ontology. In the same way any continuant may link to a document it is referencing.
definition: has reference is the relation between a continuant and a reference that points to a relevant resource to the continuant.
term tracker annotation: add issue: https://github.com/OpenEnergyPlatform/ontology/issues/2013 pull request: https://github.com/OpenEnergyPlatform/ontology/pull/2020

based on sector division
type: ObjectProperty
domain: scenario bundle
range: sector division
definition: based on sector division is a relation between a scenario bundle and a sector division it is based on.
term tracker annotation: add issue: https://github.com/OpenEnergyPlatform/ontology/issues/2013 pull request: https://github.com/OpenEnergyPlatform/ontology/pull/2020 move to oeo-shared issue: https://github.com/OpenEnergyPlatform/ontology/issues/2119 pull request: https://github.com/OpenEnergyPlatform/ontology/pull/2122 move domain and range to oeo-shared-axioms issue: https://github.com/OpenEnergyPlatform/ontology/issues/2119 pull request: https://github.com/OpenEnergyPlatform/ontology/pull/2195

covers technology
type: ObjectProperty
sub property of: covers
domain: study
range: technology
definition: covers technology is a relation that holds between a study and a technology covered in the study.
term tracker annotation: add issue: https://github.com/OpenEnergyPlatform/ontology/issues/2013 pull request: https://github.com/OpenEnergyPlatform/ontology/pull/2020

has uncertainty nature
type: ObjectProperty
sub property of: has quality
domain: OEO_00400012
range: OEO_00400013
definition: A relation between an uncertainty of a model (x) and a nature of model uncertainty (z) that indicates x is of kind z.
definition source: https://www.researchgate.net/publication/264816512_Classifying_and_communicating_uncertainties_in_model-based_policy_analysis
term tracker item: issue: https://github.com/OpenEnergyPlatform/ontology/issues/1829 pull request: https://github.com/OpenEnergyPlatform/ontology/pull/1945

has uncertainty level
type: ObjectProperty
sub property of: has quality
domain: OEO_00400012
range: OEO_00400017
definition: A relation between an uncertainty of a model (x) and a level of model uncertainty (y) that indicates the degree or severity y of x.
definition source: https://www.researchgate.net/publication/264816512_Classifying_and_communicating_uncertainties_in_model-based_policy_analysis
term tracker item: issue: https://github.com/OpenEnergyPlatform/ontology/issues/1829 pull request: https://github.com/OpenEnergyPlatform/ontology/pull/1945

has uncertainty location
type: ObjectProperty
domain: OEO_00400012
definition: A relation between an uncertainty of a model (x) and a location of model uncertainty (y) that indicates x is located in y.
definition: issue: https://github.com/OpenEnergyPlatform/ontology/issues/1829 pull request: https://github.com/OpenEnergyPlatform/ontology/pull/1945
definition source: https://www.researchgate.net/publication/264816512_Classifying_and_communicating_uncertainties_in_model-based_policy_analysis

has energy participant
type: ObjectProperty
domain: Class
  union of: process
  union of: artificial object
range: energy
definition: A relation between an artificial object or a process and an energy, where the energy is used in the artificial object or process.
term tracker annotation: issue: https://github.com/OpenEnergyPlatform/ontology/issues/994 pull request: https://github.com/OpenEnergyPlatform/ontology/pull/1006 move to oeo-shared: issue: https://github.com/OpenEnergyPlatform/ontology/issues/1384 pull request: https://github.com/OpenEnergyPlatform/ontology/pull/1390 rework module structure issue: https://github.com/OpenEnergyPlatform/ontology/issues/1592 pull request: https://github.com/OpenEnergyPlatform/ontology/pull/1652

has process part
type: ObjectProperty
sub property of: has occurrent part
inverse of: is part of process
definition: x has_process_part y iff x and y are instances of Process, such that y occurs during the temporal interval of x, and y either provides an input to x or receives an output of x, or both.
term tracker annotation: issue https://github.com/OpenEnergyPlatform/ontology/issues/2014 pull request: https://github.com/OpenEnergyPlatform/ontology/pull/2016
is curated in ontology: https://www.commoncoreontologies.org/ExtendedRelationOntology

Axiom
annotated source: has process part
annotated property: label
annotated target: has process part

Axiom
annotated source: has process part
annotated property: definition
annotated target: x has_process_part y iff x and y are instances of Process, such that y occurs during the temporal interval of x, and y either provides an input to x or receives an output of x, or both.

is cause of
type: ObjectProperty
definition: x is_cause_of y iff x and y are instances of Occurrent, and y is a consequence of x.
is curated in ontology: https://www.commoncoreontologies.org/ExtendedRelationOntology

Axiom
annotated source: is cause of
annotated property: label
annotated target: is cause of

Axiom
annotated source: is cause of
annotated property: definition
annotated target: x is_cause_of y iff x and y are instances of Occurrent, and y is a consequence of x.

caused by
type: ObjectProperty
definition: x caused_by y iff x and y are instances of Occurrent, and x is a consequence of y.
term tracker annotation: issue https://github.com/OpenEnergyPlatform/ontology/issues/2014 pull request: https://github.com/OpenEnergyPlatform/ontology/pull/2016
is curated in ontology: https://www.commoncoreontologies.org/ExtendedRelationOntology

Axiom
annotated source: caused by
annotated property: label
annotated target: caused by

Axiom
annotated source: caused by
annotated property: definition
annotated target: x caused_by y iff x and y are instances of Occurrent, and x is a consequence of y.

is part of process
type: ObjectProperty
sub property of: occurrent part of
definition: x is_part_of_process y iff x and y are instances of Process, such that x occurs during the temporal interval of y, and x either provides an input to y or receives an output of y.
term tracker annotation: issue https://github.com/OpenEnergyPlatform/ontology/issues/2014 pull request: https://github.com/OpenEnergyPlatform/ontology/pull/2016
is curated in ontology: https://www.commoncoreontologies.org/ExtendedRelationOntology

Axiom
annotated source: is part of process
annotated property: label
annotated target: is part of process

Axiom
annotated source: is part of process
annotated property: definition
annotated target: x is_part_of_process y iff x and y are instances of Process, such that x occurs during the temporal interval of y, and x either provides an input to y or receives an output of y.

represented by
type: ObjectProperty
sub property of: is subject of
inverse of: represents
comment: See notes for inverse property.
definition: y represented_by x iff x is an instance of Information Content Entity, and y is an instance of Entity, and z is carrier of x, such that x is about y in virtue of there existing an isomorphism between characteristics of z and y.
is curated in ontology: https://www.commoncoreontologies.org/InformationEntityOntology

Axiom
annotated source: represented by
annotated property: comment
annotated target: See notes for inverse property.

Axiom
annotated source: represented by
annotated property: label
annotated target: represented by

Axiom
annotated source: represented by
annotated property: definition
annotated target: y represented_by x iff x is an instance of Information Content Entity, and y is an instance of Entity, and z is carrier of x, such that x is about y in virtue of there existing an isomorphism between characteristics of z and y.

designated by
type: ObjectProperty
sub property of: is subject of
inverse of: designates
definition: x designated_by y iff y is an instance of Information Content Entity and x is an instance of Entity, such that given some context, y uniquely distinguishes x from other entities.
is curated in ontology: https://www.commoncoreontologies.org/InformationEntityOntology

Axiom
annotated source: designated by
annotated property: label
annotated target: designated by

Axiom
annotated source: designated by
annotated property: definition
annotated target: x designated_by y iff y is an instance of Information Content Entity and x is an instance of Entity, such that given some context, y uniquely distinguishes x from other entities.

designates
type: ObjectProperty
sub property of: is about
definition: x designates y iff x is an instance of an Information Content Entity, and y is an instance of an Entity, such that given some context, x uniquely distinguishes y from other entities.
example: a URL designates the location of a Web Page on the internet
example: a person's name designates that person
example: a vehicle identification number designates some vehicle
scope note: Given a stronger temporal interpretation, this property may be functional. For more info please refer to https://github.com/BFO-ontology/BFO-2020/tree/master/src/owl/temporal%20extensions.
is curated in ontology: https://www.commoncoreontologies.org/InformationEntityOntology

Axiom
annotated source: designates
annotated property: label
annotated target: designates

Axiom
annotated source: designates
annotated property: definition
annotated target: x designates y iff x is an instance of an Information Content Entity, and y is an instance of an Entity, such that given some context, x uniquely distinguishes y from other entities.

Axiom
annotated source: designates
annotated property: example
annotated target: a URL designates the location of a Web Page on the internet

Axiom
annotated source: designates
annotated property: example
annotated target: a person's name designates that person

Axiom
annotated source: designates
annotated property: example
annotated target: a vehicle identification number designates some vehicle

Axiom
annotated source: designates
annotated property: scopeNote
annotated target: Given a stronger temporal interpretation, this property may be functional. For more info please refer to https://github.com/BFO-ontology/BFO-2020/tree/master/src/owl/temporal%20extensions.

described by
type: ObjectProperty
sub property of: is subject of
inverse of: describes
definition: x described_by y iff y is an instance of Information Content Entity, and x is an instance of Entity, such that y is about the characteristics by which y can be recognized or visualized.
is curated in ontology: https://www.commoncoreontologies.org/InformationEntityOntology

Axiom
annotated source: described by
annotated property: label
annotated target: described by

Axiom
annotated source: described by
annotated property: definition
annotated target: x described_by y iff y is an instance of Information Content Entity, and x is an instance of Entity, such that y is about the characteristics by which y can be recognized or visualized.

prescribed by
type: ObjectProperty
sub property of: is subject of
inverse of: prescribes
definition: x prescribed_by y iff y is an instance of Information Content Entity and x is an instance of Entity, such that y serves as a rule or guide for x if x is an Occurrent, or y serves as a model for x if x is a Continuant.
is curated in ontology: https://www.commoncoreontologies.org/InformationEntityOntology

Axiom
annotated source: prescribed by
annotated property: label
annotated target: prescribed by

Axiom
annotated source: prescribed by
annotated property: definition
annotated target: x prescribed_by y iff y is an instance of Information Content Entity and x is an instance of Entity, such that y serves as a rule or guide for x if x is an Occurrent, or y serves as a model for x if x is a Continuant.

represents
type: ObjectProperty
sub property of: is about
comment: Isomorphism between the carrier of x and the represented entity can be via a direct similarity relation, e.g., grooves in a vinyl record corresponding to sound waves, or linguistic convention, e.g., a court stenographer's transcription of spoken words, as well as others, such as encoding processes for images.
definition: x represents y iff x is an instance of Information Content Entity, y is an instance of Entity, and z is carrier of x, such that x is about y in virtue of there existing an isomorphism between characteristics of z and y.
scope note: Given a stronger temporal interpretation, this property may be functional. For more info please refer to https://github.com/BFO-ontology/BFO-2020/tree/master/src/owl/temporal%20extensions.
scope note: The relationship that is being defined here is that between the content of a photographic image and its object, between the content of a video and its objects and events, between the content of an audio recording and the sounds or events generating those sounds, or between the content of a written transcript and the verbal event that it transcribes.
is curated in ontology: https://www.commoncoreontologies.org/InformationEntityOntology

Axiom
annotated source: represents
annotated property: comment
annotated target: Isomorphism between the carrier of x and the represented entity can be via a direct similarity relation, e.g., grooves in a vinyl record corresponding to sound waves, or linguistic convention, e.g., a court stenographer's transcription of spoken words, as well as others, such as encoding processes for images.

Axiom
annotated source: represents
annotated property: label
annotated target: represents

Axiom
annotated source: represents
annotated property: definition
annotated target: x represents y iff x is an instance of Information Content Entity, y is an instance of Entity, and z is carrier of x, such that x is about y in virtue of there existing an isomorphism between characteristics of z and y.

Axiom
annotated source: represents
annotated property: scopeNote
annotated target: Given a stronger temporal interpretation, this property may be functional. For more info please refer to https://github.com/BFO-ontology/BFO-2020/tree/master/src/owl/temporal%20extensions.

Axiom
annotated source: represents
annotated property: scopeNote
annotated target: The relationship that is being defined here is that between the content of a photographic image and its object, between the content of a video and its objects and events, between the content of an audio recording and the sounds or events generating those sounds, or between the content of a written transcript and the verbal event that it transcribes.

prescribes
type: ObjectProperty
sub property of: is about
definition: x prescribes y iff x is an instance of Information Content Entity and y is an instance of Entity, such that x serves as a rule or guide for y if y an Occurrent, or x serves as a model for y if y is a Continuant.
example: A blueprint prescribes some artifact or facility by being a model for it.
example: A professional code of conduct prescribes some realizations of a profession (role) by giving rules for how the bearer should act in those realizations.
example: An operations plan prescribes an operation by enumerating the tasks that need to be performed in order to achieve the objectives of the operation.
is curated in ontology: https://www.commoncoreontologies.org/InformationEntityOntology

Axiom
annotated source: prescribes
annotated property: label
annotated target: prescribes

Axiom
annotated source: prescribes
annotated property: definition
annotated target: x prescribes y iff x is an instance of Information Content Entity and y is an instance of Entity, such that x serves as a rule or guide for y if y an Occurrent, or x serves as a model for y if y is a Continuant.

Axiom
annotated source: prescribes
annotated property: example
annotated target: A blueprint prescribes some artifact or facility by being a model for it.

Axiom
annotated source: prescribes
annotated property: example
annotated target: A professional code of conduct prescribes some realizations of a profession (role) by giving rules for how the bearer should act in those realizations.

Axiom
annotated source: prescribes
annotated property: example
annotated target: An operations plan prescribes an operation by enumerating the tasks that need to be performed in order to achieve the objectives of the operation.

describes
type: ObjectProperty
sub property of: is about
comment: It is possible that this relation should be a functional property, that is for all x, y, z if x describes y and x describes z then y = z. For example, if a financial report x describes the quarterly results of a company y and that same financial report describes the quarterly results of a company z, then it should be inferred that companies y and z are the same. We refrained from classifying the relation as a functional property on the concern that descriptions are multifaceted and so consequently it may be that the same report would contain descriptions of multiple entities.
definition: x describes y iff x is an instance of Information Content Entity, and y is an instance of Entity, such that x is about the characteristics by which y can be recognized or visualized.
example: the content of a newspaper article describes some current event
example: the content of a visitor's log describes some facility visit
example: the content of an accident report describes some accident
is curated in ontology: https://www.commoncoreontologies.org/InformationEntityOntology

Axiom
annotated source: describes
annotated property: comment
annotated target: It is possible that this relation should be a functional property, that is for all x, y, z if x describes y and x describes z then y = z. For example, if a financial report x describes the quarterly results of a company y and that same financial report describes the quarterly results of a company z, then it should be inferred that companies y and z are the same. We refrained from classifying the relation as a functional property on the concern that descriptions are multifaceted and so consequently it may be that the same report would contain descriptions of multiple entities.

Axiom
annotated source: describes
annotated property: label
annotated target: describes

Axiom
annotated source: describes
annotated property: definition
annotated target: x describes y iff x is an instance of Information Content Entity, and y is an instance of Entity, such that x is about the characteristics by which y can be recognized or visualized.

Axiom
annotated source: describes
annotated property: example
annotated target: the content of a newspaper article describes some current event

Axiom
annotated source: describes
annotated property: example
annotated target: the content of a visitor's log describes some facility visit

Axiom
annotated source: describes
annotated property: example
annotated target: the content of an accident report describes some accident

has scenario year value
type: DatatypeProperty
sub property of: topDataProperty
domain: scenario factsheet
range: dateTime
definition: Has scenario year value is a relation between a scenario factsheet and a xsd:dateTime value.
comment: This data property allows for comparable and sortable annotation of scenario years in the OEKG.
term tracker annotation: add issue: https://github.com/OpenEnergyPlatform/ontology/issues/2035 pull request: https://github.com/OpenEnergyPlatform/ontology/pull/2045

has documentation quality
type: DatatypeProperty
domain: numerical computer model
definition: Has documentation quality is the relation between a model and a statement about how well it is documented.
term tracker annotation: issue: https://github.com/OpenEnergyPlatform/ontology/issues/526 pull request: https://github.com/OpenEnergyPlatform/ontology/pull/825 make data property issue: https://github.com/OpenEnergyPlatform/ontology/issues/1802 pull request: https://github.com/OpenEnergyPlatform/ontology/pull/1834

has number
type: DatatypeProperty
domain: quantity value
definition: Has number is a data property that links a quantity value to a number that defines the quantity value.
term tracker annotation: issue: https://github.com/OpenEnergyPlatform/ontology/issues/829 pull request: https://github.com/OpenEnergyPlatform/ontology/pull/840

has iri
type: DatatypeProperty
domain: Class
  union of: data item
  union of: document
range: Literal
definition: has iri is a relation between a data item or document and the IRI that identifies it as rescource on the internet.
term tracker annotation: add issue: https://github.com/OpenEnergyPlatform/ontology/issues/2013 pull request: https://github.com/OpenEnergyPlatform/ontology/pull/2020

has uuid
type: DatatypeProperty
domain: Class
  union of: report
  union of: factsheet
range: string
definition: has uuid is the relation between a factsheet or report and the 128-bit label used to identify it in a computer system.
term tracker annotation: add issue: https://github.com/OpenEnergyPlatform/ontology/issues/2013 pull request: https://github.com/OpenEnergyPlatform/ontology/pull/2020 change range issue: https://github.com/OpenEnergyPlatform/ontology/issues/2069 pull request: https://github.com/OpenEnergyPlatform/ontology/pull/2077

has publication date
type: DatatypeProperty
domain: report
range: dateTime
definition: has publication date is the relation between a report and the year it was published in.
term tracker annotation: add issue: https://github.com/OpenEnergyPlatform/ontology/issues/2013 pull request: https://github.com/OpenEnergyPlatform/ontology/pull/2020

has doi
type: DatatypeProperty
domain: report
range: Literal
definition: has doi is the relation between a digital object and the literal representing its doi (digital object identifier).
term tracker annotation: add issue: https://github.com/OpenEnergyPlatform/ontology/issues/2013 pull request: https://github.com/OpenEnergyPlatform/ontology/pull/2020

entity
type: Class
BFO OWL specification label: entity
BFO CLIF specification label: Entity
example of usage: Julius Caesar
example of usage: Verdi’s Requiem
example of usage: the Second World War
example of usage: your body mass index
editor note: BFO 2 Reference: In all areas of empirical inquiry we encounter general terms of two sorts. First are general terms which refer to universals or types:animaltuberculosissurgical procedurediseaseSecond, are general terms used to refer to groups of entities which instantiate a given universal but do not correspond to the extension of any subuniversal of that universal because there is nothing intrinsic to the entities in question by virtue of which they – and only they – are counted as belonging to the given group. Examples are: animal purchased by the Emperortuberculosis diagnosed on a Wednesdaysurgical procedure performed on a patient from Stockholmperson identified as candidate for clinical trial #2056-555person who is signatory of Form 656-PPVpainting by Leonardo da VinciSuch terms, which represent what are called ‘specializations’ in [81
editor note: Entity doesn't have a closure axiom because the subclasses don't necessarily exhaust all possibilites. For example Werner Ceusters 'portions of reality' include 4 sorts, entities (as BFO construes them), universals, configurations, and relations. It is an open question as to whether entities as construed in BFO will at some point also include these other portions of reality. See, for example, 'How to track absolutely everything' at http://www.referent-tracking.com/_RTU/papers/CeustersICbookRevised.pdf
elucidation: An entity is anything that exists or has existed or will exist. (axiom label in BFO2 Reference: [001-001])

Axiom
annotated source: entity
annotated property: editor note
annotated target: Entity doesn't have a closure axiom because the subclasses don't necessarily exhaust all possibilites. For example Werner Ceusters 'portions of reality' include 4 sorts, entities (as BFO construes them), universals, configurations, and relations. It is an open question as to whether entities as construed in BFO will at some point also include these other portions of reality. See, for example, 'How to track absolutely everything' at http://www.referent-tracking.com/_RTU/papers/CeustersICbookRevised.pdf
has axiom label: http://purl.obolibrary.org/obo/bfo/axiom/0000004
comment: per discussion with Barry Smith

Axiom
annotated source: entity
annotated property: elucidation
annotated target: An entity is anything that exists or has existed or will exist. (axiom label in BFO2 Reference: [001-001])
has axiom label: http://purl.obolibrary.org/obo/bfo/axiom/001-001

continuant
type: Class
subclass of: entity
disjoint with: occurrent
BFO OWL specification label: continuant
BFO CLIF specification label: Continuant
definition: An entity that exists in full at any time in which it exists at all, persists through time while maintaining its identity and has no temporal parts.
editor note: BFO 2 Reference: Continuant entities are entities which can be sliced to yield parts only along the spatial dimension, yielding for example the parts of your table which we call its legs, its top, its nails. ‘My desk stretches from the window to the door. It has spatial parts, and can be sliced (in space) in two. With respect to time, however, a thing is a continuant.’ [60, p. 240
editor note: Continuant doesn't have a closure axiom because the subclasses don't necessarily exhaust all possibilites. For example, in an expansion involving bringing in some of Ceuster's other portions of reality, questions are raised as to whether universals are continuants
elucidation: A continuant is an entity that persists, endures, or continues to exist through time while maintaining its identity. (axiom label in BFO2 Reference: [008-002])
has associated axiom(nl): if b is a continuant and if, for some t, c has_continuant_part b at t, then c is a continuant. (axiom label in BFO2 Reference: [126-001])
has associated axiom(nl): if b is a continuant and if, for some t, cis continuant_part of b at t, then c is a continuant. (axiom label in BFO2 Reference: [009-002])
has associated axiom(nl): if b is a material entity, then there is some temporal interval (referred to below as a one-dimensional temporal region) during which b exists. (axiom label in BFO2 Reference: [011-002])
has associated axiom(fol): (forall (x y) (if (and (Continuant x) (exists (t) (continuantPartOfAt y x t))) (Continuant y))) // axiom label in BFO2 CLIF: [009-002]
has associated axiom(fol): (forall (x y) (if (and (Continuant x) (exists (t) (hasContinuantPartOfAt y x t))) (Continuant y))) // axiom label in BFO2 CLIF: [126-001]
has associated axiom(fol): (forall (x) (if (Continuant x) (Entity x))) // axiom label in BFO2 CLIF: [008-002]
has associated axiom(fol): (forall (x) (if (Material Entity x) (exists (t) (and (TemporalRegion t) (existsAt x t))))) // axiom label in BFO2 CLIF: [011-002]

Axiom
annotated source: continuant
annotated property: definition
annotated target: An entity that exists in full at any time in which it exists at all, persists through time while maintaining its identity and has no temporal parts.

Axiom
annotated source: continuant
annotated property: editor note
annotated target: Continuant doesn't have a closure axiom because the subclasses don't necessarily exhaust all possibilites. For example, in an expansion involving bringing in some of Ceuster's other portions of reality, questions are raised as to whether universals are continuants
has axiom label: http://purl.obolibrary.org/obo/bfo/axiom/0000007

Axiom
annotated source: continuant
annotated property: elucidation
annotated target: A continuant is an entity that persists, endures, or continues to exist through time while maintaining its identity. (axiom label in BFO2 Reference: [008-002])
has axiom label: http://purl.obolibrary.org/obo/bfo/axiom/008-002

Axiom
annotated source: continuant
annotated property: has associated axiom(nl)
annotated target: if b is a continuant and if, for some t, c has_continuant_part b at t, then c is a continuant. (axiom label in BFO2 Reference: [126-001])
has axiom label: http://purl.obolibrary.org/obo/bfo/axiom/126-001

Axiom
annotated source: continuant
annotated property: has associated axiom(nl)
annotated target: if b is a continuant and if, for some t, cis continuant_part of b at t, then c is a continuant. (axiom label in BFO2 Reference: [009-002])
has axiom label: http://purl.obolibrary.org/obo/bfo/axiom/009-002

Axiom
annotated source: continuant
annotated property: has associated axiom(nl)
annotated target: if b is a material entity, then there is some temporal interval (referred to below as a one-dimensional temporal region) during which b exists. (axiom label in BFO2 Reference: [011-002])
has axiom label: http://purl.obolibrary.org/obo/bfo/axiom/011-002

Axiom
annotated source: continuant
annotated property: has associated axiom(fol)
annotated target: (forall (x y) (if (and (Continuant x) (exists (t) (continuantPartOfAt y x t))) (Continuant y))) // axiom label in BFO2 CLIF: [009-002]
has axiom label: http://purl.obolibrary.org/obo/bfo/axiom/009-002

Axiom
annotated source: continuant
annotated property: has associated axiom(fol)
annotated target: (forall (x y) (if (and (Continuant x) (exists (t) (hasContinuantPartOfAt y x t))) (Continuant y))) // axiom label in BFO2 CLIF: [126-001]
has axiom label: http://purl.obolibrary.org/obo/bfo/axiom/126-001

Axiom
annotated source: continuant
annotated property: has associated axiom(fol)
annotated target: (forall (x) (if (Continuant x) (Entity x))) // axiom label in BFO2 CLIF: [008-002]
has axiom label: http://purl.obolibrary.org/obo/bfo/axiom/008-002

Axiom
annotated source: continuant
annotated property: has associated axiom(fol)
annotated target: (forall (x) (if (Material Entity x) (exists (t) (and (TemporalRegion t) (existsAt x t))))) // axiom label in BFO2 CLIF: [011-002]
has axiom label: http://purl.obolibrary.org/obo/bfo/axiom/011-002

Axiom
annotated source: continuant
annotated property: label
annotated target: continuant

occurrent
type: Class
subclass of: entity
BFO OWL specification label: occurrent
BFO CLIF specification label: Occurrent
editor note: BFO 2 Reference: every occurrent that is not a temporal or spatiotemporal region is s-dependent on some independent continuant that is not a spatial region
editor note: BFO 2 Reference: s-dependence obtains between every process and its participants in the sense that, as a matter of necessity, this process could not have existed unless these or those participants existed also. A process may have a succession of participants at different phases of its unfolding. Thus there may be different players on the field at different times during the course of a football game; but the process which is the entire game s-depends_on all of these players nonetheless. Some temporal parts of this process will s-depend_on on only some of the players.
editor note: Occurrent doesn't have a closure axiom because the subclasses don't necessarily exhaust all possibilites. An example would be the sum of a process and the process boundary of another process.
editor note: Simons uses different terminology for relations of occurrents to regions: Denote the spatio-temporal location of a given occurrent e by 'spn[e]' and call this region its span. We may say an occurrent is at its span, in any larger region, and covers any smaller region. Now suppose we have fixed a frame of reference so that we can speak not merely of spatio-temporal but also of spatial regions (places) and temporal regions (times). The spread of an occurrent, (relative to a frame of reference) is the space it exactly occupies, and its spell is likewise the time it exactly occupies. We write 'spr[e]' and `spl[e]' respectively for the spread and spell of e, omitting mention of the frame.
elucidation: An occurrent is an entity that unfolds itself in time or it is the instantaneous boundary of such an entity (for example a beginning or an ending) or it is a temporal or spatiotemporal region which such an entity occupies_temporal_region or occupies_spatiotemporal_region. (axiom label in BFO2 Reference: [077-002])
has associated axiom(nl): Every occurrent occupies_spatiotemporal_region some spatiotemporal region. (axiom label in BFO2 Reference: [108-001])
has associated axiom(nl): b is an occurrent entity iff b is an entity that has temporal parts. (axiom label in BFO2 Reference: [079-001])
has associated axiom(fol): (forall (x) (if (Occurrent x) (exists (r) (and (SpatioTemporalRegion r) (occupiesSpatioTemporalRegion x r))))) // axiom label in BFO2 CLIF: [108-001]
has associated axiom(fol): (forall (x) (iff (Occurrent x) (and (Entity x) (exists (y) (temporalPartOf y x))))) // axiom label in BFO2 CLIF: [079-001]

Axiom
annotated source: occurrent
annotated property: editor note
annotated target: Occurrent doesn't have a closure axiom because the subclasses don't necessarily exhaust all possibilites. An example would be the sum of a process and the process boundary of another process.
has axiom label: http://purl.obolibrary.org/obo/bfo/axiom/0000006
comment: per discussion with Barry Smith

Axiom
annotated source: occurrent
annotated property: editor note
annotated target: Simons uses different terminology for relations of occurrents to regions: Denote the spatio-temporal location of a given occurrent e by 'spn[e]' and call this region its span. We may say an occurrent is at its span, in any larger region, and covers any smaller region. Now suppose we have fixed a frame of reference so that we can speak not merely of spatio-temporal but also of spatial regions (places) and temporal regions (times). The spread of an occurrent, (relative to a frame of reference) is the space it exactly occupies, and its spell is likewise the time it exactly occupies. We write 'spr[e]' and `spl[e]' respectively for the spread and spell of e, omitting mention of the frame.
has axiom label: http://purl.obolibrary.org/obo/bfo/axiom/0000012

Axiom
annotated source: occurrent
annotated property: elucidation
annotated target: An occurrent is an entity that unfolds itself in time or it is the instantaneous boundary of such an entity (for example a beginning or an ending) or it is a temporal or spatiotemporal region which such an entity occupies_temporal_region or occupies_spatiotemporal_region. (axiom label in BFO2 Reference: [077-002])
has axiom label: http://purl.obolibrary.org/obo/bfo/axiom/077-002

Axiom
annotated source: occurrent
annotated property: has associated axiom(nl)
annotated target: Every occurrent occupies_spatiotemporal_region some spatiotemporal region. (axiom label in BFO2 Reference: [108-001])
has axiom label: http://purl.obolibrary.org/obo/bfo/axiom/108-001

Axiom
annotated source: occurrent
annotated property: has associated axiom(nl)
annotated target: b is an occurrent entity iff b is an entity that has temporal parts. (axiom label in BFO2 Reference: [079-001])
has axiom label: http://purl.obolibrary.org/obo/bfo/axiom/079-001

Axiom
annotated source: occurrent
annotated property: has associated axiom(fol)
annotated target: (forall (x) (if (Occurrent x) (exists (r) (and (SpatioTemporalRegion r) (occupiesSpatioTemporalRegion x r))))) // axiom label in BFO2 CLIF: [108-001]
has axiom label: http://purl.obolibrary.org/obo/bfo/axiom/108-001

Axiom
annotated source: occurrent
annotated property: has associated axiom(fol)
annotated target: (forall (x) (iff (Occurrent x) (and (Entity x) (exists (y) (temporalPartOf y x))))) // axiom label in BFO2 CLIF: [079-001]
has axiom label: http://purl.obolibrary.org/obo/bfo/axiom/079-001

independent continuant
type: Class
subclass of: continuant
disjoint with: specifically dependent continuant
disjoint with: generically dependent continuant
BFO OWL specification label: ic
BFO CLIF specification label: IndependentContinuant
example of usage: a chair
example of usage: a heart
example of usage: a leg
example of usage: a molecule
example of usage: a spatial region
example of usage: an atom
example of usage: an orchestra.
example of usage: an organism
example of usage: the bottom right portion of a human torso
example of usage: the interior of your mouth
definition: A continuant that is a bearer of quality and realizable entity entities, in which other entities inhere and which itself cannot inhere in anything.
definition: b is an independent continuant = Def. b is a continuant which is such that there is no c and no t such that b s-depends_on c at t. (axiom label in BFO2 Reference: [017-002])
has associated axiom(nl): For any independent continuant b and any time t there is some spatial region r such that b is located_in r at t. (axiom label in BFO2 Reference: [134-001])
has associated axiom(nl): For every independent continuant b and time t during the region of time spanned by its life, there are entities which s-depends_on b during t. (axiom label in BFO2 Reference: [018-002])
has associated axiom(fol): (forall (x t) (if (IndependentContinuant x) (exists (r) (and (SpatialRegion r) (locatedInAt x r t))))) // axiom label in BFO2 CLIF: [134-001]
has associated axiom(fol): (forall (x t) (if (and (IndependentContinuant x) (existsAt x t)) (exists (y) (and (Entity y) (specificallyDependsOnAt y x t))))) // axiom label in BFO2 CLIF: [018-002]
has associated axiom(fol): (iff (IndependentContinuant a) (and (Continuant a) (not (exists (b t) (specificallyDependsOnAt a b t))))) // axiom label in BFO2 CLIF: [017-002]

Axiom
annotated source: independent continuant
annotated property: definition
annotated target: A continuant that is a bearer of quality and realizable entity entities, in which other entities inhere and which itself cannot inhere in anything.

Axiom
annotated source: independent continuant
annotated property: definition
annotated target: b is an independent continuant = Def. b is a continuant which is such that there is no c and no t such that b s-depends_on c at t. (axiom label in BFO2 Reference: [017-002])
has axiom label: http://purl.obolibrary.org/obo/bfo/axiom/017-002

Axiom
annotated source: independent continuant
annotated property: has associated axiom(nl)
annotated target: For any independent continuant b and any time t there is some spatial region r such that b is located_in r at t. (axiom label in BFO2 Reference: [134-001])
has axiom label: http://purl.obolibrary.org/obo/bfo/axiom/134-001

Axiom
annotated source: independent continuant
annotated property: has associated axiom(nl)
annotated target: For every independent continuant b and time t during the region of time spanned by its life, there are entities which s-depends_on b during t. (axiom label in BFO2 Reference: [018-002])
has axiom label: http://purl.obolibrary.org/obo/bfo/axiom/018-002

Axiom
annotated source: independent continuant
annotated property: has associated axiom(fol)
annotated target: (forall (x t) (if (IndependentContinuant x) (exists (r) (and (SpatialRegion r) (locatedInAt x r t))))) // axiom label in BFO2 CLIF: [134-001]
has axiom label: http://purl.obolibrary.org/obo/bfo/axiom/134-001

Axiom
annotated source: independent continuant
annotated property: has associated axiom(fol)
annotated target: (forall (x t) (if (and (IndependentContinuant x) (existsAt x t)) (exists (y) (and (Entity y) (specificallyDependsOnAt y x t))))) // axiom label in BFO2 CLIF: [018-002]
has axiom label: http://purl.obolibrary.org/obo/bfo/axiom/018-002

Axiom
annotated source: independent continuant
annotated property: has associated axiom(fol)
annotated target: (iff (IndependentContinuant a) (and (Continuant a) (not (exists (b t) (specificallyDependsOnAt a b t))))) // axiom label in BFO2 CLIF: [017-002]
has axiom label: http://purl.obolibrary.org/obo/bfo/axiom/017-002

Axiom
annotated source: independent continuant
annotated property: label
annotated target: independent continuant

spatial region
type: Class
subclass of: immaterial entity
disjoint with: site
disjoint with: continuant fiat boundary
BFO OWL specification label: s-region
BFO CLIF specification label: SpatialRegion
editor note: BFO 2 Reference: Spatial regions do not participate in processes.
editor note: Spatial region doesn't have a closure axiom because the subclasses don't exhaust all possibilites. An example would be the union of a spatial point and a spatial line that doesn't overlap the point, or two spatial lines that intersect at a single point. In both cases the resultant spatial region is neither 0-dimensional, 1-dimensional, 2-dimensional, or 3-dimensional.
elucidation: A spatial region is a continuant entity that is a continuant_part_of spaceR as defined relative to some frame R. (axiom label in BFO2 Reference: [035-001])
has associated axiom(nl): All continuant parts of spatial regions are spatial regions. (axiom label in BFO2 Reference: [036-001])
has associated axiom(fol): (forall (x y t) (if (and (SpatialRegion x) (continuantPartOfAt y x t)) (SpatialRegion y))) // axiom label in BFO2 CLIF: [036-001]
has associated axiom(fol): (forall (x) (if (SpatialRegion x) (Continuant x))) // axiom label in BFO2 CLIF: [035-001]

Axiom
annotated source: spatial region
annotated property: editor note
annotated target: Spatial region doesn't have a closure axiom because the subclasses don't exhaust all possibilites. An example would be the union of a spatial point and a spatial line that doesn't overlap the point, or two spatial lines that intersect at a single point. In both cases the resultant spatial region is neither 0-dimensional, 1-dimensional, 2-dimensional, or 3-dimensional.
has axiom label: http://purl.obolibrary.org/obo/bfo/axiom/0000002
comment: per discussion with Barry Smith

Axiom
annotated source: spatial region
annotated property: elucidation
annotated target: A spatial region is a continuant entity that is a continuant_part_of spaceR as defined relative to some frame R. (axiom label in BFO2 Reference: [035-001])
has axiom label: http://purl.obolibrary.org/obo/bfo/axiom/035-001

Axiom
annotated source: spatial region
annotated property: has associated axiom(nl)
annotated target: All continuant parts of spatial regions are spatial regions. (axiom label in BFO2 Reference: [036-001])
has axiom label: http://purl.obolibrary.org/obo/bfo/axiom/036-001

Axiom
annotated source: spatial region
annotated property: has associated axiom(fol)
annotated target: (forall (x y t) (if (and (SpatialRegion x) (continuantPartOfAt y x t)) (SpatialRegion y))) // axiom label in BFO2 CLIF: [036-001]
has axiom label: http://purl.obolibrary.org/obo/bfo/axiom/036-001

Axiom
annotated source: spatial region
annotated property: has associated axiom(fol)
annotated target: (forall (x) (if (SpatialRegion x) (Continuant x))) // axiom label in BFO2 CLIF: [035-001]
has axiom label: http://purl.obolibrary.org/obo/bfo/axiom/035-001

temporal region
type: Class
subclass of: occurrent
disjoint with: spatiotemporal region
disjoint with: process
disjoint with: process boundary
BFO OWL specification label: t-region
BFO CLIF specification label: TemporalRegion
editor note: Temporal region doesn't have a closure axiom because the subclasses don't exhaust all possibilites. An example would be the mereological sum of a temporal instant and a temporal interval that doesn't overlap the instant. In this case the resultant temporal region is neither 0-dimensional nor 1-dimensional
elucidation: A temporal region is an occurrent entity that is part of time as defined relative to some reference frame. (axiom label in BFO2 Reference: [100-001])
has associated axiom(nl): All parts of temporal regions are temporal regions. (axiom label in BFO2 Reference: [101-001])
has associated axiom(nl): Every temporal region t is such that t occupies_temporal_region t. (axiom label in BFO2 Reference: [119-002])
has associated axiom(fol): (forall (r) (if (TemporalRegion r) (occupiesTemporalRegion r r))) // axiom label in BFO2 CLIF: [119-002]
has associated axiom(fol): (forall (x y) (if (and (TemporalRegion x) (occurrentPartOf y x)) (TemporalRegion y))) // axiom label in BFO2 CLIF: [101-001]
has associated axiom(fol): (forall (x) (if (TemporalRegion x) (Occurrent x))) // axiom label in BFO2 CLIF: [100-001]

Axiom
annotated source: temporal region
annotated property: editor note
annotated target: Temporal region doesn't have a closure axiom because the subclasses don't exhaust all possibilites. An example would be the mereological sum of a temporal instant and a temporal interval that doesn't overlap the instant. In this case the resultant temporal region is neither 0-dimensional nor 1-dimensional
has axiom label: http://purl.obolibrary.org/obo/bfo/axiom/0000003
comment: per discussion with Barry Smith

Axiom
annotated source: temporal region
annotated property: elucidation
annotated target: A temporal region is an occurrent entity that is part of time as defined relative to some reference frame. (axiom label in BFO2 Reference: [100-001])
has axiom label: http://purl.obolibrary.org/obo/bfo/axiom/100-001

Axiom
annotated source: temporal region
annotated property: has associated axiom(nl)
annotated target: All parts of temporal regions are temporal regions. (axiom label in BFO2 Reference: [101-001])
has axiom label: http://purl.obolibrary.org/obo/bfo/axiom/101-001

Axiom
annotated source: temporal region
annotated property: has associated axiom(nl)
annotated target: Every temporal region t is such that t occupies_temporal_region t. (axiom label in BFO2 Reference: [119-002])
has axiom label: http://purl.obolibrary.org/obo/bfo/axiom/119-002

Axiom
annotated source: temporal region
annotated property: has associated axiom(fol)
annotated target: (forall (r) (if (TemporalRegion r) (occupiesTemporalRegion r r))) // axiom label in BFO2 CLIF: [119-002]
has axiom label: http://purl.obolibrary.org/obo/bfo/axiom/119-002

Axiom
annotated source: temporal region
annotated property: has associated axiom(fol)
annotated target: (forall (x y) (if (and (TemporalRegion x) (occurrentPartOf y x)) (TemporalRegion y))) // axiom label in BFO2 CLIF: [101-001]
has axiom label: http://purl.obolibrary.org/obo/bfo/axiom/101-001

Axiom
annotated source: temporal region
annotated property: has associated axiom(fol)
annotated target: (forall (x) (if (TemporalRegion x) (Occurrent x))) // axiom label in BFO2 CLIF: [100-001]
has axiom label: http://purl.obolibrary.org/obo/bfo/axiom/100-001

two-dimensional spatial region
type: Class
subclass of: spatial region
subclass of: Restriction
  on property: has quantity value
  some values from: area value
disjoint with: three-dimensional spatial region
BFO OWL specification label: 2d-s-region
BFO CLIF specification label: TwoDimensionalSpatialRegion
example of usage: an infinitely thin plane in space.
example of usage: the surface of a sphere-shaped part of space
elucidation: A two-dimensional spatial region is a spatial region that is of two dimensions. (axiom label in BFO2 Reference: [039-001])
has associated axiom(fol): (forall (x) (if (TwoDimensionalSpatialRegion x) (SpatialRegion x))) // axiom label in BFO2 CLIF: [039-001]
term tracker annotation: move axiom to oeo-physical issue: https://github.com/OpenEnergyPlatform/ontology/issues/1738 pull request: https://github.com/OpenEnergyPlatform/ontology/pull/1776

Axiom
annotated source: two-dimensional spatial region
annotated property: elucidation
annotated target: A two-dimensional spatial region is a spatial region that is of two dimensions. (axiom label in BFO2 Reference: [039-001])
has axiom label: http://purl.obolibrary.org/obo/bfo/axiom/039-001

Axiom
annotated source: two-dimensional spatial region
annotated property: has associated axiom(fol)
annotated target: (forall (x) (if (TwoDimensionalSpatialRegion x) (SpatialRegion x))) // axiom label in BFO2 CLIF: [039-001]
has axiom label: http://purl.obolibrary.org/obo/bfo/axiom/039-001

spatiotemporal region
type: Class
subclass of: occurrent
BFO OWL specification label: st-region
BFO CLIF specification label: SpatiotemporalRegion
example of usage: the spatiotemporal region occupied by a human life
example of usage: the spatiotemporal region occupied by a process of cellular meiosis.
example of usage: the spatiotemporal region occupied by the development of a cancer tumor
elucidation: A spatiotemporal region is an occurrent entity that is part of spacetime. (axiom label in BFO2 Reference: [095-001])
has associated axiom(nl): All parts of spatiotemporal regions are spatiotemporal regions. (axiom label in BFO2 Reference: [096-001])
has associated axiom(nl): Each spatiotemporal region at any time t projects_onto some spatial region at t. (axiom label in BFO2 Reference: [099-001])
has associated axiom(nl): Each spatiotemporal region projects_onto some temporal region. (axiom label in BFO2 Reference: [098-001])
has associated axiom(nl): Every spatiotemporal region occupies_spatiotemporal_region itself.
has associated axiom(nl): Every spatiotemporal region s is such that s occupies_spatiotemporal_region s. (axiom label in BFO2 Reference: [107-002])
has associated axiom(fol): (forall (r) (if (SpatioTemporalRegion r) (occupiesSpatioTemporalRegion r r))) // axiom label in BFO2 CLIF: [107-002]
has associated axiom(fol): (forall (x t) (if (SpatioTemporalRegion x) (exists (y) (and (SpatialRegion y) (spatiallyProjectsOntoAt x y t))))) // axiom label in BFO2 CLIF: [099-001]
has associated axiom(fol): (forall (x y) (if (and (SpatioTemporalRegion x) (occurrentPartOf y x)) (SpatioTemporalRegion y))) // axiom label in BFO2 CLIF: [096-001]
has associated axiom(fol): (forall (x) (if (SpatioTemporalRegion x) (Occurrent x))) // axiom label in BFO2 CLIF: [095-001]
has associated axiom(fol): (forall (x) (if (SpatioTemporalRegion x) (exists (y) (and (TemporalRegion y) (temporallyProjectsOnto x y))))) // axiom label in BFO2 CLIF: [098-001]

Axiom
annotated source: spatiotemporal region
annotated property: elucidation
annotated target: A spatiotemporal region is an occurrent entity that is part of spacetime. (axiom label in BFO2 Reference: [095-001])
has axiom label: http://purl.obolibrary.org/obo/bfo/axiom/095-001

Axiom
annotated source: spatiotemporal region
annotated property: has associated axiom(nl)
annotated target: All parts of spatiotemporal regions are spatiotemporal regions. (axiom label in BFO2 Reference: [096-001])
has axiom label: http://purl.obolibrary.org/obo/bfo/axiom/096-001

Axiom
annotated source: spatiotemporal region
annotated property: has associated axiom(nl)
annotated target: Each spatiotemporal region at any time t projects_onto some spatial region at t. (axiom label in BFO2 Reference: [099-001])
has axiom label: http://purl.obolibrary.org/obo/bfo/axiom/099-001

Axiom
annotated source: spatiotemporal region
annotated property: has associated axiom(nl)
annotated target: Each spatiotemporal region projects_onto some temporal region. (axiom label in BFO2 Reference: [098-001])
has axiom label: http://purl.obolibrary.org/obo/bfo/axiom/098-001

Axiom
annotated source: spatiotemporal region
annotated property: has associated axiom(nl)
annotated target: Every spatiotemporal region s is such that s occupies_spatiotemporal_region s. (axiom label in BFO2 Reference: [107-002])
has axiom label: http://purl.obolibrary.org/obo/bfo/axiom/107-002

Axiom
annotated source: spatiotemporal region
annotated property: has associated axiom(fol)
annotated target: (forall (r) (if (SpatioTemporalRegion r) (occupiesSpatioTemporalRegion r r))) // axiom label in BFO2 CLIF: [107-002]
has axiom label: http://purl.obolibrary.org/obo/bfo/axiom/107-002

Axiom
annotated source: spatiotemporal region
annotated property: has associated axiom(fol)
annotated target: (forall (x t) (if (SpatioTemporalRegion x) (exists (y) (and (SpatialRegion y) (spatiallyProjectsOntoAt x y t))))) // axiom label in BFO2 CLIF: [099-001]
has axiom label: http://purl.obolibrary.org/obo/bfo/axiom/099-001

Axiom
annotated source: spatiotemporal region
annotated property: has associated axiom(fol)
annotated target: (forall (x y) (if (and (SpatioTemporalRegion x) (occurrentPartOf y x)) (SpatioTemporalRegion y))) // axiom label in BFO2 CLIF: [096-001]
has axiom label: http://purl.obolibrary.org/obo/bfo/axiom/096-001

Axiom
annotated source: spatiotemporal region
annotated property: has associated axiom(fol)
annotated target: (forall (x) (if (SpatioTemporalRegion x) (Occurrent x))) // axiom label in BFO2 CLIF: [095-001]
has axiom label: http://purl.obolibrary.org/obo/bfo/axiom/095-001

Axiom
annotated source: spatiotemporal region
annotated property: has associated axiom(fol)
annotated target: (forall (x) (if (SpatioTemporalRegion x) (exists (y) (and (TemporalRegion y) (temporallyProjectsOnto x y))))) // axiom label in BFO2 CLIF: [098-001]
has axiom label: http://purl.obolibrary.org/obo/bfo/axiom/098-001

process
type: Class
subclass of: occurrent
BFO OWL specification label: process
BFO CLIF specification label: Process
example of usage: a process of cell-division, \ a beating of the heart
example of usage: a process of meiosis
example of usage: a process of sleeping
example of usage: the course of a disease
example of usage: the flight of a bird
example of usage: the life of an organism
example of usage: your process of aging.
definition: p is a process = Def. p is an occurrent that has temporal proper parts and for some time t, p s-depends_on some material entity at t. (axiom label in BFO2 Reference: [083-003])
editor note: BFO 2 Reference: The realm of occurrents is less pervasively marked by the presence of natural units than is the case in the realm of independent continuants. Thus there is here no counterpart of ‘object’. In BFO 1.0 ‘process’ served as such a counterpart. In BFO 2.0 ‘process’ is, rather, the occurrent counterpart of ‘material entity’. Those natural – as contrasted with engineered, which here means: deliberately executed – units which do exist in the realm of occurrents are typically either parasitic on the existence of natural units on the continuant side, or they are fiat in nature. Thus we can count lives; we can count football games; we can count chemical reactions performed in experiments or in chemical manufacturing. We cannot count the processes taking place, for instance, in an episode of insect mating behavior.Even where natural units are identifiable, for example cycles in a cyclical process such as the beating of a heart or an organism’s sleep/wake cycle, the processes in question form a sequence with no discontinuities (temporal gaps) of the sort that we find for instance where billiard balls or zebrafish or planets are separated by clear spatial gaps. Lives of organisms are process units, but they too unfold in a continuous series from other, prior processes such as fertilization, and they unfold in turn in continuous series of post-life processes such as post-mortem decay. Clear examples of boundaries of processes are almost always of the fiat sort (midnight, a time of death as declared in an operating theater or on a death certificate, the initiation of a state of war)
has associated axiom(fol): (iff (Process a) (and (Occurrent a) (exists (b) (properTemporalPartOf b a)) (exists (c t) (and (MaterialEntity c) (specificallyDependsOnAt a c t))))) // axiom label in BFO2 CLIF: [083-003]

Axiom
annotated source: process
annotated property: definition
annotated target: p is a process = Def. p is an occurrent that has temporal proper parts and for some time t, p s-depends_on some material entity at t. (axiom label in BFO2 Reference: [083-003])
has axiom label: http://purl.obolibrary.org/obo/bfo/axiom/083-003

Axiom
annotated source: process
annotated property: has associated axiom(fol)
annotated target: (iff (Process a) (and (Occurrent a) (exists (b) (properTemporalPartOf b a)) (exists (c t) (and (MaterialEntity c) (specificallyDependsOnAt a c t))))) // axiom label in BFO2 CLIF: [083-003]
has axiom label: http://purl.obolibrary.org/obo/bfo/axiom/083-003

disposition
type: Class
subclass of: realizable entity
subclass of: Restriction
  on property: characteristic of
  some values from: independent continuant
disjoint with: role
BFO OWL specification label: disposition
BFO CLIF specification label: Disposition
example of usage: an atom of element X has the disposition to decay to an atom of element Y
example of usage: certain people have a predisposition to colon cancer
example of usage: children are innately disposed to categorize objects in certain ways.
example of usage: the cell wall is disposed to filter chemicals in endocytosis and exocytosis
editor note: BFO 2 Reference: Dispositions exist along a strength continuum. Weaker forms of disposition are realized in only a fraction of triggering cases. These forms occur in a significant number of cases of a similar type.
elucidation: b is a disposition means: b is a realizable entity & b’s bearer is some material entity & b is such that if it ceases to exist, then its bearer is physically changed, & b’s realization occurs when and because this bearer is in some special physical circumstances, & this realization occurs in virtue of the bearer’s physical make-up. (axiom label in BFO2 Reference: [062-002])
has associated axiom(nl): If b is a realizable entity then for all t at which b exists, b s-depends_on some material entity at t. (axiom label in BFO2 Reference: [063-002])
has associated axiom(fol): (forall (x t) (if (and (RealizableEntity x) (existsAt x t)) (exists (y) (and (MaterialEntity y) (specificallyDepends x y t))))) // axiom label in BFO2 CLIF: [063-002]
has associated axiom(fol): (forall (x) (if (Disposition x) (and (RealizableEntity x) (exists (y) (and (MaterialEntity y) (bearerOfAt x y t)))))) // axiom label in BFO2 CLIF: [062-002]
term tracker annotation: add bearer axiom to oeo-import-edits issue: https://github.com/OpenEnergyPlatform/ontology/issues/1305 pull request: https://github.com/OpenEnergyPlatform/ontology/pull/1485 move bearer axiom to oeo-shared issue: https://github.com/OpenEnergyPlatform/ontology/issues/1738 pull request: https://github.com/OpenEnergyPlatform/ontology/pull/1776 replaced 'has bearer' with 'characteristic of' in oeo-shared issue: https://github.com/OpenEnergyPlatform/ontology/issues/1907 pull request: https://github.com/OpenEnergyPlatform/ontology/pull/1928

Axiom
annotated source: disposition
annotated property: elucidation
annotated target: b is a disposition means: b is a realizable entity & b’s bearer is some material entity & b is such that if it ceases to exist, then its bearer is physically changed, & b’s realization occurs when and because this bearer is in some special physical circumstances, & this realization occurs in virtue of the bearer’s physical make-up. (axiom label in BFO2 Reference: [062-002])
has axiom label: http://purl.obolibrary.org/obo/bfo/axiom/062-002

Axiom
annotated source: disposition
annotated property: has associated axiom(nl)
annotated target: If b is a realizable entity then for all t at which b exists, b s-depends_on some material entity at t. (axiom label in BFO2 Reference: [063-002])
has axiom label: http://purl.obolibrary.org/obo/bfo/axiom/063-002

Axiom
annotated source: disposition
annotated property: has associated axiom(fol)
annotated target: (forall (x t) (if (and (RealizableEntity x) (existsAt x t)) (exists (y) (and (MaterialEntity y) (specificallyDepends x y t))))) // axiom label in BFO2 CLIF: [063-002]
has axiom label: http://purl.obolibrary.org/obo/bfo/axiom/063-002

Axiom
annotated source: disposition
annotated property: has associated axiom(fol)
annotated target: (forall (x) (if (Disposition x) (and (RealizableEntity x) (exists (y) (and (MaterialEntity y) (bearerOfAt x y t)))))) // axiom label in BFO2 CLIF: [062-002]
has axiom label: http://purl.obolibrary.org/obo/bfo/axiom/062-002

realizable entity
type: Class
subclass of: specifically dependent continuant
disjoint with: quality
BFO OWL specification label: realizable
BFO CLIF specification label: RealizableEntity
example of usage: the disposition of this piece of metal to conduct electricity.
example of usage: the disposition of your blood to coagulate
example of usage: the function of your reproductive organs
example of usage: the role of being a doctor
example of usage: the role of this boundary to delineate where Utah and Colorado meet
elucidation: To say that b is a realizable entity is to say that b is a specifically dependent continuant that inheres in some independent continuant which is not a spatial region and is of a type instances of which are realized in processes of a correlated type. (axiom label in BFO2 Reference: [058-002])
has associated axiom(nl): All realizable dependent continuants have independent continuants that are not spatial regions as their bearers. (axiom label in BFO2 Reference: [060-002])
has associated axiom(fol): (forall (x t) (if (RealizableEntity x) (exists (y) (and (IndependentContinuant y) (not (SpatialRegion y)) (bearerOfAt y x t))))) // axiom label in BFO2 CLIF: [060-002]
has associated axiom(fol): (forall (x) (if (RealizableEntity x) (and (SpecificallyDependentContinuant x) (exists (y) (and (IndependentContinuant y) (not (SpatialRegion y)) (inheresIn x y)))))) // axiom label in BFO2 CLIF: [058-002]

Axiom
annotated source: realizable entity
annotated property: elucidation
annotated target: To say that b is a realizable entity is to say that b is a specifically dependent continuant that inheres in some independent continuant which is not a spatial region and is of a type instances of which are realized in processes of a correlated type. (axiom label in BFO2 Reference: [058-002])
has axiom label: http://purl.obolibrary.org/obo/bfo/axiom/058-002

Axiom
annotated source: realizable entity
annotated property: has associated axiom(nl)
annotated target: All realizable dependent continuants have independent continuants that are not spatial regions as their bearers. (axiom label in BFO2 Reference: [060-002])
has axiom label: http://purl.obolibrary.org/obo/bfo/axiom/060-002

Axiom
annotated source: realizable entity
annotated property: has associated axiom(fol)
annotated target: (forall (x t) (if (RealizableEntity x) (exists (y) (and (IndependentContinuant y) (not (SpatialRegion y)) (bearerOfAt y x t))))) // axiom label in BFO2 CLIF: [060-002]
has axiom label: http://purl.obolibrary.org/obo/bfo/axiom/060-002

Axiom
annotated source: realizable entity
annotated property: has associated axiom(fol)
annotated target: (forall (x) (if (RealizableEntity x) (and (SpecificallyDependentContinuant x) (exists (y) (and (IndependentContinuant y) (not (SpatialRegion y)) (inheresIn x y)))))) // axiom label in BFO2 CLIF: [058-002]
has axiom label: http://purl.obolibrary.org/obo/bfo/axiom/058-002

zero-dimensional spatial region
type: Class
subclass of: spatial region
disjoint with: three-dimensional spatial region
BFO OWL specification label: 0d-s-region
BFO CLIF specification label: ZeroDimensionalSpatialRegion
elucidation: A zero-dimensional spatial region is a point in space. (axiom label in BFO2 Reference: [037-001])
has associated axiom(fol): (forall (x) (if (ZeroDimensionalSpatialRegion x) (SpatialRegion x))) // axiom label in BFO2 CLIF: [037-001]

Axiom
annotated source: zero-dimensional spatial region
annotated property: elucidation
annotated target: A zero-dimensional spatial region is a point in space. (axiom label in BFO2 Reference: [037-001])
has axiom label: http://purl.obolibrary.org/obo/bfo/axiom/037-001

Axiom
annotated source: zero-dimensional spatial region
annotated property: has associated axiom(fol)
annotated target: (forall (x) (if (ZeroDimensionalSpatialRegion x) (SpatialRegion x))) // axiom label in BFO2 CLIF: [037-001]
has axiom label: http://purl.obolibrary.org/obo/bfo/axiom/037-001

quality
type: Class
subclass of: specifically dependent continuant
BFO OWL specification label: quality
BFO CLIF specification label: Quality
example of usage: the ambient temperature of this portion of air
example of usage: the color of a tomato
example of usage: the length of the circumference of your waist
example of usage: the mass of this piece of gold.
example of usage: the shape of your nose
example of usage: the shape of your nostril
elucidation: a quality is a specifically dependent continuant that, in contrast to roles and dispositions, does not require any further process in order to be realized. (axiom label in BFO2 Reference: [055-001])
has associated axiom(nl): If an entity is a quality at any time that it exists, then it is a quality at every time that it exists. (axiom label in BFO2 Reference: [105-001])
has associated axiom(fol): (forall (x) (if (Quality x) (SpecificallyDependentContinuant x))) // axiom label in BFO2 CLIF: [055-001]
has associated axiom(fol): (forall (x) (if (exists (t) (and (existsAt x t) (Quality x))) (forall (t_1) (if (existsAt x t_1) (Quality x))))) // axiom label in BFO2 CLIF: [105-001]

Axiom
annotated source: quality
annotated property: elucidation
annotated target: a quality is a specifically dependent continuant that, in contrast to roles and dispositions, does not require any further process in order to be realized. (axiom label in BFO2 Reference: [055-001])
has axiom label: http://purl.obolibrary.org/obo/bfo/axiom/055-001

Axiom
annotated source: quality
annotated property: has associated axiom(nl)
annotated target: If an entity is a quality at any time that it exists, then it is a quality at every time that it exists. (axiom label in BFO2 Reference: [105-001])
has axiom label: http://purl.obolibrary.org/obo/bfo/axiom/105-001

Axiom
annotated source: quality
annotated property: has associated axiom(fol)
annotated target: (forall (x) (if (Quality x) (SpecificallyDependentContinuant x))) // axiom label in BFO2 CLIF: [055-001]
has axiom label: http://purl.obolibrary.org/obo/bfo/axiom/055-001

Axiom
annotated source: quality
annotated property: has associated axiom(fol)
annotated target: (forall (x) (if (exists (t) (and (existsAt x t) (Quality x))) (forall (t_1) (if (existsAt x t_1) (Quality x))))) // axiom label in BFO2 CLIF: [105-001]
has axiom label: http://purl.obolibrary.org/obo/bfo/axiom/105-001

specifically dependent continuant
type: Class
subclass of: continuant
BFO OWL specification label: sdc
BFO CLIF specification label: SpecificallyDependentContinuant
example of usage: Reciprocal specifically dependent continuants: the function of this key to open this lock and the mutually dependent disposition of this lock: to be opened by this key
example of usage: of one-sided specifically dependent continuants: the mass of this tomato
example of usage: of relational dependent continuants (multiple bearers): John’s love for Mary, the ownership relation between John and this statue, the relation of authority between John and his subordinates.
example of usage: the disposition of this fish to decay
example of usage: the function of this heart: to pump blood
example of usage: the mutual dependence of proton donors and acceptors in chemical reactions [79
example of usage: the mutual dependence of the role predator and the role prey as played by two organisms in a given interaction
example of usage: the pink color of a medium rare piece of grilled filet mignon at its center
example of usage: the role of being a doctor
example of usage: the shape of this hole.
example of usage: the smell of this portion of mozzarella
definition: b is a specifically dependent continuant = Def. b is a continuant & there is some independent continuant c which is not a spatial region and which is such that b s-depends_on c at every time t during the course of b’s existence. (axiom label in BFO2 Reference: [050-003])
editor note: Specifically dependent continuant doesn't have a closure axiom because the subclasses don't necessarily exhaust all possibilites. We're not sure what else will develop here, but for example there are questions such as what are promises, obligation, etc.
has associated axiom(fol): (iff (SpecificallyDependentContinuant a) (and (Continuant a) (forall (t) (if (existsAt a t) (exists (b) (and (IndependentContinuant b) (not (SpatialRegion b)) (specificallyDependsOnAt a b t))))))) // axiom label in BFO2 CLIF: [050-003]
term tracker annotation: add bearer axiom to oeo-import-edits issue: https://github.com/OpenEnergyPlatform/ontology/issues/1305 pull request: https://github.com/OpenEnergyPlatform/ontology/pull/1485

Axiom
annotated source: specifically dependent continuant
annotated property: definition
annotated target: b is a specifically dependent continuant = Def. b is a continuant & there is some independent continuant c which is not a spatial region and which is such that b s-depends_on c at every time t during the course of b’s existence. (axiom label in BFO2 Reference: [050-003])
has axiom label: http://purl.obolibrary.org/obo/bfo/axiom/050-003

Axiom
annotated source: specifically dependent continuant
annotated property: editor note
annotated target: Specifically dependent continuant doesn't have a closure axiom because the subclasses don't necessarily exhaust all possibilites. We're not sure what else will develop here, but for example there are questions such as what are promises, obligation, etc.
has axiom label: http://purl.obolibrary.org/obo/bfo/axiom/0000005
comment: per discussion with Barry Smith

Axiom
annotated source: specifically dependent continuant
annotated property: has associated axiom(fol)
annotated target: (iff (SpecificallyDependentContinuant a) (and (Continuant a) (forall (t) (if (existsAt a t) (exists (b) (and (IndependentContinuant b) (not (SpatialRegion b)) (specificallyDependsOnAt a b t))))))) // axiom label in BFO2 CLIF: [050-003]
has axiom label: http://purl.obolibrary.org/obo/bfo/axiom/050-003

role
type: Class
subclass of: realizable entity
BFO OWL specification label: role
BFO CLIF specification label: Role
example of usage: John’s role of husband to Mary is dependent on Mary’s role of wife to John, and both are dependent on the object aggregate comprising John and Mary as member parts joined together through the relational quality of being married.
example of usage: the priest role
example of usage: the role of a boundary to demarcate two neighboring administrative territories
example of usage: the role of a building in serving as a military target
example of usage: the role of a stone in marking a property boundary
example of usage: the role of subject in a clinical trial
example of usage: the student role
editor note: BFO 2 Reference: One major family of examples of non-rigid universals involves roles, and ontologies developed for corresponding administrative purposes may consist entirely of representatives of entities of this sort. Thus ‘professor’, defined as follows,b instance_of professor at t =Def. there is some c, c instance_of professor role & c inheres_in b at t.denotes a non-rigid universal and so also do ‘nurse’, ‘student’, ‘colonel’, ‘taxpayer’, and so forth. (These terms are all, in the jargon of philosophy, phase sortals.) By using role terms in definitions, we can create a BFO conformant treatment of such entities drawing on the fact that, while an instance of professor may be simultaneously an instance of trade union member, no instance of the type professor role is also (at any time) an instance of the type trade union member role (any more than any instance of the type color is at any time an instance of the type length).If an ontology of employment positions should be defined in terms of roles following the above pattern, this enables the ontology to do justice to the fact that individuals instantiate the corresponding universals – professor, sergeant, nurse – only during certain phases in their lives.
elucidation: b is a role means: b is a realizable entity & b exists because there is some single bearer that is in some special physical, social, or institutional set of circumstances in which this bearer does not have to be& b is not such that, if it ceases to exist, then the physical make-up of the bearer is thereby changed. (axiom label in BFO2 Reference: [061-001])
has associated axiom(fol): (forall (x) (if (Role x) (RealizableEntity x))) // axiom label in BFO2 CLIF: [061-001]

Axiom
annotated source: role
annotated property: elucidation
annotated target: b is a role means: b is a realizable entity & b exists because there is some single bearer that is in some special physical, social, or institutional set of circumstances in which this bearer does not have to be& b is not such that, if it ceases to exist, then the physical make-up of the bearer is thereby changed. (axiom label in BFO2 Reference: [061-001])
has axiom label: http://purl.obolibrary.org/obo/bfo/axiom/061-001

Axiom
annotated source: role
annotated property: has associated axiom(fol)
annotated target: (forall (x) (if (Role x) (RealizableEntity x))) // axiom label in BFO2 CLIF: [061-001]
has axiom label: http://purl.obolibrary.org/obo/bfo/axiom/061-001

fiat object part
type: Class
subclass of: material entity
BFO OWL specification label: fiat-object-part
BFO CLIF specification label: FiatObjectPart
example of usage: or with divisions drawn by cognitive subjects for practical reasons, such as the division of a cake (before slicing) into (what will become) slices (and thus member parts of an object aggregate). However, this does not mean that fiat object parts are dependent for their existence on divisions or delineations effected by cognitive subjects. If, for example, it is correct to conceive geological layers of the Earth as fiat object parts of the Earth, then even though these layers were first delineated in recent times, still existed long before such delineation and what holds of these layers (for example that the oldest layers are also the lowest layers) did not begin to hold because of our acts of delineation.Treatment of material entity in BFOExamples viewed by some as problematic cases for the trichotomy of fiat object part, object, and object aggregate include: a mussel on (and attached to) a rock, a slime mold, a pizza, a cloud, a galaxy, a railway train with engine and multiple carriages, a clonal stand of quaking aspen, a bacterial community (biofilm), a broken femur. Note that, as Aristotle already clearly recognized, such problematic cases – which lie at or near the penumbra of instances defined by the categories in question – need not invalidate these categories. The existence of grey objects does not prove that there are not objects which are black and objects which are white; the existence of mules does not prove that there are not objects which are donkeys and objects which are horses. It does, however, show that the examples in question need to be addressed carefully in order to show how they can be fitted into the proposed scheme, for example by recognizing additional subdivisions [29
example of usage: the FMA:regional parts of an intact human body.
example of usage: the Western hemisphere of the Earth
example of usage: the division of the brain into regions
example of usage: the division of the planet into hemispheres
example of usage: the dorsal and ventral surfaces of the body
example of usage: the upper and lower lobes of the left lung
editor note: BFO 2 Reference: Most examples of fiat object parts are associated with theoretically drawn divisions
elucidation: b is a fiat object part = Def. b is a material entity which is such that for all times t, if b exists at t then there is some object c such that b proper continuant_part of c at t and c is demarcated from the remainder of c by a two-dimensional continuant fiat boundary. (axiom label in BFO2 Reference: [027-004])
has associated axiom(fol): (forall (x) (if (FiatObjectPart x) (and (MaterialEntity x) (forall (t) (if (existsAt x t) (exists (y) (and (Object y) (properContinuantPartOfAt x y t)))))))) // axiom label in BFO2 CLIF: [027-004]

Axiom
annotated source: fiat object part
annotated property: elucidation
annotated target: b is a fiat object part = Def. b is a material entity which is such that for all times t, if b exists at t then there is some object c such that b proper continuant_part of c at t and c is demarcated from the remainder of c by a two-dimensional continuant fiat boundary. (axiom label in BFO2 Reference: [027-004])
has axiom label: http://purl.obolibrary.org/obo/bfo/axiom/027-004

Axiom
annotated source: fiat object part
annotated property: has associated axiom(fol)
annotated target: (forall (x) (if (FiatObjectPart x) (and (MaterialEntity x) (forall (t) (if (existsAt x t) (exists (y) (and (Object y) (properContinuantPartOfAt x y t)))))))) // axiom label in BFO2 CLIF: [027-004]
has axiom label: http://purl.obolibrary.org/obo/bfo/axiom/027-004

one-dimensional spatial region
type: Class
subclass of: spatial region
disjoint with: three-dimensional spatial region
BFO OWL specification label: 1d-s-region
BFO CLIF specification label: OneDimensionalSpatialRegion
example of usage: an edge of a cube-shaped portion of space.
elucidation: A one-dimensional spatial region is a line or aggregate of lines stretching from one point in space to another. (axiom label in BFO2 Reference: [038-001])
has associated axiom(fol): (forall (x) (if (OneDimensionalSpatialRegion x) (SpatialRegion x))) // axiom label in BFO2 CLIF: [038-001]

Axiom
annotated source: one-dimensional spatial region
annotated property: elucidation
annotated target: A one-dimensional spatial region is a line or aggregate of lines stretching from one point in space to another. (axiom label in BFO2 Reference: [038-001])
has axiom label: http://purl.obolibrary.org/obo/bfo/axiom/038-001

Axiom
annotated source: one-dimensional spatial region
annotated property: has associated axiom(fol)
annotated target: (forall (x) (if (OneDimensionalSpatialRegion x) (SpatialRegion x))) // axiom label in BFO2 CLIF: [038-001]
has axiom label: http://purl.obolibrary.org/obo/bfo/axiom/038-001

object aggregate
type: Class
subclass of: material entity
BFO OWL specification label: object-aggregate
BFO CLIF specification label: ObjectAggregate
example of usage: a collection of cells in a blood biobank.
example of usage: a swarm of bees is an aggregate of members who are linked together through natural bonds
example of usage: a symphony orchestra
example of usage: an organization is an aggregate whose member parts have roles of specific types (for example in a jazz band, a chess club, a football team)
example of usage: defined by fiat: the aggregate of members of an organization
example of usage: defined through physical attachment: the aggregate of atoms in a lump of granite
example of usage: defined through physical containment: the aggregate of molecules of carbon dioxide in a sealed container
example of usage: defined via attributive delimitations such as: the patients in this hospital
example of usage: the aggregate of bearings in a constant velocity axle joint
example of usage: the aggregate of blood cells in your body
example of usage: the nitrogen atoms in the atmosphere
example of usage: the restaurants in Palo Alto
example of usage: your collection of Meissen ceramic plates.
editor note: An entity a is an object aggregate if and only if there is a mutually exhaustive and pairwise disjoint partition of a into objects
editor note: BFO 2 Reference: object aggregates may gain and lose parts while remaining numerically identical (one and the same individual) over time. This holds both for aggregates whose membership is determined naturally (the aggregate of cells in your body) and aggregates determined by fiat (a baseball team, a congressional committee).
definition source: ISBN:978-3-938793-98-5pp124-158#Thomas Bittner and Barry Smith, 'A Theory of Granular Partitions', in K. Munn and B. Smith (eds.), Applied Ontology: An Introduction, Frankfurt/Lancaster: ontos, 2008, 125-158.
elucidation: b is an object aggregate means: b is a material entity consisting exactly of a plurality of objects as member_parts at all times at which b exists. (axiom label in BFO2 Reference: [025-004])
has associated axiom(fol): (forall (x) (if (ObjectAggregate x) (and (MaterialEntity x) (forall (t) (if (existsAt x t) (exists (y z) (and (Object y) (Object z) (memberPartOfAt y x t) (memberPartOfAt z x t) (not (= y z)))))) (not (exists (w t_1) (and (memberPartOfAt w x t_1) (not (Object w)))))))) // axiom label in BFO2 CLIF: [025-004]

Axiom
annotated source: object aggregate
annotated property: editor note
annotated target: An entity a is an object aggregate if and only if there is a mutually exhaustive and pairwise disjoint partition of a into objects
has axiom label: http://purl.obolibrary.org/obo/bfo/axiom/0000011

Axiom
annotated source: object aggregate
annotated property: editor note
annotated target: An entity a is an object aggregate if and only if there is a mutually exhaustive and pairwise disjoint partition of a into objects
has axiom label: http://purl.obolibrary.org/obo/bfo/axiom/0000301

Axiom
annotated source: object aggregate
annotated property: definition source
annotated target: ISBN:978-3-938793-98-5pp124-158#Thomas Bittner and Barry Smith, 'A Theory of Granular Partitions', in K. Munn and B. Smith (eds.), Applied Ontology: An Introduction, Frankfurt/Lancaster: ontos, 2008, 125-158.
has axiom label: http://purl.obolibrary.org/obo/bfo/axiom/0000300

Axiom
annotated source: object aggregate
annotated property: elucidation
annotated target: b is an object aggregate means: b is a material entity consisting exactly of a plurality of objects as member_parts at all times at which b exists. (axiom label in BFO2 Reference: [025-004])
has axiom label: http://purl.obolibrary.org/obo/bfo/axiom/025-004

Axiom
annotated source: object aggregate
annotated property: has associated axiom(fol)
annotated target: (forall (x) (if (ObjectAggregate x) (and (MaterialEntity x) (forall (t) (if (existsAt x t) (exists (y z) (and (Object y) (Object z) (memberPartOfAt y x t) (memberPartOfAt z x t) (not (= y z)))))) (not (exists (w t_1) (and (memberPartOfAt w x t_1) (not (Object w)))))))) // axiom label in BFO2 CLIF: [025-004]
has axiom label: http://purl.obolibrary.org/obo/bfo/axiom/025-004

three-dimensional spatial region
type: Class
subclass of: spatial region
BFO OWL specification label: 3d-s-region
BFO CLIF specification label: ThreeDimensionalSpatialRegion
example of usage: a cube-shaped region of space
example of usage: a sphere-shaped region of space,
elucidation: A three-dimensional spatial region is a spatial region that is of three dimensions. (axiom label in BFO2 Reference: [040-001])
has associated axiom(fol): (forall (x) (if (ThreeDimensionalSpatialRegion x) (SpatialRegion x))) // axiom label in BFO2 CLIF: [040-001]

Axiom
annotated source: three-dimensional spatial region
annotated property: elucidation
annotated target: A three-dimensional spatial region is a spatial region that is of three dimensions. (axiom label in BFO2 Reference: [040-001])
has axiom label: http://purl.obolibrary.org/obo/bfo/axiom/040-001

Axiom
annotated source: three-dimensional spatial region
annotated property: has associated axiom(fol)
annotated target: (forall (x) (if (ThreeDimensionalSpatialRegion x) (SpatialRegion x))) // axiom label in BFO2 CLIF: [040-001]
has axiom label: http://purl.obolibrary.org/obo/bfo/axiom/040-001

site
type: Class
subclass of: immaterial entity
BFO OWL specification label: site
BFO CLIF specification label: Site
example of usage: Manhattan Canyon)
example of usage: a hole in the interior of a portion of cheese
example of usage: a rabbit hole
example of usage: an air traffic control region defined in the airspace above an airport
example of usage: the Grand Canyon
example of usage: the Piazza San Marco
example of usage: the cockpit of an aircraft
example of usage: the hold of a ship
example of usage: the interior of a kangaroo pouch
example of usage: the interior of the trunk of your car
example of usage: the interior of your bedroom
example of usage: the interior of your office
example of usage: the interior of your refrigerator
example of usage: the lumen of your gut
example of usage: your left nostril (a fiat part – the opening – of your left nasal cavity)
elucidation: b is a site means: b is a three-dimensional immaterial entity that is (partially or wholly) bounded by a material entity or it is a three-dimensional immaterial part thereof. (axiom label in BFO2 Reference: [034-002])
has associated axiom(fol): (forall (x) (if (Site x) (ImmaterialEntity x))) // axiom label in BFO2 CLIF: [034-002]

Axiom
annotated source: site
annotated property: elucidation
annotated target: b is a site means: b is a three-dimensional immaterial entity that is (partially or wholly) bounded by a material entity or it is a three-dimensional immaterial part thereof. (axiom label in BFO2 Reference: [034-002])
has axiom label: http://purl.obolibrary.org/obo/bfo/axiom/034-002

Axiom
annotated source: site
annotated property: has associated axiom(fol)
annotated target: (forall (x) (if (Site x) (ImmaterialEntity x))) // axiom label in BFO2 CLIF: [034-002]
has axiom label: http://purl.obolibrary.org/obo/bfo/axiom/034-002

object
type: Class
subclass of: material entity
BFO OWL specification label: object
BFO CLIF specification label: Object
example of usage: atom
example of usage: cell
example of usage: cells and organisms
example of usage: engineered artifacts
example of usage: grain of sand
example of usage: molecule
example of usage: organelle
example of usage: organism
example of usage: planet
example of usage: solid portions of matter
example of usage: star
editor note: BFO 2 Reference: BFO rests on the presupposition that at multiple micro-, meso- and macroscopic scales reality exhibits certain stable, spatially separated or separable material units, combined or combinable into aggregates of various sorts (for example organisms into what are called ‘populations’). Such units play a central role in almost all domains of natural science from particle physics to cosmology. Many scientific laws govern the units in question, employing general terms (such as ‘molecule’ or ‘planet’) referring to the types and subtypes of units, and also to the types and subtypes of the processes through which such units develop and interact. The division of reality into such natural units is at the heart of biological science, as also is the fact that these units may form higher-level units (as cells form multicellular organisms) and that they may also form aggregates of units, for example as cells form portions of tissue and organs form families, herds, breeds, species, and so on. At the same time, the division of certain portions of reality into engineered units (manufactured artifacts) is the basis of modern industrial technology, which rests on the distributed mass production of engineered parts through division of labor and on their assembly into larger, compound units such as cars and laptops. The division of portions of reality into units is one starting point for the phenomenon of counting.
editor note: BFO 2 Reference: Each object is such that there are entities of which we can assert unproblematically that they lie in its interior, and other entities of which we can assert unproblematically that they lie in its exterior. This may not be so for entities lying at or near the boundary between the interior and exterior. This means that two objects – for example the two cells depicted in Figure 3 – may be such that there are material entities crossing their boundaries which belong determinately to neither cell. Something similar obtains in certain cases of conjoined twins (see below).
editor note: BFO 2 Reference: To say that b is causally unified means: b is a material entity which is such that its material parts are tied together in such a way that, in environments typical for entities of the type in question,if c, a continuant part of b that is in the interior of b at t, is larger than a certain threshold size (which will be determined differently from case to case, depending on factors such as porosity of external cover) and is moved in space to be at t at a location on the exterior of the spatial region that had been occupied by b at t, then either b’s other parts will be moved in coordinated fashion or b will be damaged (be affected, for example, by breakage or tearing) in the interval between t and t.causal changes in one part of b can have consequences for other parts of b without the mediation of any entity that lies on the exterior of b. Material entities with no proper material parts would satisfy these conditions trivially. Candidate examples of types of causal unity for material entities of more complex sorts are as follows (this is not intended to be an exhaustive list):CU1: Causal unity via physical coveringHere the parts in the interior of the unified entity are combined together causally through a common membrane or other physical covering\. The latter points outwards toward and may serve a protective function in relation to what lies on the exterior of the entity [13, 47
editor note: BFO 2 Reference: an object is a maximal causally unified material entity
editor note: BFO 2 Reference: ‘objects’ are sometimes referred to as ‘grains’ [74
elucidation: b is an object means: b is a material entity which manifests causal unity of one or other of the types CUn listed above & is of a type (a material universal) instances of which are maximal relative to this criterion of causal unity. (axiom label in BFO2 Reference: [024-001])

Axiom
annotated source: object
annotated property: elucidation
annotated target: b is an object means: b is a material entity which manifests causal unity of one or other of the types CUn listed above & is of a type (a material universal) instances of which are maximal relative to this criterion of causal unity. (axiom label in BFO2 Reference: [024-001])
has axiom label: http://purl.obolibrary.org/obo/bfo/axiom/024-001

generically dependent continuant
type: Class
subclass of: continuant
BFO OWL specification label: gdc
BFO CLIF specification label: GenericallyDependentContinuant
example of usage: The entries in your database are patterns instantiated as quality instances in your hard drive. The database itself is an aggregate of such patterns. When you create the database you create a particular instance of the generically dependent continuant type database. Each entry in the database is an instance of the generically dependent continuant type IAO: information content entity.
example of usage: the pdf file on your laptop, the pdf file that is a copy thereof on my laptop
example of usage: the sequence of this protein molecule; the sequence that is a copy thereof in that protein molecule.
definition: b is a generically dependent continuant = Def. b is a continuant that g-depends_on one or more other entities. (axiom label in BFO2 Reference: [074-001])
has associated axiom(fol): (iff (GenericallyDependentContinuant a) (and (Continuant a) (exists (b t) (genericallyDependsOnAt a b t)))) // axiom label in BFO2 CLIF: [074-001]

Axiom
annotated source: generically dependent continuant
annotated property: definition
annotated target: b is a generically dependent continuant = Def. b is a continuant that g-depends_on one or more other entities. (axiom label in BFO2 Reference: [074-001])
has axiom label: http://purl.obolibrary.org/obo/bfo/axiom/074-001

Axiom
annotated source: generically dependent continuant
annotated property: has associated axiom(fol)
annotated target: (iff (GenericallyDependentContinuant a) (and (Continuant a) (exists (b t) (genericallyDependsOnAt a b t)))) // axiom label in BFO2 CLIF: [074-001]
has axiom label: http://purl.obolibrary.org/obo/bfo/axiom/074-001

function
type: Class
subclass of: disposition
BFO OWL specification label: function
BFO CLIF specification label: Function
example of usage: the function of a hammer to drive in nails
example of usage: the function of a heart pacemaker to regulate the beating of a heart through electricity
example of usage: the function of amylase in saliva to break down starch into sugar
editor note: BFO 2 Reference: In the past, we have distinguished two varieties of function, artifactual function and biological function. These are not asserted subtypes of BFO:function however, since the same function – for example: to pump, to transport – can exist both in artifacts and in biological entities. The asserted subtypes of function that would be needed in order to yield a separate monoheirarchy are not artifactual function, biological function, etc., but rather transporting function, pumping function, etc.
elucidation: A function is a disposition that exists in virtue of the bearer’s physical make-up and this physical make-up is something the bearer possesses because it came into being, either through evolution (in the case of natural biological entities) or through intentional design (in the case of artifacts), in order to realize processes of a certain sort. (axiom label in BFO2 Reference: [064-001])
has associated axiom(fol): (forall (x) (if (Function x) (Disposition x))) // axiom label in BFO2 CLIF: [064-001]

Axiom
annotated source: function
annotated property: elucidation
annotated target: A function is a disposition that exists in virtue of the bearer’s physical make-up and this physical make-up is something the bearer possesses because it came into being, either through evolution (in the case of natural biological entities) or through intentional design (in the case of artifacts), in order to realize processes of a certain sort. (axiom label in BFO2 Reference: [064-001])
has axiom label: http://purl.obolibrary.org/obo/bfo/axiom/064-001

Axiom
annotated source: function
annotated property: has associated axiom(fol)
annotated target: (forall (x) (if (Function x) (Disposition x))) // axiom label in BFO2 CLIF: [064-001]
has axiom label: http://purl.obolibrary.org/obo/bfo/axiom/064-001

process boundary
type: Class
subclass of: occurrent
BFO OWL specification label: p-boundary
BFO CLIF specification label: ProcessBoundary
example of usage: the boundary between the 2nd and 3rd year of your life.
definition: p is a process boundary =Def. p is a temporal part of a process & p has no proper temporal parts. (axiom label in BFO2 Reference: [084-001])
has associated axiom(nl): Every process boundary occupies_temporal_region a zero-dimensional temporal region. (axiom label in BFO2 Reference: [085-002])
has associated axiom(fol): (forall (x) (if (ProcessBoundary x) (exists (y) (and (ZeroDimensionalTemporalRegion y) (occupiesTemporalRegion x y))))) // axiom label in BFO2 CLIF: [085-002]
has associated axiom(fol): (iff (ProcessBoundary a) (exists (p) (and (Process p) (temporalPartOf a p) (not (exists (b) (properTemporalPartOf b a)))))) // axiom label in BFO2 CLIF: [084-001]

Axiom
annotated source: process boundary
annotated property: definition
annotated target: p is a process boundary =Def. p is a temporal part of a process & p has no proper temporal parts. (axiom label in BFO2 Reference: [084-001])
has axiom label: http://purl.obolibrary.org/obo/bfo/axiom/084-001

Axiom
annotated source: process boundary
annotated property: has associated axiom(nl)
annotated target: Every process boundary occupies_temporal_region a zero-dimensional temporal region. (axiom label in BFO2 Reference: [085-002])
has axiom label: http://purl.obolibrary.org/obo/bfo/axiom/085-002

Axiom
annotated source: process boundary
annotated property: has associated axiom(fol)
annotated target: (forall (x) (if (ProcessBoundary x) (exists (y) (and (ZeroDimensionalTemporalRegion y) (occupiesTemporalRegion x y))))) // axiom label in BFO2 CLIF: [085-002]
has axiom label: http://purl.obolibrary.org/obo/bfo/axiom/085-002

Axiom
annotated source: process boundary
annotated property: has associated axiom(fol)
annotated target: (iff (ProcessBoundary a) (exists (p) (and (Process p) (temporalPartOf a p) (not (exists (b) (properTemporalPartOf b a)))))) // axiom label in BFO2 CLIF: [084-001]
has axiom label: http://purl.obolibrary.org/obo/bfo/axiom/084-001

one-dimensional temporal region
type: Class
subclass of: temporal region
disjoint with: zero-dimensional temporal region
BFO OWL specification label: 1d-t-region
BFO CLIF specification label: OneDimensionalTemporalRegion
example of usage: the temporal region during which a process occurs.
editor note: BFO 2 Reference: A temporal interval is a special kind of one-dimensional temporal region, namely one that is self-connected (is without gaps or breaks).
elucidation: A one-dimensional temporal region is a temporal region that is extended. (axiom label in BFO2 Reference: [103-001])
has associated axiom(fol): (forall (x) (if (OneDimensionalTemporalRegion x) (TemporalRegion x))) // axiom label in BFO2 CLIF: [103-001]

Axiom
annotated source: one-dimensional temporal region
annotated property: elucidation
annotated target: A one-dimensional temporal region is a temporal region that is extended. (axiom label in BFO2 Reference: [103-001])
has axiom label: http://purl.obolibrary.org/obo/bfo/axiom/103-001

Axiom
annotated source: one-dimensional temporal region
annotated property: has associated axiom(fol)
annotated target: (forall (x) (if (OneDimensionalTemporalRegion x) (TemporalRegion x))) // axiom label in BFO2 CLIF: [103-001]
has axiom label: http://purl.obolibrary.org/obo/bfo/axiom/103-001

material entity
type: Class
subclass of: independent continuant
disjoint with: immaterial entity
BFO OWL specification label: material
BFO CLIF specification label: MaterialEntity
example of usage: a flame
example of usage: a forest fire
example of usage: a human being
example of usage: a hurricane
example of usage: a photon
example of usage: a puff of smoke
example of usage: a sea wave
example of usage: a tornado
example of usage: an aggregate of human beings.
example of usage: an energy wave
example of usage: an epidemic
example of usage: the undetached arm of a human being
definition: An independent continuant that is spatially extended whose identity is independent of that of other entities and can be maintained through time.
editor note: BFO 2 Reference: Material entities (continuants) can preserve their identity even while gaining and losing material parts. Continuants are contrasted with occurrents, which unfold themselves in successive temporal parts or phases [60
editor note: BFO 2 Reference: Object, Fiat Object Part and Object Aggregate are not intended to be exhaustive of Material Entity. Users are invited to propose new subcategories of Material Entity.
editor note: BFO 2 Reference: ‘Matter’ is intended to encompass both mass and energy (we will address the ontological treatment of portions of energy in a later version of BFO). A portion of matter is anything that includes elementary particles among its proper or improper parts: quarks and leptons, including electrons, as the smallest particles thus far discovered; baryons (including protons and neutrons) at a higher level of granularity; atoms and molecules at still higher levels, forming the cells, organs, organisms and other material entities studied by biologists, the portions of rock studied by geologists, the fossils studied by paleontologists, and so on.Material entities are three-dimensional entities (entities extended in three spatial dimensions), as contrasted with the processes in which they participate, which are four-dimensional entities (entities extended also along the dimension of time).According to the FMA, material entities may have immaterial entities as parts – including the entities identified below as sites; for example the interior (or ‘lumen’) of your small intestine is a part of your body. BFO 2.0 embodies a decision to follow the FMA here.
elucidation: A material entity is an independent continuant that has some portion of matter as proper or improper continuant part. (axiom label in BFO2 Reference: [019-002])
has associated axiom(nl): Every entity which has a material entity as continuant part is a material entity. (axiom label in BFO2 Reference: [020-002])
has associated axiom(nl): every entity of which a material entity is continuant part is also a material entity. (axiom label in BFO2 Reference: [021-002])
has associated axiom(fol): (forall (x) (if (MaterialEntity x) (IndependentContinuant x))) // axiom label in BFO2 CLIF: [019-002]
has associated axiom(fol): (forall (x) (if (and (Entity x) (exists (y t) (and (MaterialEntity y) (continuantPartOfAt x y t)))) (MaterialEntity x))) // axiom label in BFO2 CLIF: [021-002]
has associated axiom(fol): (forall (x) (if (and (Entity x) (exists (y t) (and (MaterialEntity y) (continuantPartOfAt y x t)))) (MaterialEntity x))) // axiom label in BFO2 CLIF: [020-002]

Axiom
annotated source: material entity
annotated property: definition
annotated target: An independent continuant that is spatially extended whose identity is independent of that of other entities and can be maintained through time.

Axiom
annotated source: material entity
annotated property: elucidation
annotated target: A material entity is an independent continuant that has some portion of matter as proper or improper continuant part. (axiom label in BFO2 Reference: [019-002])
has axiom label: http://purl.obolibrary.org/obo/bfo/axiom/019-002

Axiom
annotated source: material entity
annotated property: has associated axiom(nl)
annotated target: Every entity which has a material entity as continuant part is a material entity. (axiom label in BFO2 Reference: [020-002])
has axiom label: http://purl.obolibrary.org/obo/bfo/axiom/020-002

Axiom
annotated source: material entity
annotated property: has associated axiom(nl)
annotated target: every entity of which a material entity is continuant part is also a material entity. (axiom label in BFO2 Reference: [021-002])
has axiom label: http://purl.obolibrary.org/obo/bfo/axiom/021-002

Axiom
annotated source: material entity
annotated property: has associated axiom(fol)
annotated target: (forall (x) (if (MaterialEntity x) (IndependentContinuant x))) // axiom label in BFO2 CLIF: [019-002]
has axiom label: http://purl.obolibrary.org/obo/bfo/axiom/019-002

Axiom
annotated source: material entity
annotated property: has associated axiom(fol)
annotated target: (forall (x) (if (and (Entity x) (exists (y t) (and (MaterialEntity y) (continuantPartOfAt x y t)))) (MaterialEntity x))) // axiom label in BFO2 CLIF: [021-002]
has axiom label: http://purl.obolibrary.org/obo/bfo/axiom/021-002

Axiom
annotated source: material entity
annotated property: has associated axiom(fol)
annotated target: (forall (x) (if (and (Entity x) (exists (y t) (and (MaterialEntity y) (continuantPartOfAt y x t)))) (MaterialEntity x))) // axiom label in BFO2 CLIF: [020-002]
has axiom label: http://purl.obolibrary.org/obo/bfo/axiom/020-002

Axiom
annotated source: material entity
annotated property: label
annotated target: material entity

continuant fiat boundary
type: Class
subclass of: immaterial entity
BFO OWL specification label: cf-boundary
BFO CLIF specification label: ContinuantFiatBoundary
definition: b is a continuant fiat boundary = Def. b is an immaterial entity that is of zero, one or two dimensions and does not include a spatial region as part. (axiom label in BFO2 Reference: [029-001])
editor note: BFO 2 Reference: In BFO 1.1 the assumption was made that the external surface of a material entity such as a cell could be treated as if it were a boundary in the mathematical sense. The new document propounds the view that when we talk about external surfaces of material objects in this way then we are talking about something fiat. To be dealt with in a future version: fiat boundaries at different levels of granularity.More generally, the focus in discussion of boundaries in BFO 2.0 is now on fiat boundaries, which means: boundaries for which there is no assumption that they coincide with physical discontinuities. The ontology of boundaries becomes more closely allied with the ontology of regions.
editor note: BFO 2 Reference: a continuant fiat boundary is a boundary of some material entity (for example: the plane separating the Northern and Southern hemispheres; the North Pole), or it is a boundary of some immaterial entity (for example of some portion of airspace). Three basic kinds of continuant fiat boundary can be distinguished (together with various combination kinds [29
editor note: Continuant fiat boundary doesn't have a closure axiom because the subclasses don't necessarily exhaust all possibilites. An example would be the mereological sum of two-dimensional continuant fiat boundary and a one dimensional continuant fiat boundary that doesn't overlap it. The situation is analogous to temporal and spatial regions.
has associated axiom(nl): Every continuant fiat boundary is located at some spatial region at every time at which it exists
has associated axiom(fol): (iff (ContinuantFiatBoundary a) (and (ImmaterialEntity a) (exists (b) (and (or (ZeroDimensionalSpatialRegion b) (OneDimensionalSpatialRegion b) (TwoDimensionalSpatialRegion b)) (forall (t) (locatedInAt a b t)))) (not (exists (c t) (and (SpatialRegion c) (continuantPartOfAt c a t)))))) // axiom label in BFO2 CLIF: [029-001]

Axiom
annotated source: continuant fiat boundary
annotated property: definition
annotated target: b is a continuant fiat boundary = Def. b is an immaterial entity that is of zero, one or two dimensions and does not include a spatial region as part. (axiom label in BFO2 Reference: [029-001])
has axiom label: http://purl.obolibrary.org/obo/bfo/axiom/029-001

Axiom
annotated source: continuant fiat boundary
annotated property: editor note
annotated target: Continuant fiat boundary doesn't have a closure axiom because the subclasses don't necessarily exhaust all possibilites. An example would be the mereological sum of two-dimensional continuant fiat boundary and a one dimensional continuant fiat boundary that doesn't overlap it. The situation is analogous to temporal and spatial regions.
has axiom label: http://purl.obolibrary.org/obo/bfo/axiom/0000008

Axiom
annotated source: continuant fiat boundary
annotated property: has associated axiom(fol)
annotated target: (iff (ContinuantFiatBoundary a) (and (ImmaterialEntity a) (exists (b) (and (or (ZeroDimensionalSpatialRegion b) (OneDimensionalSpatialRegion b) (TwoDimensionalSpatialRegion b)) (forall (t) (locatedInAt a b t)))) (not (exists (c t) (and (SpatialRegion c) (continuantPartOfAt c a t)))))) // axiom label in BFO2 CLIF: [029-001]
has axiom label: http://purl.obolibrary.org/obo/bfo/axiom/029-001

immaterial entity
type: Class
subclass of: independent continuant
BFO OWL specification label: immaterial
BFO CLIF specification label: ImmaterialEntity
editor note: BFO 2 Reference: Immaterial entities are divided into two subgroups:boundaries and sites, which bound, or are demarcated in relation, to material entities, and which can thus change location, shape and size and as their material hosts move or change shape or size (for example: your nasal passage; the hold of a ship; the boundary of Wales (which moves with the rotation of the Earth) [38, 7, 10

one-dimensional continuant fiat boundary
type: Class
subclass of: continuant fiat boundary
disjoint with: two-dimensional continuant fiat boundary
disjoint with: zero-dimensional continuant fiat boundary
BFO OWL specification label: 1d-cf-boundary
BFO CLIF specification label: OneDimensionalContinuantFiatBoundary
example of usage: The Equator
example of usage: all geopolitical boundaries
example of usage: all lines of latitude and longitude
example of usage: the line separating the outer surface of the mucosa of the lower lip from the outer surface of the skin of the chin.
example of usage: the median sulcus of your tongue
elucidation: a one-dimensional continuant fiat boundary is a continuous fiat line whose location is defined in relation to some material entity. (axiom label in BFO2 Reference: [032-001])
has associated axiom(fol): (iff (OneDimensionalContinuantFiatBoundary a) (and (ContinuantFiatBoundary a) (exists (b) (and (OneDimensionalSpatialRegion b) (forall (t) (locatedInAt a b t)))))) // axiom label in BFO2 CLIF: [032-001]

Axiom
annotated source: one-dimensional continuant fiat boundary
annotated property: elucidation
annotated target: a one-dimensional continuant fiat boundary is a continuous fiat line whose location is defined in relation to some material entity. (axiom label in BFO2 Reference: [032-001])
has axiom label: http://purl.obolibrary.org/obo/bfo/axiom/032-001

Axiom
annotated source: one-dimensional continuant fiat boundary
annotated property: has associated axiom(fol)
annotated target: (iff (OneDimensionalContinuantFiatBoundary a) (and (ContinuantFiatBoundary a) (exists (b) (and (OneDimensionalSpatialRegion b) (forall (t) (locatedInAt a b t)))))) // axiom label in BFO2 CLIF: [032-001]
has axiom label: http://purl.obolibrary.org/obo/bfo/axiom/032-001

process profile
type: Class
subclass of: process
disjoint with: history
BFO OWL specification label: process-profile
BFO CLIF specification label: ProcessProfile
example of usage: On a somewhat higher level of complexity are what we shall call rate process profiles, which are the targets of selective abstraction focused not on determinate quality magnitudes plotted over time, but rather on certain ratios between these magnitudes and elapsed times. A speed process profile, for example, is represented by a graph plotting against time the ratio of distance covered per unit of time. Since rates may change, and since such changes, too, may have rates of change, we have to deal here with a hierarchy of process profile universals at successive levels
example of usage: One important sub-family of rate process profiles is illustrated by the beat or frequency profiles of cyclical processes, illustrated by the 60 beats per minute beating process of John’s heart, or the 120 beats per minute drumming process involved in one of John’s performances in a rock band, and so on. Each such process includes what we shall call a beat process profile instance as part, a subtype of rate process profile in which the salient ratio is not distance covered but rather number of beat cycles per unit of time. Each beat process profile instance instantiates the determinable universal beat process profile. But it also instantiates multiple more specialized universals at lower levels of generality, selected from rate process profilebeat process profileregular beat process profile3 bpm beat process profile4 bpm beat process profileirregular beat process profileincreasing beat process profileand so on.In the case of a regular beat process profile, a rate can be assigned in the simplest possible fashion by dividing the number of cycles by the length of the temporal region occupied by the beating process profile as a whole. Irregular process profiles of this sort, for example as identified in the clinic, or in the readings on an aircraft instrument panel, are often of diagnostic significance.
example of usage: The simplest type of process profiles are what we shall call ‘quality process profiles’, which are the process profiles which serve as the foci of the sort of selective abstraction that is involved when measurements are made of changes in single qualities, as illustrated, for example, by process profiles of mass, temperature, aortic pressure, and so on.
definition: b is a process_profile =Def. there is some process c such that b process_profile_of c (axiom label in BFO2 Reference: [093-002])
elucidation: b process_profile_of c holds when b proper_occurrent_part_of c& there is some proper_occurrent_part d of c which has no parts in common with b & is mutually dependent on b& is such that b, c and d occupy the same temporal region (axiom label in BFO2 Reference: [094-005])
has associated axiom(fol): (forall (x y) (if (processProfileOf x y) (and (properContinuantPartOf x y) (exists (z t) (and (properOccurrentPartOf z y) (TemporalRegion t) (occupiesSpatioTemporalRegion x t) (occupiesSpatioTemporalRegion y t) (occupiesSpatioTemporalRegion z t) (not (exists (w) (and (occurrentPartOf w x) (occurrentPartOf w z))))))))) // axiom label in BFO2 CLIF: [094-005]
has associated axiom(fol): (iff (ProcessProfile a) (exists (b) (and (Process b) (processProfileOf a b)))) // axiom label in BFO2 CLIF: [093-002]

Axiom
annotated source: process profile
annotated property: definition
annotated target: b is a process_profile =Def. there is some process c such that b process_profile_of c (axiom label in BFO2 Reference: [093-002])
has axiom label: http://purl.obolibrary.org/obo/bfo/axiom/093-002

Axiom
annotated source: process profile
annotated property: elucidation
annotated target: b process_profile_of c holds when b proper_occurrent_part_of c& there is some proper_occurrent_part d of c which has no parts in common with b & is mutually dependent on b& is such that b, c and d occupy the same temporal region (axiom label in BFO2 Reference: [094-005])
has axiom label: http://purl.obolibrary.org/obo/bfo/axiom/094-005

Axiom
annotated source: process profile
annotated property: has associated axiom(fol)
annotated target: (forall (x y) (if (processProfileOf x y) (and (properContinuantPartOf x y) (exists (z t) (and (properOccurrentPartOf z y) (TemporalRegion t) (occupiesSpatioTemporalRegion x t) (occupiesSpatioTemporalRegion y t) (occupiesSpatioTemporalRegion z t) (not (exists (w) (and (occurrentPartOf w x) (occurrentPartOf w z))))))))) // axiom label in BFO2 CLIF: [094-005]
has axiom label: http://purl.obolibrary.org/obo/bfo/axiom/094-005

Axiom
annotated source: process profile
annotated property: has associated axiom(fol)
annotated target: (iff (ProcessProfile a) (exists (b) (and (Process b) (processProfileOf a b)))) // axiom label in BFO2 CLIF: [093-002]
has axiom label: http://purl.obolibrary.org/obo/bfo/axiom/093-002

relational quality
type: Class
subclass of: quality
BFO OWL specification label: r-quality
BFO CLIF specification label: RelationalQuality
example of usage: John’s role of husband to Mary is dependent on Mary’s role of wife to John, and both are dependent on the object aggregate comprising John and Mary as member parts joined together through the relational quality of being married.
example of usage: a marriage bond, an instance of love, an obligation between one person and another.
definition: b is a relational quality = Def. for some independent continuants c, d and for some time t: b quality_of c at t & b quality_of d at t. (axiom label in BFO2 Reference: [057-001])
has associated axiom(fol): (iff (RelationalQuality a) (exists (b c t) (and (IndependentContinuant b) (IndependentContinuant c) (qualityOfAt a b t) (qualityOfAt a c t)))) // axiom label in BFO2 CLIF: [057-001]

Axiom
annotated source: relational quality
annotated property: definition
annotated target: b is a relational quality = Def. for some independent continuants c, d and for some time t: b quality_of c at t & b quality_of d at t. (axiom label in BFO2 Reference: [057-001])
has axiom label: http://purl.obolibrary.org/obo/bfo/axiom/057-001

Axiom
annotated source: relational quality
annotated property: has associated axiom(fol)
annotated target: (iff (RelationalQuality a) (exists (b c t) (and (IndependentContinuant b) (IndependentContinuant c) (qualityOfAt a b t) (qualityOfAt a c t)))) // axiom label in BFO2 CLIF: [057-001]
has axiom label: http://purl.obolibrary.org/obo/bfo/axiom/057-001

two-dimensional continuant fiat boundary
type: Class
subclass of: continuant fiat boundary
BFO OWL specification label: 2d-cf-boundary
BFO CLIF specification label: TwoDimensionalContinuantFiatBoundary
elucidation: a two-dimensional continuant fiat boundary (surface) is a self-connected fiat surface whose location is defined in relation to some material entity. (axiom label in BFO2 Reference: [033-001])
has associated axiom(fol): (iff (TwoDimensionalContinuantFiatBoundary a) (and (ContinuantFiatBoundary a) (exists (b) (and (TwoDimensionalSpatialRegion b) (forall (t) (locatedInAt a b t)))))) // axiom label in BFO2 CLIF: [033-001]

Axiom
annotated source: two-dimensional continuant fiat boundary
annotated property: elucidation
annotated target: a two-dimensional continuant fiat boundary (surface) is a self-connected fiat surface whose location is defined in relation to some material entity. (axiom label in BFO2 Reference: [033-001])
has axiom label: http://purl.obolibrary.org/obo/bfo/axiom/033-001

Axiom
annotated source: two-dimensional continuant fiat boundary
annotated property: has associated axiom(fol)
annotated target: (iff (TwoDimensionalContinuantFiatBoundary a) (and (ContinuantFiatBoundary a) (exists (b) (and (TwoDimensionalSpatialRegion b) (forall (t) (locatedInAt a b t)))))) // axiom label in BFO2 CLIF: [033-001]
has axiom label: http://purl.obolibrary.org/obo/bfo/axiom/033-001

zero-dimensional continuant fiat boundary
type: Class
subclass of: continuant fiat boundary
BFO OWL specification label: 0d-cf-boundary
BFO CLIF specification label: ZeroDimensionalContinuantFiatBoundary
example of usage: the geographic North Pole
example of usage: the point of origin of some spatial coordinate system.
example of usage: the quadripoint where the boundaries of Colorado, Utah, New Mexico, and Arizona meet
editor note: zero dimension continuant fiat boundaries are not spatial points. Considering the example 'the quadripoint where the boundaries of Colorado, Utah, New Mexico, and Arizona meet' : There are many frames in which that point is zooming through many points in space. Whereas, no matter what the frame, the quadripoint is always in the same relation to the boundaries of Colorado, Utah, New Mexico, and Arizona.
elucidation: a zero-dimensional continuant fiat boundary is a fiat point whose location is defined in relation to some material entity. (axiom label in BFO2 Reference: [031-001])
has associated axiom(fol): (iff (ZeroDimensionalContinuantFiatBoundary a) (and (ContinuantFiatBoundary a) (exists (b) (and (ZeroDimensionalSpatialRegion b) (forall (t) (locatedInAt a b t)))))) // axiom label in BFO2 CLIF: [031-001]

Axiom
annotated source: zero-dimensional continuant fiat boundary
annotated property: editor note
annotated target: zero dimension continuant fiat boundaries are not spatial points. Considering the example 'the quadripoint where the boundaries of Colorado, Utah, New Mexico, and Arizona meet' : There are many frames in which that point is zooming through many points in space. Whereas, no matter what the frame, the quadripoint is always in the same relation to the boundaries of Colorado, Utah, New Mexico, and Arizona.
has axiom label: http://purl.obolibrary.org/obo/bfo/axiom/0000001
comment: requested by Melanie Courtot

Axiom
annotated source: zero-dimensional continuant fiat boundary
annotated property: elucidation
annotated target: a zero-dimensional continuant fiat boundary is a fiat point whose location is defined in relation to some material entity. (axiom label in BFO2 Reference: [031-001])
has axiom label: http://purl.obolibrary.org/obo/bfo/axiom/031-001

Axiom
annotated source: zero-dimensional continuant fiat boundary
annotated property: has associated axiom(fol)
annotated target: (iff (ZeroDimensionalContinuantFiatBoundary a) (and (ContinuantFiatBoundary a) (exists (b) (and (ZeroDimensionalSpatialRegion b) (forall (t) (locatedInAt a b t)))))) // axiom label in BFO2 CLIF: [031-001]
has axiom label: http://purl.obolibrary.org/obo/bfo/axiom/031-001

zero-dimensional temporal region
type: Class
subclass of: temporal region
BFO OWL specification label: 0d-t-region
BFO CLIF specification label: ZeroDimensionalTemporalRegion
example of usage: a temporal region that is occupied by a process boundary
example of usage: right now
example of usage: the moment at which a child is born
example of usage: the moment at which a finger is detached in an industrial accident
example of usage: the moment of death.
alternative label: temporal instant.
elucidation: A zero-dimensional temporal region is a temporal region that is without extent. (axiom label in BFO2 Reference: [102-001])
has associated axiom(fol): (forall (x) (if (ZeroDimensionalTemporalRegion x) (TemporalRegion x))) // axiom label in BFO2 CLIF: [102-001]

Axiom
annotated source: zero-dimensional temporal region
annotated property: elucidation
annotated target: A zero-dimensional temporal region is a temporal region that is without extent. (axiom label in BFO2 Reference: [102-001])
has axiom label: http://purl.obolibrary.org/obo/bfo/axiom/102-001

Axiom
annotated source: zero-dimensional temporal region
annotated property: has associated axiom(fol)
annotated target: (forall (x) (if (ZeroDimensionalTemporalRegion x) (TemporalRegion x))) // axiom label in BFO2 CLIF: [102-001]
has axiom label: http://purl.obolibrary.org/obo/bfo/axiom/102-001

history
type: Class
subclass of: process
BFO OWL specification label: history
BFO CLIF specification label: History
elucidation: A history is a process that is the sum of the totality of processes taking place in the spatiotemporal region occupied by a material entity or site, including processes on the surface of the entity or within the cavities to which it serves as host. (axiom label in BFO2 Reference: [138-001])

Axiom
annotated source: history
annotated property: elucidation
annotated target: A history is a process that is the sum of the totality of processes taking place in the spatiotemporal region occupied by a material entity or site, including processes on the surface of the entity or within the cavities to which it serves as host. (axiom label in BFO2 Reference: [138-001])
has axiom label: http://purl.obolibrary.org/obo/bfo/axiom/138-001

objective specification
type: Class
subclass of: directive information entity
editor preferred term: objective specification
example of usage: In the protocol of a ChIP assay the objective specification says to identify protein and DNA interaction.
has curation status: IAO_0000122
definition: A directive information entity that describes an intended process endpoint. When part of a plan specification the concretization is realized in a planned process in which the bearer tries to effect the world so that the process endpoint is achieved.
editor note: 2009-03-16: original definition when imported from OBI read: "objective is an non realizable information entity which can serve as that proper part of a plan towards which the realization of the plan is directed."
editor note: 2014-03-31: In the example of usage ("In the protocol of a ChIP assay the objective specification says to identify protein and DNA interaction") there is a protocol which is the ChIP assay protocol. In addition to being concretized on paper, the protocol can be concretized as a realizable entity, such as a plan that inheres in a person. The objective specification is the part that says that some protein and DNA interactions are identified. This is a specification of a process endpoint: the boundary in the process before which they are not identified and after which they are. During the realization of the plan, the goal is to get to the point of having the interactions, and participants in the realization of the plan try to do that.
editor note: Answers the question, why did you do this experiment?
term editor: PERSON: Alan Ruttenberg
term editor: PERSON: Barry Smith
term editor: PERSON: Bjoern Peters
term editor: PERSON: Jennifer Fostel
alternative label: goal specification
definition source: OBI Plan and Planned Process/Roles Branch
definition source: OBI_0000217

Axiom
annotated source: objective specification
annotated property: editor preferred term
annotated target: objective specification

Axiom
annotated source: objective specification
annotated property: example of usage
annotated target: In the protocol of a ChIP assay the objective specification says to identify protein and DNA interaction.

Axiom
annotated source: objective specification
annotated property: definition
annotated target: A directive information entity that describes an intended process endpoint. When part of a plan specification the concretization is realized in a planned process in which the bearer tries to effect the world so that the process endpoint is achieved.

Axiom
annotated source: objective specification
annotated property: editor note
annotated target: 2009-03-16: original definition when imported from OBI read: "objective is an non realizable information entity which can serve as that proper part of a plan towards which the realization of the plan is directed."

Axiom
annotated source: objective specification
annotated property: editor note
annotated target: 2014-03-31: In the example of usage ("In the protocol of a ChIP assay the objective specification says to identify protein and DNA interaction") there is a protocol which is the ChIP assay protocol. In addition to being concretized on paper, the protocol can be concretized as a realizable entity, such as a plan that inheres in a person. The objective specification is the part that says that some protein and DNA interactions are identified. This is a specification of a process endpoint: the boundary in the process before which they are not identified and after which they are. During the realization of the plan, the goal is to get to the point of having the interactions, and participants in the realization of the plan try to do that.

Axiom
annotated source: objective specification
annotated property: editor note
annotated target: Answers the question, why did you do this experiment?

Axiom
annotated source: objective specification
annotated property: term editor
annotated target: PERSON: Alan Ruttenberg

Axiom
annotated source: objective specification
annotated property: term editor
annotated target: PERSON: Barry Smith

Axiom
annotated source: objective specification
annotated property: term editor
annotated target: PERSON: Bjoern Peters

Axiom
annotated source: objective specification
annotated property: term editor
annotated target: PERSON: Jennifer Fostel

Axiom
annotated source: objective specification
annotated property: alternative label
annotated target: goal specification

Axiom
annotated source: objective specification
annotated property: definition source
annotated target: OBI Plan and Planned Process/Roles Branch

Axiom
annotated source: objective specification
annotated property: definition source
annotated target: OBI_0000217

Axiom
annotated source: objective specification
annotated property: label
annotated target: objective specification

action specification
type: Class
subclass of: directive information entity
example of usage: Pour the contents of flask 1 into flask 2
has curation status: IAO_0000122
definition: A directive information entity that describes an action the bearer will take.
term editor: Alan Ruttenberg
definition source: OBI Plan and Planned Process branch

Axiom
annotated source: action specification
annotated property: example of usage
annotated target: Pour the contents of flask 1 into flask 2

Axiom
annotated source: action specification
annotated property: definition
annotated target: A directive information entity that describes an action the bearer will take.

Axiom
annotated source: action specification
annotated property: term editor
annotated target: Alan Ruttenberg

Axiom
annotated source: action specification
annotated property: definition source
annotated target: OBI Plan and Planned Process branch

Axiom
annotated source: action specification
annotated property: label
annotated target: action specification

software
type: Class
subclass of: plan specification
subclass of: Restriction
  on property: has licence
  some values from: software licence
editor preferred term: software
has curation status: IAO_0000120
definition: Software is a plan specification composed of a series of instructions that can be interpreted by or directly executed by a processing unit.
editor note: see sourceforge tracker discussion at http://sourceforge.net/tracker/index.php?func=detail&aid=1958818&group_id=177891&atid=886178
term editor: PERSON: Alan Ruttenberg
term editor: PERSON: Bjoern Peters
term editor: PERSON: Chris Stoeckert
term editor: PERSON: Melanie Courtot
definition source: GROUP: OBI
term tracker annotation: Add 'has licence' axiom: issue: https://github.com/OpenEnergyPlatform/ontology/issues/1275 pull request: https://github.com/OpenEnergyPlatform/ontology/pull/1547 move axiom to oeo-model pull request: https://github.com/OpenEnergyPlatform/ontology/pull/1738

Axiom
annotated source: software
annotated property: editor preferred term
annotated target: software

Axiom
annotated source: software
annotated property: definition
annotated target: Software is a plan specification composed of a series of instructions that can be interpreted by or directly executed by a processing unit.

Axiom
annotated source: software
annotated property: editor note
annotated target: see sourceforge tracker discussion at http://sourceforge.net/tracker/index.php?func=detail&aid=1958818&group_id=177891&atid=886178

Axiom
annotated source: software
annotated property: term editor
annotated target: PERSON: Alan Ruttenberg

Axiom
annotated source: software
annotated property: term editor
annotated target: PERSON: Bjoern Peters

Axiom
annotated source: software
annotated property: term editor
annotated target: PERSON: Chris Stoeckert

Axiom
annotated source: software
annotated property: term editor
annotated target: PERSON: Melanie Courtot

Axiom
annotated source: software
annotated property: definition source
annotated target: GROUP: OBI

Axiom
annotated source: software
annotated property: label
annotated target: software

journal article
type: Class
subclass of: report
editor preferred term: journal article
example of usage: Examples are articles published in the journals, Nature and Science. The content can often be cited by reference to a paper based encoding, e.g. Authors, Title of article, Journal name, date or year of publication, volume and page number.
has curation status: IAO_0000120
definition: A report that is published in a journal.
term editor: PERSON: Alan Ruttenberg
term editor: PERSON: Chris Stoeckert
definition source: OBI_0000159
definition source: group:OBI
comment: IAO provides two parent classes, from which only "report" in imported to OEO.
term tracker annotation: add subclass axiom to report issue: https://github.com/OpenEnergyPlatform/ontology/issues/1700 pull request: https://github.com/OpenEnergyPlatform/ontology/pull/1754

Axiom
annotated source: journal article
annotated property: editor preferred term
annotated target: journal article

Axiom
annotated source: journal article
annotated property: example of usage
annotated target: Examples are articles published in the journals, Nature and Science. The content can often be cited by reference to a paper based encoding, e.g. Authors, Title of article, Journal name, date or year of publication, volume and page number.

Axiom
annotated source: journal article
annotated property: definition
annotated target: A report that is published in a journal.

Axiom
annotated source: journal article
annotated property: term editor
annotated target: PERSON: Alan Ruttenberg

Axiom
annotated source: journal article
annotated property: term editor
annotated target: PERSON: Chris Stoeckert

Axiom
annotated source: journal article
annotated property: definition source
annotated target: OBI_0000159

Axiom
annotated source: journal article
annotated property: definition source
annotated target: group:OBI

Axiom
annotated source: journal article
annotated property: label
annotated target: journal article

programming language
type: Class
subclass of: plan specification
editor preferred term: programming language
example of usage: R, Perl, Java
has curation status: IAO_0000120
definition: A language in which source code is written that is intended to be executed/run by a software interpreter. Programming languages are ways to write instructions that specify what to do, and sometimes, how to do it.
term editor: person:Alan Ruttenberg
term editor: person:Chris Stoeckert
definition source: OBI_0000058
definition source: group:OBI

Axiom
annotated source: programming language
annotated property: editor preferred term
annotated target: programming language

Axiom
annotated source: programming language
annotated property: example of usage
annotated target: R, Perl, Java

Axiom
annotated source: programming language
annotated property: definition
annotated target: A language in which source code is written that is intended to be executed/run by a software interpreter. Programming languages are ways to write instructions that specify what to do, and sometimes, how to do it.

Axiom
annotated source: programming language
annotated property: term editor
annotated target: person:Alan Ruttenberg

Axiom
annotated source: programming language
annotated property: term editor
annotated target: person:Chris Stoeckert

Axiom
annotated source: programming language
annotated property: definition source
annotated target: OBI_0000058

Axiom
annotated source: programming language
annotated property: definition source
annotated target: group:OBI

Axiom
annotated source: programming language
annotated property: label
annotated target: programming language

data item
type: Class
subclass of: information content entity
editor preferred term: data item
example of usage: Data items include counts of things, analyte concentrations, and statistical summaries.
has curation status: IAO_0000125
definition: A data item is an information content entity that is intended to be a truthful statement about something (modulo, e.g., measurement precision or other systematic errors) and is constructed/acquired by a method which reliably tends to produce (approximately) truthful statements.
definition: An information content entity that is intended to be a truthful statement about something (modulo, e.g., measurement precision or other systematic errors) and is constructed/acquired by a method which reliably tends to produce (approximately) truthful statements.
editor note: 2/2/2009 Alan and Bjoern discussing FACS run output data. This is a data item because it is about the cell population. Each element records an event and is typically further composed a set of measurment data items that record the fluorescent intensity stimulated by one of the lasers.
editor note: 2009-03-16: data item deliberatly ambiguous: we merged data set and datum to be one entity, not knowing how to define singular versus plural. So data item is more general than datum.
editor note: 2009-03-16: removed datum as alternative term as datum specifically refers to singular form, and is thus not an exact synonym.
editor note: 2014-03-31: See discussion at http://odontomachus.wordpress.com/2014/03/30/aboutness-objects-propositions/
editor note: JAR: datum -- well, this will be very tricky to define, but maybe some information-like stuff that might be put into a computer and that is meant, by someone, to denote and/or to be interpreted by some process... I would include lists, tables, sentences... I think I might defer to Barry, or to Brian Cantwell Smith JAR: A data item is an approximately justified approximately true approximate belief
term editor: PERSON: Alan Ruttenberg
term editor: PERSON: Chris Stoeckert
term editor: PERSON: Jonathan Rees
alternative label: data
definition source: http://www.ontobee.org/ontology/IAO

Axiom
annotated source: data item
annotated property: editor preferred term
annotated target: data item

Axiom
annotated source: data item
annotated property: example of usage
annotated target: Data items include counts of things, analyte concentrations, and statistical summaries.

Axiom
annotated source: data item
annotated property: definition
annotated target: A data item is an information content entity that is intended to be a truthful statement about something (modulo, e.g., measurement precision or other systematic errors) and is constructed/acquired by a method which reliably tends to produce (approximately) truthful statements.
term tracker annotation: issue: https://github.com/OpenEnergyPlatform/ontology/issues/823 pull request: https://github.com/OpenEnergyPlatform/ontology/pull/826

Axiom
annotated source: data item
annotated property: definition
annotated target: An information content entity that is intended to be a truthful statement about something (modulo, e.g., measurement precision or other systematic errors) and is constructed/acquired by a method which reliably tends to produce (approximately) truthful statements.

Axiom
annotated source: data item
annotated property: editor note
annotated target: 2/2/2009 Alan and Bjoern discussing FACS run output data. This is a data item because it is about the cell population. Each element records an event and is typically further composed a set of measurment data items that record the fluorescent intensity stimulated by one of the lasers.

Axiom
annotated source: data item
annotated property: editor note
annotated target: 2009-03-16: data item deliberatly ambiguous: we merged data set and datum to be one entity, not knowing how to define singular versus plural. So data item is more general than datum.

Axiom
annotated source: data item
annotated property: editor note
annotated target: 2009-03-16: removed datum as alternative term as datum specifically refers to singular form, and is thus not an exact synonym.

Axiom
annotated source: data item
annotated property: editor note
annotated target: 2014-03-31: See discussion at http://odontomachus.wordpress.com/2014/03/30/aboutness-objects-propositions/

Axiom
annotated source: data item
annotated property: editor note
annotated target: JAR: datum -- well, this will be very tricky to define, but maybe some information-like stuff that might be put into a computer and that is meant, by someone, to denote and/or to be interpreted by some process... I would include lists, tables, sentences... I think I might defer to Barry, or to Brian Cantwell Smith JAR: A data item is an approximately justified approximately true approximate belief

Axiom
annotated source: data item
annotated property: term editor
annotated target: PERSON: Alan Ruttenberg

Axiom
annotated source: data item
annotated property: term editor
annotated target: PERSON: Chris Stoeckert

Axiom
annotated source: data item
annotated property: term editor
annotated target: PERSON: Jonathan Rees

Axiom
annotated source: data item
annotated property: alternative label
annotated target: data

Axiom
annotated source: data item
annotated property: label
annotated target: data item

symbol
type: Class
subclass of: information content entity
editor preferred term: symbol
example of usage: a serial number such as "12324X"
example of usage: a stop sign
example of usage: a written proper name such as "OBI"
has curation status: IAO_0000125
definition: An information content entity that is a mark(s) or character(s) used as a conventional representation of another entity.
editor note: 20091104, MC: this needs work and will most probably change
editor note: 2014-03-31: We would like to have a deeper analysis of 'mark' and 'sign' in the future (see https://github.com/information-artifact-ontology/IAO/issues/154).
term editor: PERSON: James A. Overton
term editor: PERSON: Jonathan Rees
definition source: based on Oxford English Dictionary

Axiom
annotated source: symbol
annotated property: editor preferred term
annotated target: symbol

Axiom
annotated source: symbol
annotated property: example of usage
annotated target: a serial number such as "12324X"

Axiom
annotated source: symbol
annotated property: example of usage
annotated target: a stop sign

Axiom
annotated source: symbol
annotated property: example of usage
annotated target: a written proper name such as "OBI"

Axiom
annotated source: symbol
annotated property: definition
annotated target: An information content entity that is a mark(s) or character(s) used as a conventional representation of another entity.

Axiom
annotated source: symbol
annotated property: editor note
annotated target: 20091104, MC: this needs work and will most probably change

Axiom
annotated source: symbol
annotated property: editor note
annotated target: 2014-03-31: We would like to have a deeper analysis of 'mark' and 'sign' in the future (see https://github.com/information-artifact-ontology/IAO/issues/154).

Axiom
annotated source: symbol
annotated property: term editor
annotated target: PERSON: James A. Overton

Axiom
annotated source: symbol
annotated property: term editor
annotated target: PERSON: Jonathan Rees

Axiom
annotated source: symbol
annotated property: definition source
annotated target: based on Oxford English Dictionary

Axiom
annotated source: symbol
annotated property: label
annotated target: symbol

information content entity
type: Class
subclass of: generically dependent continuant
editor preferred term: information content entity
example of usage: Examples of information content entites include journal articles, data, graphical layouts, and graphs.
has curation status: IAO_0000122
definition: A generically dependent continuant that is about some thing.
editor note: 2014-03-10: The use of "thing" is intended to be general enough to include universals and configurations (see https://groups.google.com/d/msg/information-ontology/GBxvYZCk1oc/-L6B5fSBBTQJ).
editor note: information_content_entity 'is_encoded_in' some digital_entity in obi before split (040907). information_content_entity 'is_encoded_in' some physical_document in obi before split (040907). Previous. An information content entity is a non-realizable information entity that 'is encoded in' some digital or physical entity.
term editor: PERSON: Chris Stoeckert
definition source: OBI_0000142
term tracker annotation: add axiom has copyright license issue https://github.com/OpenEnergyPlatform/ontology/issues/1061 pull request https://github.com/OpenEnergyPlatform/ontology/pull/1090 Delete axiom has (copyright) licence: issue: https://github.com/OpenEnergyPlatform/ontology/issues/1275 pull request: https://github.com/OpenEnergyPlatform/ontology/pull/1547

Axiom
annotated source: information content entity
annotated property: editor preferred term
annotated target: information content entity

Axiom
annotated source: information content entity
annotated property: example of usage
annotated target: Examples of information content entites include journal articles, data, graphical layouts, and graphs.

Axiom
annotated source: information content entity
annotated property: definition
annotated target: A generically dependent continuant that is about some thing.

Axiom
annotated source: information content entity
annotated property: editor note
annotated target: 2014-03-10: The use of "thing" is intended to be general enough to include universals and configurations (see https://groups.google.com/d/msg/information-ontology/GBxvYZCk1oc/-L6B5fSBBTQJ).

Axiom
annotated source: information content entity
annotated property: editor note
annotated target: information_content_entity 'is_encoded_in' some digital_entity in obi before split (040907). information_content_entity 'is_encoded_in' some physical_document in obi before split (040907). Previous. An information content entity is a non-realizable information entity that 'is encoded in' some digital or physical entity.

Axiom
annotated source: information content entity
annotated property: term editor
annotated target: PERSON: Chris Stoeckert

Axiom
annotated source: information content entity
annotated property: definition source
annotated target: OBI_0000142

Axiom
annotated source: information content entity
annotated property: label
annotated target: information content entity

directive information entity
type: Class
subclass of: information content entity
has curation status: IAO_0000122
definition: An information content entity whose concretizations indicate to their bearer how to realize them in a process.
editor note: 2009-03-16: provenance: a term realizable information entity was proposed for OBI (OBI_0000337) , edited by the PlanAndPlannedProcess branch. Original definition was "is the specification of a process that can be concretized and realized by an actor" with alternative term "instruction".It has been subsequently moved to IAO where the objective for which the original term was defined was satisfied with the definitionof this, different, term.
editor note: 2013-05-30 Alan Ruttenberg: What differentiates a directive information entity from an information concretization is that it can have concretizations that are either qualities or realizable entities. The concretizations that are realizable entities are created when an individual chooses to take up the direction, i.e. has the intention to (try to) realize it.
editor note: 8/6/2009 Alan Ruttenberg: Changed label from "information entity about a realizable" after discussions at ICBO
editor note: Werner pushed back on calling it realizable information entity as it isn't realizable. However this name isn't right either. An example would be a recipe. The realizable entity would be a plan, but the information entity isn't about the plan, it, once concretized, *is* the plan. -Alan
term editor: PERSON: Alan Ruttenberg
term editor: PERSON: Bjoern Peters

Axiom
annotated source: directive information entity
annotated property: definition
annotated target: An information content entity whose concretizations indicate to their bearer how to realize them in a process.

Axiom
annotated source: directive information entity
annotated property: editor note
annotated target: 2009-03-16: provenance: a term realizable information entity was proposed for OBI (OBI_0000337) , edited by the PlanAndPlannedProcess branch. Original definition was "is the specification of a process that can be concretized and realized by an actor" with alternative term "instruction".It has been subsequently moved to IAO where the objective for which the original term was defined was satisfied with the definitionof this, different, term.

Axiom
annotated source: directive information entity
annotated property: editor note
annotated target: 2013-05-30 Alan Ruttenberg: What differentiates a directive information entity from an information concretization is that it can have concretizations that are either qualities or realizable entities. The concretizations that are realizable entities are created when an individual chooses to take up the direction, i.e. has the intention to (try to) realize it.

Axiom
annotated source: directive information entity
annotated property: editor note
annotated target: 8/6/2009 Alan Ruttenberg: Changed label from "information entity about a realizable" after discussions at ICBO

Axiom
annotated source: directive information entity
annotated property: editor note
annotated target: Werner pushed back on calling it realizable information entity as it isn't realizable. However this name isn't right either. An example would be a recipe. The realizable entity would be a plan, but the information entity isn't about the plan, it, once concretized, *is* the plan. -Alan

Axiom
annotated source: directive information entity
annotated property: term editor
annotated target: PERSON: Alan Ruttenberg

Axiom
annotated source: directive information entity
annotated property: term editor
annotated target: PERSON: Bjoern Peters

Axiom
annotated source: directive information entity
annotated property: label
annotated target: directive information entity

algorithm
type: Class
subclass of: plan specification
editor preferred term: algorithm
example of usage: PMID: 18378114.Genomics. 2008 Mar 28. LINKGEN: A new algorithm to process data in genetic linkage studies.
has curation status: IAO_0000120
definition: A plan specification which describes the inputs and output of mathematical functions as well as workflow of execution for achieving an predefined objective. Algorithms are realized usually by means of implementation as computer programs for execution by automata.
term editor: Philippe Rocca-Serra
term editor: PlanAndPlannedProcess Branch
definition source: OBI_0000270
definition source: adapted from discussion on OBI list (Matthew Pocock, Christian Cocos, Alan Ruttenberg)

Axiom
annotated source: algorithm
annotated property: editor preferred term
annotated target: algorithm

Axiom
annotated source: algorithm
annotated property: example of usage
annotated target: PMID: 18378114.Genomics. 2008 Mar 28. LINKGEN: A new algorithm to process data in genetic linkage studies.

Axiom
annotated source: algorithm
annotated property: definition
annotated target: A plan specification which describes the inputs and output of mathematical functions as well as workflow of execution for achieving an predefined objective. Algorithms are realized usually by means of implementation as computer programs for execution by automata.

Axiom
annotated source: algorithm
annotated property: term editor
annotated target: Philippe Rocca-Serra

Axiom
annotated source: algorithm
annotated property: term editor
annotated target: PlanAndPlannedProcess Branch

Axiom
annotated source: algorithm
annotated property: definition source
annotated target: OBI_0000270

Axiom
annotated source: algorithm
annotated property: definition source
annotated target: adapted from discussion on OBI list (Matthew Pocock, Christian Cocos, Alan Ruttenberg)

Axiom
annotated source: algorithm
annotated property: label
annotated target: algorithm

report
type: Class
subclass of: document
subclass of: Restriction
  on property: has licence
  some values from: creative work licence
editor preferred term: report
example of usage: Examples of reports are gene lists and investigation reports. These are not published (journal) articles but may be included in a journal article.
has curation status: IAO_0000125
definition: A document assembled by an author for the purpose of providing information for the audience. A report is the output of a documenting process and has the objective to be consumed by a specific audience. Topic of the report is on something that has completed. A report is not a single figure. Examples of reports are journal article, patent application, grant progress report, case report (not patient record).
editor note: 2009-03-16: comment from Darren Natale: I am slightly uneasy with the sentence "Topic of the report is on something that has completed." Should it be restricted to those things that are completed? For example, a progress report is (usually) about something that definitely has *not* been completed, or may include (only) projections. I think the definition would not suffer if the whole sentence is deleted.
editor note: 2009-03-16: this was report of results with definition: A report is a narrative object that is a formal statement of the results of an investigation, or of any matter on which definite information is required, made by some person or body instructed or required to do so.
editor note: 2009-03-16: work has been done on this term during during the OBI workshop winter 2009 and the current definition was considered acceptable for use in OBI. If there is a need to modify this definition please notify OBI.
editor note: 2009-08-10 Alan Ruttenberg: Larry Hunter suggests that this be obsoleted and replaced by 'document'. Alan restored as there are OBI dependencies and this merits further discussion
editor note: disagreement about where reports go. alan: only some gene lists are reports. Is a report all the content of some document? The example of usage suggests that a report may be part of some article. Term needs clarification
term editor: PERSON: Alan Ruttenberg
term editor: PERSON: Chris Stoeckert
term editor: PERSON: Melanie Courtot
definition source: GROUP: OBI
definition source: OBI_0000099
term tracker annotation: Add 'has licence' axiom: issue: https://github.com/OpenEnergyPlatform/ontology/issues/1275 pull request: https://github.com/OpenEnergyPlatform/ontology/pull/1547 rework module structure and move axiom to oeo-shared-axioms issue: https://github.com/OpenEnergyPlatform/ontology/issues/1592 pull request: https://github.com/OpenEnergyPlatform/ontology/pull/1652

Axiom
annotated source: report
annotated property: editor preferred term
annotated target: report

Axiom
annotated source: report
annotated property: example of usage
annotated target: Examples of reports are gene lists and investigation reports. These are not published (journal) articles but may be included in a journal article.

Axiom
annotated source: report
annotated property: definition
annotated target: A document assembled by an author for the purpose of providing information for the audience. A report is the output of a documenting process and has the objective to be consumed by a specific audience. Topic of the report is on something that has completed. A report is not a single figure. Examples of reports are journal article, patent application, grant progress report, case report (not patient record).

Axiom
annotated source: report
annotated property: editor note
annotated target: 2009-03-16: comment from Darren Natale: I am slightly uneasy with the sentence "Topic of the report is on something that has completed." Should it be restricted to those things that are completed? For example, a progress report is (usually) about something that definitely has *not* been completed, or may include (only) projections. I think the definition would not suffer if the whole sentence is deleted.

Axiom
annotated source: report
annotated property: editor note
annotated target: 2009-03-16: this was report of results with definition: A report is a narrative object that is a formal statement of the results of an investigation, or of any matter on which definite information is required, made by some person or body instructed or required to do so.

Axiom
annotated source: report
annotated property: editor note
annotated target: 2009-03-16: work has been done on this term during during the OBI workshop winter 2009 and the current definition was considered acceptable for use in OBI. If there is a need to modify this definition please notify OBI.

Axiom
annotated source: report
annotated property: editor note
annotated target: 2009-08-10 Alan Ruttenberg: Larry Hunter suggests that this be obsoleted and replaced by 'document'. Alan restored as there are OBI dependencies and this merits further discussion

Axiom
annotated source: report
annotated property: editor note
annotated target: disagreement about where reports go. alan: only some gene lists are reports. Is a report all the content of some document? The example of usage suggests that a report may be part of some article. Term needs clarification

Axiom
annotated source: report
annotated property: term editor
annotated target: PERSON: Alan Ruttenberg

Axiom
annotated source: report
annotated property: term editor
annotated target: PERSON: Chris Stoeckert

Axiom
annotated source: report
annotated property: term editor
annotated target: PERSON: Melanie Courtot

Axiom
annotated source: report
annotated property: definition source
annotated target: GROUP: OBI

Axiom
annotated source: report
annotated property: definition source
annotated target: OBI_0000099

Axiom
annotated source: report
annotated property: label
annotated target: report

data format specification
type: Class
subclass of: directive information entity
editor preferred term: data format specification
has curation status: IAO_0000123
definition: A data format specification is the information content borne by the document published defining the specification. Example: The ISO document specifying what encompasses an XML document; The instructions in a XSD file
editor note: 2009-03-16: provenance: term imported from OBI_0000187, which had original definition "A data format specification is a plan which organizes information. Example: The ISO document specifying what encompasses an XML document; The instructions in a XSD file"
term editor: PERSON: Alan Ruttenberg
term editor: PlanAndPlannedProcess Branch
definition source: OBI branch derived
definition source: OBI_0000187

Axiom
annotated source: data format specification
annotated property: editor preferred term
annotated target: data format specification

Axiom
annotated source: data format specification
annotated property: definition
annotated target: A data format specification is the information content borne by the document published defining the specification. Example: The ISO document specifying what encompasses an XML document; The instructions in a XSD file

Axiom
annotated source: data format specification
annotated property: editor note
annotated target: 2009-03-16: provenance: term imported from OBI_0000187, which had original definition "A data format specification is a plan which organizes information. Example: The ISO document specifying what encompasses an XML document; The instructions in a XSD file"

Axiom
annotated source: data format specification
annotated property: term editor
annotated target: PERSON: Alan Ruttenberg

Axiom
annotated source: data format specification
annotated property: term editor
annotated target: PlanAndPlannedProcess Branch

Axiom
annotated source: data format specification
annotated property: definition source
annotated target: OBI branch derived

Axiom
annotated source: data format specification
annotated property: definition source
annotated target: OBI_0000187

Axiom
annotated source: data format specification
annotated property: label
annotated target: data format specification

data set
type: Class
subclass of: data item
subclass of: Restriction
  on property: has resolution
  some values from: resolution
subclass of: Restriction
  on property: has licence
  some values from: data licence
editor preferred term: data set
example of usage: Intensity values in a CEL file or from multiple CEL files comprise a data set (as opposed to the CEL files themselves).
has curation status: IAO_0000125
definition: A data item that is an aggregate of other data items of the same type that have something in common. Averages and distributions can be determined for data sets.
editor note: 2009/10/23 Alan Ruttenberg. The intention is that this term represent collections of like data. So this isn't for, e.g. the whole contents of a cel file, which includes parameters, metadata etc. This is more like java arrays of a certain rather specific type
editor note: 2014-05-05: Data sets are aggregates and thus must include two or more data items. We have chosen not to add logical axioms to make this restriction.
term editor: person:Allyson Lister
term editor: person:Chris Stoeckert
definition source: OBI_0000042
definition source: group:OBI
term tracker annotation: Add 'has licence' axiom: issue: https://github.com/OpenEnergyPlatform/ontology/issues/1275 pull request: https://github.com/OpenEnergyPlatform/ontology/pull/1547 rework module structure and move axiom to oeo-shared-axioms issue: https://github.com/OpenEnergyPlatform/ontology/issues/1592 pull request: https://github.com/OpenEnergyPlatform/ontology/pull/1652

Axiom
annotated source: data set
annotated property: editor preferred term
annotated target: data set

Axiom
annotated source: data set
annotated property: example of usage
annotated target: Intensity values in a CEL file or from multiple CEL files comprise a data set (as opposed to the CEL files themselves).

Axiom
annotated source: data set
annotated property: definition
annotated target: A data item that is an aggregate of other data items of the same type that have something in common. Averages and distributions can be determined for data sets.

Axiom
annotated source: data set
annotated property: editor note
annotated target: 2009/10/23 Alan Ruttenberg. The intention is that this term represent collections of like data. So this isn't for, e.g. the whole contents of a cel file, which includes parameters, metadata etc. This is more like java arrays of a certain rather specific type

Axiom
annotated source: data set
annotated property: editor note
annotated target: 2014-05-05: Data sets are aggregates and thus must include two or more data items. We have chosen not to add logical axioms to make this restriction.

Axiom
annotated source: data set
annotated property: term editor
annotated target: person:Allyson Lister

Axiom
annotated source: data set
annotated property: term editor
annotated target: person:Chris Stoeckert

Axiom
annotated source: data set
annotated property: definition source
annotated target: OBI_0000042

Axiom
annotated source: data set
annotated property: definition source
annotated target: group:OBI

Axiom
annotated source: data set
annotated property: label
annotated target: data set

plan specification
type: Class
subclass of: directive information entity
editor preferred term: plan specification
example of usage: PMID: 18323827.Nat Med. 2008 Mar;14(3):226.New plan proposed to help resolve conflicting medical advice.
has curation status: IAO_0000122
definition: A directive information entity with action specifications and objective specifications as parts, and that may be concretized as a realizable entity that, if realized, is realized in a process in which the bearer tries to achieve the objectives by taking the actions specified.
editor note: 2009-03-16: provenance: a term a plan was proposed for OBI (OBI_0000344) , edited by the PlanAndPlannedProcess branch. Original definition was " a plan is a specification of a process that is realized by an actor to achieve the objective specified as part of the plan". It has been subsequently moved to IAO where the objective for which the original term was defined was satisfied with the definitionof this, different, term.
editor note: 2014-03-31: A plan specification can have other parts, such as conditional specifications.
editor note: 2022-01-16 Updated definition to that proposed by Clint Dowloand, IAO Issue 231.
editor note: Alternative previous definition: a plan is a set of instructions that specify how an objective should be achieved
term editor: Alan Ruttenberg
term editor: Clint Dowland
definition source: OBI Plan and Planned Process branch
definition source: OBI_0000344
comment: 2/3/2009 Comment from OBI review. Action specification not well enough specified. Conditional specification not well enough specified. Question whether all plan specifications have objective specifications. Request that IAO either clarify these or change definitions not to use them

Axiom
annotated source: plan specification
annotated property: editor preferred term
annotated target: plan specification

Axiom
annotated source: plan specification
annotated property: example of usage
annotated target: PMID: 18323827.Nat Med. 2008 Mar;14(3):226.New plan proposed to help resolve conflicting medical advice.

Axiom
annotated source: plan specification
annotated property: definition
annotated target: A directive information entity with action specifications and objective specifications as parts, and that may be concretized as a realizable entity that, if realized, is realized in a process in which the bearer tries to achieve the objectives by taking the actions specified.

Axiom
annotated source: plan specification
annotated property: editor note
annotated target: 2009-03-16: provenance: a term a plan was proposed for OBI (OBI_0000344) , edited by the PlanAndPlannedProcess branch. Original definition was " a plan is a specification of a process that is realized by an actor to achieve the objective specified as part of the plan". It has been subsequently moved to IAO where the objective for which the original term was defined was satisfied with the definitionof this, different, term.

Axiom
annotated source: plan specification
annotated property: editor note
annotated target: 2014-03-31: A plan specification can have other parts, such as conditional specifications.

Axiom
annotated source: plan specification
annotated property: editor note
annotated target: 2022-01-16 Updated definition to that proposed by Clint Dowloand, IAO Issue 231.

Axiom
annotated source: plan specification
annotated property: editor note
annotated target: Alternative previous definition: a plan is a set of instructions that specify how an objective should be achieved

Axiom
annotated source: plan specification
annotated property: term editor
annotated target: Alan Ruttenberg

Axiom
annotated source: plan specification
annotated property: term editor
annotated target: Clint Dowland

Axiom
annotated source: plan specification
annotated property: definition source
annotated target: OBI Plan and Planned Process branch

Axiom
annotated source: plan specification
annotated property: definition source
annotated target: OBI_0000344

Axiom
annotated source: plan specification
annotated property: comment
annotated target: 2/3/2009 Comment from OBI review. Action specification not well enough specified. Conditional specification not well enough specified. Question whether all plan specifications have objective specifications. Request that IAO either clarify these or change definitions not to use them

Axiom
annotated source: plan specification
annotated property: label
annotated target: plan specification

measurement datum
type: Class
subclass of: data item
editor preferred term: measurement datum
example of usage: Examples of measurement data are the recoding of the weight of a mouse as {40,mass,"grams"}, the recording of an observation of the behavior of the mouse {,process,"agitated"}, the recording of the expression level of a gene as measured through the process of microarray experiment {3.4,luminosity,}.
has curation status: IAO_0000125
definition: A measurement datum is an information content entity that is a recording of the output of a measurement such as produced by a device.
editor note: 2/2/2009 is_specified_output of some assay?
term editor: person:Chris Stoeckert
definition source: OBI_0000305
definition source: group:OBI

Axiom
annotated source: measurement datum
annotated property: editor preferred term
annotated target: measurement datum

Axiom
annotated source: measurement datum
annotated property: example of usage
annotated target: Examples of measurement data are the recoding of the weight of a mouse as {40,mass,"grams"}, the recording of an observation of the behavior of the mouse {,process,"agitated"}, the recording of the expression level of a gene as measured through the process of microarray experiment {3.4,luminosity,}.

Axiom
annotated source: measurement datum
annotated property: definition
annotated target: A measurement datum is an information content entity that is a recording of the output of a measurement such as produced by a device.

Axiom
annotated source: measurement datum
annotated property: editor note
annotated target: 2/2/2009 is_specified_output of some assay?

Axiom
annotated source: measurement datum
annotated property: term editor
annotated target: person:Chris Stoeckert

Axiom
annotated source: measurement datum
annotated property: definition source
annotated target: OBI_0000305

Axiom
annotated source: measurement datum
annotated property: definition source
annotated target: group:OBI

Axiom
annotated source: measurement datum
annotated property: label
annotated target: measurement datum

version number
type: Class
subclass of: symbol
editor preferred term: version number
has curation status: IAO_0000123
definition: A version number is an information content entity which is a sequence of characters borne by part of each of a class of manufactured products or its packaging and indicates its order within a set of other products having the same name.
editor note: Note: we feel that at the moment we are happy with a general version number, and that we will subclass as needed in the future. For example, see 7. genome sequence version
term editor: GROUP: IAO

Axiom
annotated source: version number
annotated property: editor preferred term
annotated target: version number

Axiom
annotated source: version number
annotated property: definition
annotated target: A version number is an information content entity which is a sequence of characters borne by part of each of a class of manufactured products or its packaging and indicates its order within a set of other products having the same name.

Axiom
annotated source: version number
annotated property: editor note
annotated target: Note: we feel that at the moment we are happy with a general version number, and that we will subclass as needed in the future. For example, see 7. genome sequence version

Axiom
annotated source: version number
annotated property: term editor
annotated target: GROUP: IAO

Axiom
annotated source: version number
annotated property: label
annotated target: version number

textual entity
type: Class
subclass of: information content entity
editor preferred term: textual entity
example of usage: Words, sentences, paragraphs, and the written (non-figure) parts of publications are all textual entities
has curation status: IAO_0000123
definition: A textual entity is a part of a manifestation (FRBR sense), a generically dependent continuant whose concretizations are patterns of glyphs intended to be interpreted as words, formulas, etc.
editor note: AR, (IAO call 2009-09-01): a document as a whole is not typically a textual entity, because it has pictures in it - rather there are parts of it that are textual entities. Examples: The title, paragraph 2 sentence 7, etc.
editor note: MC, 2009-09-14 (following IAO call 2009-09-01): textual entities live at the FRBR (http://en.wikipedia.org/wiki/Functional_Requirements_for_Bibliographic_Records) manifestation level. Everything is significant: line break, pdf and html versions of same document are different textual entities.
term editor: PERSON: Lawrence Hunter
alternative label: text

Axiom
annotated source: textual entity
annotated property: editor preferred term
annotated target: textual entity

Axiom
annotated source: textual entity
annotated property: example of usage
annotated target: Words, sentences, paragraphs, and the written (non-figure) parts of publications are all textual entities

Axiom
annotated source: textual entity
annotated property: definition
annotated target: A textual entity is a part of a manifestation (FRBR sense), a generically dependent continuant whose concretizations are patterns of glyphs intended to be interpreted as words, formulas, etc.

Axiom
annotated source: textual entity
annotated property: editor note
annotated target: AR, (IAO call 2009-09-01): a document as a whole is not typically a textual entity, because it has pictures in it - rather there are parts of it that are textual entities. Examples: The title, paragraph 2 sentence 7, etc.

Axiom
annotated source: textual entity
annotated property: editor note
annotated target: MC, 2009-09-14 (following IAO call 2009-09-01): textual entities live at the FRBR (http://en.wikipedia.org/wiki/Functional_Requirements_for_Bibliographic_Records) manifestation level. Everything is significant: line break, pdf and html versions of same document are different textual entities.

Axiom
annotated source: textual entity
annotated property: term editor
annotated target: PERSON: Lawrence Hunter

Axiom
annotated source: textual entity
annotated property: alternative label
annotated target: text

Axiom
annotated source: textual entity
annotated property: label
annotated target: textual entity

document
type: Class
subclass of: information content entity
subclass of: Restriction
  on property: has licence
  some values from: creative work licence
editor preferred term: document
example of usage: A journal article, patent application, laboratory notebook, or a book
has curation status: IAO_0000120
definition: A collection of information content entities intended to be understood together as a whole
term editor: PERSON: Lawrence Hunter
term tracker annotation: Add 'has licence' axiom: issue: https://github.com/OpenEnergyPlatform/ontology/issues/1275 pull request: https://github.com/OpenEnergyPlatform/ontology/pull/1547 rework module structure and move axiom to oeo-shared-axioms issue: https://github.com/OpenEnergyPlatform/ontology/issues/1592 pull request: https://github.com/OpenEnergyPlatform/ontology/pull/1652

Axiom
annotated source: document
annotated property: editor preferred term
annotated target: document

Axiom
annotated source: document
annotated property: example of usage
annotated target: A journal article, patent application, laboratory notebook, or a book

Axiom
annotated source: document
annotated property: definition
annotated target: A collection of information content entities intended to be understood together as a whole

Axiom
annotated source: document
annotated property: term editor
annotated target: PERSON: Lawrence Hunter

Axiom
annotated source: document
annotated property: label
annotated target: document

document part
type: Class
subclass of: information content entity
editor preferred term: document part
example of usage: An abstract, introduction, method or results section.
has curation status: IAO_0000120
definition: An information content entity that is part of a document.
term editor: PERSON: Lawrence Hunter

Axiom
annotated source: document part
annotated property: editor preferred term
annotated target: document part

Axiom
annotated source: document part
annotated property: example of usage
annotated target: An abstract, introduction, method or results section.

Axiom
annotated source: document part
annotated property: definition
annotated target: An information content entity that is part of a document.

Axiom
annotated source: document part
annotated property: term editor
annotated target: PERSON: Lawrence Hunter

Axiom
annotated source: document part
annotated property: label
annotated target: document part

cartesian spatial coordinate datum
type: Class
subclass of: data item
has curation status: IAO_0000120
definition: A cartesian spatial coordinate datum is a representation of a point in a spatial region, in which equal changes in the magnitude of a coordinate value denote length qualities with the same magnitude
editor note: 2009-08-18 Alan Ruttenberg - question to BFO list about whether the BFO sense of the lower dimensional regions is that they are always part of actual space (the three dimensional sort) http://groups.google.com/group/bfo-discuss/browse_thread/thread/9d04e717e39fb617
term editor: Alan Ruttenberg
curator note: AR notes: We need to discuss whether it should include site.

Axiom
annotated source: cartesian spatial coordinate datum
annotated property: definition
annotated target: A cartesian spatial coordinate datum is a representation of a point in a spatial region, in which equal changes in the magnitude of a coordinate value denote length qualities with the same magnitude

Axiom
annotated source: cartesian spatial coordinate datum
annotated property: editor note
annotated target: 2009-08-18 Alan Ruttenberg - question to BFO list about whether the BFO sense of the lower dimensional regions is that they are always part of actual space (the three dimensional sort) http://groups.google.com/group/bfo-discuss/browse_thread/thread/9d04e717e39fb617

Axiom
annotated source: cartesian spatial coordinate datum
annotated property: term editor
annotated target: Alan Ruttenberg

Axiom
annotated source: cartesian spatial coordinate datum
annotated property: curator note
annotated target: AR notes: We need to discuss whether it should include site.

Axiom
annotated source: cartesian spatial coordinate datum
annotated property: label
annotated target: cartesian spatial coordinate datum

one dimensional cartesian spatial coordinate datum
type: Class
subclass of: cartesian spatial coordinate datum
has curation status: IAO_0000123
definition: A cartesion spatial coordinate datum that uses one value to specify a position along a one dimensional spatial region
term editor: Alan Ruttenberg

Axiom
annotated source: one dimensional cartesian spatial coordinate datum
annotated property: definition
annotated target: A cartesion spatial coordinate datum that uses one value to specify a position along a one dimensional spatial region

Axiom
annotated source: one dimensional cartesian spatial coordinate datum
annotated property: term editor
annotated target: Alan Ruttenberg

Axiom
annotated source: one dimensional cartesian spatial coordinate datum
annotated property: label
annotated target: one dimensional cartesian spatial coordinate datum

two dimensional cartesian spatial coordinate datum
type: Class
subclass of: cartesian spatial coordinate datum
has curation status: IAO_0000123
definition: A cartesion spatial coordinate datum that uses two values to specify a position within a two dimensional spatial region
term editor: Alan Ruttenberg

Axiom
annotated source: two dimensional cartesian spatial coordinate datum
annotated property: definition
annotated target: A cartesion spatial coordinate datum that uses two values to specify a position within a two dimensional spatial region

Axiom
annotated source: two dimensional cartesian spatial coordinate datum
annotated property: term editor
annotated target: Alan Ruttenberg

Axiom
annotated source: two dimensional cartesian spatial coordinate datum
annotated property: label
annotated target: two dimensional cartesian spatial coordinate datum

three dimensional cartesian spatial coordinate datum
type: Class
subclass of: cartesian spatial coordinate datum
has curation status: IAO_0000123
definition: A cartesion spatial coordinate datum that uses three values to specify a position within a three dimensional spatial region
term editor: Alan Ruttenberg

Axiom
annotated source: three dimensional cartesian spatial coordinate datum
annotated property: definition
annotated target: A cartesion spatial coordinate datum that uses three values to specify a position within a three dimensional spatial region

Axiom
annotated source: three dimensional cartesian spatial coordinate datum
annotated property: term editor
annotated target: Alan Ruttenberg

Axiom
annotated source: three dimensional cartesian spatial coordinate datum
annotated property: label
annotated target: three dimensional cartesian spatial coordinate datum

time stamped measurement datum
type: Class
subclass of: measurement datum
has curation status: IAO_0000123

Axiom
annotated source: time stamped measurement datum
annotated property: label
annotated target: time stamped measurement datum

written name
type: Class
subclass of: textual entity
editor preferred term: written name
example of usage: "Bill Clinton"
example of usage: "The Eiffel Tower"
example of usage: "United States of America"
has curation status: IAO_0000125
definition: A textual entity that denotes a particular in reality.
term editor: PERSON: Bill Hogan
definition source: https://github.com/information-artifact-ontology/IAO/issues/114
curator note: The qualifier "written" is to set it apart from spoken names. Also, note the restrictions to particulars. We are not naming universals. We could however, be naming, attributive collections which are particulars, so "All people located in the boundaries of the city of Little Rock, AR on June 18, 2011 at 9:50a CDT" would be a name.

Axiom
annotated source: written name
annotated property: editor preferred term
annotated target: written name

Axiom
annotated source: written name
annotated property: example of usage
annotated target: "Bill Clinton"

Axiom
annotated source: written name
annotated property: example of usage
annotated target: "The Eiffel Tower"

Axiom
annotated source: written name
annotated property: example of usage
annotated target: "United States of America"

Axiom
annotated source: written name
annotated property: definition
annotated target: A textual entity that denotes a particular in reality.

Axiom
annotated source: written name
annotated property: term editor
annotated target: PERSON: Bill Hogan

Axiom
annotated source: written name
annotated property: curator note
annotated target: The qualifier "written" is to set it apart from spoken names. Also, note the restrictions to particulars. We are not naming universals. We could however, be naming, attributive collections which are particulars, so "All people located in the boundaries of the city of Little Rock, AR on June 18, 2011 at 9:50a CDT" would be a name.

Axiom
annotated source: written name
annotated property: label
annotated target: written name

software method
type: Class
subclass of: software
has curation status: IAO_0000123
definition: A software method (also called subroutine, subprogram, procedure, method, function, or routine) is software designed to execute a specific task.
term editor: PERSON: Melanie Courtot
term editor: PERSON: Michel Dumontier
definition source: https://github.com/information-artifact-ontology/IAO/issues/80

Axiom
annotated source: software method
annotated property: definition
annotated target: A software method (also called subroutine, subprogram, procedure, method, function, or routine) is software designed to execute a specific task.

Axiom
annotated source: software method
annotated property: term editor
annotated target: PERSON: Melanie Courtot

Axiom
annotated source: software method
annotated property: term editor
annotated target: PERSON: Michel Dumontier

Axiom
annotated source: software method
annotated property: label
annotated target: software method

software module
type: Class
subclass of: software
has curation status: IAO_0000123
definition: A software module is software composed of a collection of software methods.
term editor: PERSON: Melanei Courtot
term editor: PERSON: Michel Dumontier
definition source: https://github.com/information-artifact-ontology/IAO/issues/80

Axiom
annotated source: software module
annotated property: definition
annotated target: A software module is software composed of a collection of software methods.

Axiom
annotated source: software module
annotated property: term editor
annotated target: PERSON: Melanei Courtot

Axiom
annotated source: software module
annotated property: term editor
annotated target: PERSON: Michel Dumontier

Axiom
annotated source: software module
annotated property: label
annotated target: software module

software library
type: Class
subclass of: software
has curation status: IAO_0000123
definition: A software library is software composed of a collection of software modules and/or software methods in a form that can be statically or dynamically linked to some software application.
term editor: PERSON: Melanie Courtot
term editor: PERSON: Michel Dumontier
definition source: https://github.com/information-artifact-ontology/IAO/issues/80

Axiom
annotated source: software library
annotated property: definition
annotated target: A software library is software composed of a collection of software modules and/or software methods in a form that can be statically or dynamically linked to some software application.

Axiom
annotated source: software library
annotated property: term editor
annotated target: PERSON: Melanie Courtot

Axiom
annotated source: software library
annotated property: term editor
annotated target: PERSON: Michel Dumontier

Axiom
annotated source: software library
annotated property: label
annotated target: software library

software application
type: Class
subclass of: software
has curation status: IAO_0000123
definition: A software application is software that can be directly executed by some processing unit.
term editor: PERSON: Melanie Courtot
term editor: PERSON: Michel Dumontier
definition source: https://github.com/information-artifact-ontology/IAO/issues/80

Axiom
annotated source: software application
annotated property: definition
annotated target: A software application is software that can be directly executed by some processing unit.

Axiom
annotated source: software application
annotated property: term editor
annotated target: PERSON: Melanie Courtot

Axiom
annotated source: software application
annotated property: term editor
annotated target: PERSON: Michel Dumontier

Axiom
annotated source: software application
annotated property: label
annotated target: software application

software script
type: Class
subclass of: software
has curation status: IAO_0000123
definition: A software script is software whose instructions can be executed using a software interpreter.
term editor: PERSON: Melanie Courtot
term editor: PERSON: Michel Dumontier
definition source: https://github.com/information-artifact-ontology/IAO/issues/80

Axiom
annotated source: software script
annotated property: definition
annotated target: A software script is software whose instructions can be executed using a software interpreter.

Axiom
annotated source: software script
annotated property: term editor
annotated target: PERSON: Melanie Courtot

Axiom
annotated source: software script
annotated property: term editor
annotated target: PERSON: Michel Dumontier

Axiom
annotated source: software script
annotated property: label
annotated target: software script

study design
type: Class
subclass of: plan specification
editor preferred term: study design
definition: A plan specification comprised of protocols (which may specify how and what kinds of data will be gathered) that are executed as part of an investigation and is realized during a study design execution.
imported from: obi.owl

Axiom
annotated source: study design
annotated property: editor preferred term
annotated target: study design

Axiom
annotated source: study design
annotated property: definition
annotated target: A plan specification comprised of protocols (which may specify how and what kinds of data will be gathered) that are executed as part of an investigation and is realized during a study design execution.

Axiom
annotated source: study design
annotated property: label
annotated target: study design

system
type: Class
subclass of: material entity
definition: A material entity consisting of multiple components that are causally integrated.
editor note: May be replaced by a BFO class, as discussed in http://www.jbiomedsem.com/content/4/1/43
term editor: https://orcid.org/0000-0002-6601-2165
definition source: http://www.jbiomedsem.com/content/4/1/43

Axiom
annotated source: system
annotated property: definition
annotated target: A material entity consisting of multiple components that are causally integrated.

Axiom
annotated source: system
annotated property: editor note
annotated target: May be replaced by a BFO class, as discussed in http://www.jbiomedsem.com/content/4/1/43

Axiom
annotated source: system
annotated property: label
annotated target: system

measure of dispersion
type: Class
subclass of: statistic
has curation status: IAO_0000122
definition: measure of variation or statistical dispersion is a data item which describes how much a theoritical distribution or dataset is spread.
term editor: Alejandra Gonzalez-Beltran
term editor: Orlaith Burke
term editor: Philippe Rocca-Serra
definition source: STATO
STATO alternative term: measure of variation
term tracker annotation: issue: https://github.com/OpenEnergyPlatform/ontology/issues/2002 pull request: https://github.com/OpenEnergyPlatform/ontology/pull/1133

Axiom
annotated source: measure of dispersion
annotated property: definition
annotated target: measure of variation or statistical dispersion is a data item which describes how much a theoritical distribution or dataset is spread.

Axiom
annotated source: measure of dispersion
annotated property: term editor
annotated target: Alejandra Gonzalez-Beltran

Axiom
annotated source: measure of dispersion
annotated property: term editor
annotated target: Orlaith Burke

Axiom
annotated source: measure of dispersion
annotated property: term editor
annotated target: Philippe Rocca-Serra

Axiom
annotated source: measure of dispersion
annotated property: definition source
annotated target: STATO

Axiom
annotated source: measure of dispersion
annotated property: STATO alternative term
annotated target: measure of variation

Axiom
annotated source: measure of dispersion
annotated property: STATO alternative term
annotated target: measure of variation

Axiom
annotated source: measure of dispersion
annotated property: label
annotated target: measure of dispersion

statistic
type: Class
subclass of: data item
has curation status: IAO_0000122
definition: a statistic is a measurement datum to describe a dataset or a variable. It is generated by a calculation on set of observed data.
term editor: Alejandra Gonzalez-Beltran
term editor: Orlaith Burke
term editor: Philippe Rocca-Serra
definition source: STATO, adapted from wikipedia (http://en.wikipedia.org/wiki/Statistic).
STATO alternative term: statistic
term tracker annotation: issue: https://github.com/OpenEnergyPlatform/ontology/issues/2002 pull request: https://github.com/OpenEnergyPlatform/ontology/pull/1133

Axiom
annotated source: statistic
annotated property: definition
annotated target: a statistic is a measurement datum to describe a dataset or a variable. It is generated by a calculation on set of observed data.

Axiom
annotated source: statistic
annotated property: term editor
annotated target: Alejandra Gonzalez-Beltran

Axiom
annotated source: statistic
annotated property: term editor
annotated target: Orlaith Burke

Axiom
annotated source: statistic
annotated property: term editor
annotated target: Philippe Rocca-Serra

Axiom
annotated source: statistic
annotated property: definition source
annotated target: STATO, adapted from wikipedia (http://en.wikipedia.org/wiki/Statistic).

Axiom
annotated source: statistic
annotated property: STATO alternative term
annotated target: statistic

Axiom
annotated source: statistic
annotated property: label
annotated target: statistic

confidence interval
type: Class
subclass of: measure of dispersion
example of usage: http://www.ncbi.nlm.nih.gov/pmc/articles/PMC2689604/
has curation status: IAO_0000122
definition: A confidence interval is a data item which defines an range of values in which a measurement or trial falls corresponding to a given probability.
term editor: Alejandra Gonzalez-Beltran
term editor: Orlaith Burke
term editor: Philippe Rocca-Serra
definition source: http://mathworld.wolfram.com/ConfidenceInterval.html
term tracker annotation: issue: https://github.com/OpenEnergyPlatform/ontology/issues/2002 pull request: https://github.com/OpenEnergyPlatform/ontology/pull/1133

Axiom
annotated source: confidence interval
annotated property: definition
annotated target: A confidence interval is a data item which defines an range of values in which a measurement or trial falls corresponding to a given probability.

Axiom
annotated source: confidence interval
annotated property: term editor
annotated target: Alejandra Gonzalez-Beltran

Axiom
annotated source: confidence interval
annotated property: term editor
annotated target: Orlaith Burke

Axiom
annotated source: confidence interval
annotated property: term editor
annotated target: Philippe Rocca-Serra

Axiom
annotated source: confidence interval
annotated property: label
annotated target: confidence interval

upper confidence limit
type: Class
subclass of: cutoff
has curation status: IAO_0000125
definition: upper confidence limit is a data item which is a largest value bounding a confidence interval
term editor: Alejandra Gonzalez-Beltran
term editor: Orlaith Burke
term editor: Philippe Rocca-Serra
definition source: STATO
term tracker annotation: issue: https://github.com/OpenEnergyPlatform/ontology/issues/2002 pull request: https://github.com/OpenEnergyPlatform/ontology/pull/1133

Axiom
annotated source: upper confidence limit
annotated property: definition
annotated target: upper confidence limit is a data item which is a largest value bounding a confidence interval

Axiom
annotated source: upper confidence limit
annotated property: term editor
annotated target: Alejandra Gonzalez-Beltran

Axiom
annotated source: upper confidence limit
annotated property: term editor
annotated target: Orlaith Burke

Axiom
annotated source: upper confidence limit
annotated property: term editor
annotated target: Philippe Rocca-Serra

Axiom
annotated source: upper confidence limit
annotated property: definition source
annotated target: STATO

Axiom
annotated source: upper confidence limit
annotated property: label
annotated target: upper confidence limit

lower confidence limit
type: Class
subclass of: cutoff
has curation status: IAO_0000122
definition: lower confidence limit is a data item which is a lowest value bounding a confidence interval
term editor: Alejandra Gonzalez-Beltran
term editor: Orlaith Burke
term editor: Philippe Rocca-Serra
definition source: STATO
term tracker annotation: issue: https://github.com/OpenEnergyPlatform/ontology/issues/2002 pull request: https://github.com/OpenEnergyPlatform/ontology/pull/1133

Axiom
annotated source: lower confidence limit
annotated property: definition
annotated target: lower confidence limit is a data item which is a lowest value bounding a confidence interval

Axiom
annotated source: lower confidence limit
annotated property: term editor
annotated target: Alejandra Gonzalez-Beltran

Axiom
annotated source: lower confidence limit
annotated property: term editor
annotated target: Orlaith Burke

Axiom
annotated source: lower confidence limit
annotated property: term editor
annotated target: Philippe Rocca-Serra

Axiom
annotated source: lower confidence limit
annotated property: definition source
annotated target: STATO

Axiom
annotated source: lower confidence limit
annotated property: label
annotated target: lower confidence limit

cutoff
type: Class
subclass of: information content entity
has curation status: IAO_0000428
definition: a cutoff is an information content entity that represents or sets the boundary at which something changes.
editor note: Expert Working Group Agreement: 5/5 as of 10/11/2021: Janice Tufte, Joanne Dehnbostel, Louis Leff, Vignesh Subbian, Robin Ann Yurk
term editor: Brian S. Alper, Joanne Dehnbostel, Muhammad Afzal, Janice Tufte, Bhagvan Kommadi, Kenneth Wilkins, Khalid Shahin
alternative label: cutoff point
alternative label: cutoff value
alternative label: limit
alternative label: threshold value
definition source: COKA/SEVCO
term tracker annotation: issue: https://github.com/OpenEnergyPlatform/ontology/issues/2002 pull request: https://github.com/OpenEnergyPlatform/ontology/pull/1133

Axiom
annotated source: cutoff
annotated property: definition
annotated target: a cutoff is an information content entity that represents or sets the boundary at which something changes.

Axiom
annotated source: cutoff
annotated property: editor note
annotated target: Expert Working Group Agreement: 5/5 as of 10/11/2021: Janice Tufte, Joanne Dehnbostel, Louis Leff, Vignesh Subbian, Robin Ann Yurk

Axiom
annotated source: cutoff
annotated property: term editor
annotated target: Brian S. Alper, Joanne Dehnbostel, Muhammad Afzal, Janice Tufte, Bhagvan Kommadi, Kenneth Wilkins, Khalid Shahin

Axiom
annotated source: cutoff
annotated property: alternative label
annotated target: cutoff point

Axiom
annotated source: cutoff
annotated property: alternative label
annotated target: cutoff value

Axiom
annotated source: cutoff
annotated property: alternative label
annotated target: limit

Axiom
annotated source: cutoff
annotated property: alternative label
annotated target: threshold value

Axiom
annotated source: cutoff
annotated property: definition source
annotated target: COKA/SEVCO

Axiom
annotated source: cutoff
annotated property: label
annotated target: cutoff

length unit
type: Class
subclass of: physical unit
definition: "A unit which is a standard measure of the distance between two points." [Wikipedia:Wikipedia]
term tracker annotation: make subclass of 'physical unit' issue: https://github.com/OpenEnergyPlatform/ontology/issues/2135 pull request: https://github.com/OpenEnergyPlatform/ontology/pull/2141

Axiom
annotated source: length unit
annotated property: definition
annotated target: "A unit which is a standard measure of the distance between two points." [Wikipedia:Wikipedia]

Axiom
annotated source: length unit
annotated property: label
annotated target: length unit

mass unit
type: Class
subclass of: physical unit
definition: "A unit which is a standard measure of the amount of matter/energy of a physical object." [Wikipedia:Wikipedia]
term tracker annotation: make subclass of 'physical unit' issue: https://github.com/OpenEnergyPlatform/ontology/issues/2135 pull request: https://github.com/OpenEnergyPlatform/ontology/pull/2141

Axiom
annotated source: mass unit
annotated property: definition
annotated target: "A unit which is a standard measure of the amount of matter/energy of a physical object." [Wikipedia:Wikipedia]

Axiom
annotated source: mass unit
annotated property: label
annotated target: mass unit

time unit
type: Class
subclass of: physical unit
definition: "A unit which is a standard measure of the dimension in which events occur in sequence." [Wikipedia:Wikipedia]
has exact synonym: time derived unit
term tracker annotation: make subclass of 'physical unit' issue: https://github.com/OpenEnergyPlatform/ontology/issues/2135 pull request: https://github.com/OpenEnergyPlatform/ontology/pull/2141

Axiom
annotated source: time unit
annotated property: definition
annotated target: "A unit which is a standard measure of the dimension in which events occur in sequence." [Wikipedia:Wikipedia]

Axiom
annotated source: time unit
annotated property: hasExactSynonym
annotated target: time derived unit

Axiom
annotated source: time unit
annotated property: label
annotated target: time unit

electric current unit
type: Class
subclass of: physical unit
definition: "A unit which is a standard measure of the flow of electric charge." [Wikipedia:Wikipedia]
term tracker annotation: make subclass of 'physical unit' issue: https://github.com/OpenEnergyPlatform/ontology/issues/2135 pull request: https://github.com/OpenEnergyPlatform/ontology/pull/2141

Axiom
annotated source: electric current unit
annotated property: definition
annotated target: "A unit which is a standard measure of the flow of electric charge." [Wikipedia:Wikipedia]

Axiom
annotated source: electric current unit
annotated property: label
annotated target: electric current unit

temperature unit
type: Class
subclass of: physical unit
definition: "A unit which is a standard measure of the average kinetic energy of the particles in a sample of matter." [Wikipedia:Wikipedia]
has exact synonym: temperature derived unit
term tracker annotation: make subclass of 'physical unit' issue: https://github.com/OpenEnergyPlatform/ontology/issues/2135 pull request: https://github.com/OpenEnergyPlatform/ontology/pull/2141

Axiom
annotated source: temperature unit
annotated property: definition
annotated target: "A unit which is a standard measure of the average kinetic energy of the particles in a sample of matter." [Wikipedia:Wikipedia]

Axiom
annotated source: temperature unit
annotated property: hasExactSynonym
annotated target: temperature derived unit

Axiom
annotated source: temperature unit
annotated property: label
annotated target: temperature unit

luminous intensity unit
type: Class
subclass of: light unit
definition: "A unit which is a standard measure of the wavelength-weighted power emitted by a light source in a particular direction." [Wikipedia:Wikipedia]

Axiom
annotated source: luminous intensity unit
annotated property: definition
annotated target: "A unit which is a standard measure of the wavelength-weighted power emitted by a light source in a particular direction." [Wikipedia:Wikipedia]

Axiom
annotated source: luminous intensity unit
annotated property: label
annotated target: luminous intensity unit

meter
type: Class
subclass of: base unit
subclass of: meter based unit
definition: "A length unit which is equal to the length of the path traveled by light in vacuum during a time interval of 1/299 792 458 of a second." [BIPM:BIPM, NIST:NIST]
has exact synonym: m
has exact synonym: metre

Axiom
annotated source: meter
annotated property: definition
annotated target: "A length unit which is equal to the length of the path traveled by light in vacuum during a time interval of 1/299 792 458 of a second." [BIPM:BIPM, NIST:NIST]

Axiom
annotated source: meter
annotated property: hasExactSynonym
annotated target: m

Axiom
annotated source: meter
annotated property: hasExactSynonym
annotated target: metre

Axiom
annotated source: meter
annotated property: label
annotated target: meter

kilogram
type: Class
subclass of: base unit
subclass of: gram based unit
definition: "A mass unit which is equal to the mass of the International Prototype Kilogram kept by the BIPM at Svres, France." [BIPM:BIPM, NIST:NIST]
has exact synonym: kg

Axiom
annotated source: kilogram
annotated property: definition
annotated target: "A mass unit which is equal to the mass of the International Prototype Kilogram kept by the BIPM at Svres, France." [BIPM:BIPM, NIST:NIST]

Axiom
annotated source: kilogram
annotated property: hasExactSynonym
annotated target: kg

Axiom
annotated source: kilogram
annotated property: label
annotated target: kilogram

second
type: Class
subclass of: base unit
subclass of: second based unit
definition: "A time unit which is equal to the duration of 9 192 631 770 periods of the radiation corresponding to the transition between the two hyperfine levels of the ground state of the caesium 133 atom." [BIPM:BIPM, NIST:NIST]
has exact synonym: s

Axiom
annotated source: second
annotated property: definition
annotated target: "A time unit which is equal to the duration of 9 192 631 770 periods of the radiation corresponding to the transition between the two hyperfine levels of the ground state of the caesium 133 atom." [BIPM:BIPM, NIST:NIST]

Axiom
annotated source: second
annotated property: hasExactSynonym
annotated target: s

Axiom
annotated source: second
annotated property: label
annotated target: second

ampere
type: Class
subclass of: base unit
subclass of: ampere based unit
definition: "An electric current unit which is equal to the constant current which, if maintained in two straight parallel conductors of infinite length, of negligible circular cross-section, and placed 1 m apart in vacuum, would produce between these conductors a force equal to 2 x 10^[-7] newton per meter of length." [BIPM:BIPM, NIST:NIST]
has exact synonym: A

Axiom
annotated source: ampere
annotated property: definition
annotated target: "An electric current unit which is equal to the constant current which, if maintained in two straight parallel conductors of infinite length, of negligible circular cross-section, and placed 1 m apart in vacuum, would produce between these conductors a force equal to 2 x 10^[-7] newton per meter of length." [BIPM:BIPM, NIST:NIST]

Axiom
annotated source: ampere
annotated property: hasExactSynonym
annotated target: A

Axiom
annotated source: ampere
annotated property: label
annotated target: ampere

kelvin
type: Class
subclass of: base unit
subclass of: kelvin based unit
definition: "A thermodynamic temperature unit which is equal to the fraction 1/273.16 of the thermodynamic temperature of the triple point of water." [BIPM:BIPM, NIST:NIST]
has exact synonym: K

Axiom
annotated source: kelvin
annotated property: definition
annotated target: "A thermodynamic temperature unit which is equal to the fraction 1/273.16 of the thermodynamic temperature of the triple point of water." [BIPM:BIPM, NIST:NIST]

Axiom
annotated source: kelvin
annotated property: hasExactSynonym
annotated target: K

Axiom
annotated source: kelvin
annotated property: label
annotated target: kelvin

candela
type: Class
subclass of: base unit
subclass of: candela based unit
definition: "A luminous intensity unit which equal to the luminous intensity, in a given direction, of a source that emits monochromatic radiation of frequency 540 x 1012 hertz and that has a radiant intensity in that direction of 1/683 watt per steradian." [BIPM:BIPM, NIST:NIST]
has exact synonym: cd

Axiom
annotated source: candela
annotated property: definition
annotated target: "A luminous intensity unit which equal to the luminous intensity, in a given direction, of a source that emits monochromatic radiation of frequency 540 x 1012 hertz and that has a radiant intensity in that direction of 1/683 watt per steradian." [BIPM:BIPM, NIST:NIST]

Axiom
annotated source: candela
annotated property: hasExactSynonym
annotated target: cd

Axiom
annotated source: candela
annotated property: label
annotated target: candela

millimeter
type: Class
subclass of: meter based unit
definition: "A length unit which is equal to one thousandth of a meter or 10^[-3] m." [NIST:NIST]
has exact synonym: millimetre
has exact synonym: mm

Axiom
annotated source: millimeter
annotated property: definition
annotated target: "A length unit which is equal to one thousandth of a meter or 10^[-3] m." [NIST:NIST]

Axiom
annotated source: millimeter
annotated property: hasExactSynonym
annotated target: millimetre

Axiom
annotated source: millimeter
annotated property: hasExactSynonym
annotated target: mm

Axiom
annotated source: millimeter
annotated property: label
annotated target: millimeter

gram
type: Class
subclass of: gram based unit
definition: "A mass unit which is equal to one thousandth of a kilogram or 10^[-3] kg." [NIST:NIST]
has exact synonym: g

Axiom
annotated source: gram
annotated property: definition
annotated target: "A mass unit which is equal to one thousandth of a kilogram or 10^[-3] kg." [NIST:NIST]

Axiom
annotated source: gram
annotated property: hasExactSynonym
annotated target: g

Axiom
annotated source: gram
annotated property: label
annotated target: gram

degree Celsius
type: Class
subclass of: degree Celsius based unit
definition: "A temperature unit which is equal to one kelvin degree. However, they have their zeros at different points. The centigrade scale has its zero at 273.15 K." [NIST:NIST]
has exact synonym: C

Axiom
annotated source: degree Celsius
annotated property: definition
annotated target: "A temperature unit which is equal to one kelvin degree. However, they have their zeros at different points. The centigrade scale has its zero at 273.15 K." [NIST:NIST]

Axiom
annotated source: degree Celsius
annotated property: hasExactSynonym
annotated target: C

Axiom
annotated source: degree Celsius
annotated property: label
annotated target: degree Celsius

minute
type: Class
subclass of: minute based unit
definition: "A time unit which is equal to 60 seconds." [Wikipedia:Wikipedia]
has exact synonym: min

Axiom
annotated source: minute
annotated property: definition
annotated target: "A time unit which is equal to 60 seconds." [Wikipedia:Wikipedia]

Axiom
annotated source: minute
annotated property: hasExactSynonym
annotated target: min

Axiom
annotated source: minute
annotated property: label
annotated target: minute

hour
type: Class
subclass of: hour based unit
definition: "A time unit which is equal to 3600 seconds or 60 minutes." [Wikipedia:Wikipedia]
has exact synonym: h

Axiom
annotated source: hour
annotated property: definition
annotated target: "A time unit which is equal to 3600 seconds or 60 minutes." [Wikipedia:Wikipedia]

Axiom
annotated source: hour
annotated property: hasExactSynonym
annotated target: h

Axiom
annotated source: hour
annotated property: label
annotated target: hour

day
type: Class
subclass of: day based unit
definition: "A time unit which is equal to 24 hours." [Wikipedia:Wikipedia]

Axiom
annotated source: day
annotated property: definition
annotated target: "A time unit which is equal to 24 hours." [Wikipedia:Wikipedia]

Axiom
annotated source: day
annotated property: label
annotated target: day

week
type: Class
subclass of: week based unit
definition: "A time unit which is equal to 7 days." [Wikipedia:Wikipedia]

Axiom
annotated source: week
annotated property: definition
annotated target: "A time unit which is equal to 7 days." [Wikipedia:Wikipedia]

Axiom
annotated source: week
annotated property: label
annotated target: week

month
type: Class
subclass of: month based unit
definition: "A time unit which is approximately equal to the length of time of one of cycle of the moon's phases which in science is taken to be equal to 30 days." [Wikipedia:Wikipedia]

Axiom
annotated source: month
annotated property: definition
annotated target: "A time unit which is approximately equal to the length of time of one of cycle of the moon's phases which in science is taken to be equal to 30 days." [Wikipedia:Wikipedia]

Axiom
annotated source: month
annotated property: label
annotated target: month

year
type: Class
subclass of: year based unit
definition: "A time unit which is equal to 12 months which in science is taken to be equal to 365.25 days." [Wikipedia:Wikipedia]

Axiom
annotated source: year
annotated property: definition
annotated target: "A time unit which is equal to 12 months which in science is taken to be equal to 365.25 days." [Wikipedia:Wikipedia]

Axiom
annotated source: year
annotated property: label
annotated target: year

base unit
type: Class
subclass of: physical unit
definition: "A unit which is one of a particular measure to which all measures of that type can be related." [NIST:NIST]
term tracker annotation: make subclass of 'physical unit' issue: https://github.com/OpenEnergyPlatform/ontology/issues/2135 pull request: https://github.com/OpenEnergyPlatform/ontology/pull/2141

Axiom
annotated source: base unit
annotated property: definition
annotated target: "A unit which is one of a particular measure to which all measures of that type can be related." [NIST:NIST]

Axiom
annotated source: base unit
annotated property: label
annotated target: base unit

prefix
type: Class
subclass of: information content entity
term tracker annotation: make subclass of information content artifact issue: https://github.com/OpenEnergyPlatform/ontology/issues/1690 pull request: https://github.com/OpenEnergyPlatform/ontology/pull/1820

Axiom
annotated source: prefix
annotated property: label
annotated target: prefix

area unit
type: Class
subclass of: physical unit
definition: "A unit which is a standard measure of the amount of a 2-dimensional flat surface." [UOC:GVG]
term tracker annotation: make subclass of 'physical unit' issue: https://github.com/OpenEnergyPlatform/ontology/issues/2135 pull request: https://github.com/OpenEnergyPlatform/ontology/pull/2141

Axiom
annotated source: area unit
annotated property: definition
annotated target: "A unit which is a standard measure of the amount of a 2-dimensional flat surface." [UOC:GVG]

Axiom
annotated source: area unit
annotated property: label
annotated target: area unit

concentration unit
type: Class
subclass of: physical unit
definition: "A unit which represents a standard measurement of how much of a given substance there is mixed with another substance." [UOC:GVG]
term tracker annotation: make subclass of 'physical unit' issue: https://github.com/OpenEnergyPlatform/ontology/issues/2135 pull request: https://github.com/OpenEnergyPlatform/ontology/pull/2141

Axiom
annotated source: concentration unit
annotated property: definition
annotated target: "A unit which represents a standard measurement of how much of a given substance there is mixed with another substance." [UOC:GVG]

Axiom
annotated source: concentration unit
annotated property: label
annotated target: concentration unit

mass density unit
type: Class
subclass of: density unit
definition: "A density unit which is a standard measure of the mass of a substance in a given volume." [UOC:GVG]
has exact synonym: mass per unit volume

Axiom
annotated source: mass density unit
annotated property: definition
annotated target: "A density unit which is a standard measure of the mass of a substance in a given volume." [UOC:GVG]

Axiom
annotated source: mass density unit
annotated property: hasExactSynonym
annotated target: mass per unit volume

Axiom
annotated source: mass density unit
annotated property: label
annotated target: mass density unit

area density unit
type: Class
subclass of: density unit
definition: "A density unit which is a standard measure of the mass exerting an influence on a given area." [Wikipedia:Wikipedia]
has exact synonym: mass per unit area unit

Axiom
annotated source: area density unit
annotated property: definition
annotated target: "A density unit which is a standard measure of the mass exerting an influence on a given area." [Wikipedia:Wikipedia]

Axiom
annotated source: area density unit
annotated property: hasExactSynonym
annotated target: mass per unit area unit

Axiom
annotated source: area density unit
annotated property: label
annotated target: area density unit

rotational frequency unit
type: Class
subclass of: frequency unit
definition: "A unit which is a standard measure of the number of rotations in a given time." [NIST:NIST]

Axiom
annotated source: rotational frequency unit
annotated property: definition
annotated target: "A unit which is a standard measure of the number of rotations in a given time." [NIST:NIST]

Axiom
annotated source: rotational frequency unit
annotated property: label
annotated target: rotational frequency unit

speed/velocity unit
type: Class
subclass of: physical unit
definition: "A unit which is a standard measure of the rate of movement. Speed is measured in the same physical units of measurement as velocity, but does not contain the element of direction that velocity has. Speed is thus the magnitude component of velocity." [Wikipedia:Wikipedia]
term tracker annotation: make subclass of 'physical unit' issue: https://github.com/OpenEnergyPlatform/ontology/issues/2135 pull request: https://github.com/OpenEnergyPlatform/ontology/pull/2141

Axiom
annotated source: speed/velocity unit
annotated property: definition
annotated target: "A unit which is a standard measure of the rate of movement. Speed is measured in the same physical units of measurement as velocity, but does not contain the element of direction that velocity has. Speed is thus the magnitude component of velocity." [Wikipedia:Wikipedia]

Axiom
annotated source: speed/velocity unit
annotated property: label
annotated target: speed/velocity unit

square meter
type: Class
subclass of: square meter based unit
definition: "An area unit which is equal to an area enclosed by a square with sides each 1 meter long." [NIST:NIST]
has exact synonym: m^[2]
has exact synonym: square metre

Axiom
annotated source: square meter
annotated property: definition
annotated target: "An area unit which is equal to an area enclosed by a square with sides each 1 meter long." [NIST:NIST]

Axiom
annotated source: square meter
annotated property: hasExactSynonym
annotated target: m^[2]

Axiom
annotated source: square meter
annotated property: hasExactSynonym
annotated target: square metre

Axiom
annotated source: square meter
annotated property: label
annotated target: square meter

square millimeter
type: Class
subclass of: square millimeter based unit
definition: "An area unit which is equal to one millionth of a square meter or 10^[-6] m^[2]." [NIST:NIST]
has exact synonym: mm^[2]
has exact synonym: square millimetre

Axiom
annotated source: square millimeter
annotated property: definition
annotated target: "An area unit which is equal to one millionth of a square meter or 10^[-6] m^[2]." [NIST:NIST]

Axiom
annotated source: square millimeter
annotated property: hasExactSynonym
annotated target: mm^[2]

Axiom
annotated source: square millimeter
annotated property: hasExactSynonym
annotated target: square millimetre

Axiom
annotated source: square millimeter
annotated property: label
annotated target: square millimeter

kilogram per cubic meter
type: Class
subclass of: mass density unit
definition: "A mass unit density which is equal to mass of an object in kilograms divided by the volume in cubic meters." [UOC:GVG]
has exact synonym: kg/m^[3]
has exact synonym: kilogram per cubic metre

Axiom
annotated source: kilogram per cubic meter
annotated property: definition
annotated target: "A mass unit density which is equal to mass of an object in kilograms divided by the volume in cubic meters." [UOC:GVG]

Axiom
annotated source: kilogram per cubic meter
annotated property: hasExactSynonym
annotated target: kg/m^[3]

Axiom
annotated source: kilogram per cubic meter
annotated property: hasExactSynonym
annotated target: kilogram per cubic metre

Axiom
annotated source: kilogram per cubic meter
annotated property: label
annotated target: kilogram per cubic meter

kilogram per square meter
type: Class
subclass of: gram per square meter based unit
definition: "An area density unit which is equal to the mass of an object in kilograms divided by the surface area in meters squared." [NIST:NIST]
has exact synonym: kg/m^[2]
has exact synonym: kilogram per square metre

Axiom
annotated source: kilogram per square meter
annotated property: definition
annotated target: "An area density unit which is equal to the mass of an object in kilograms divided by the surface area in meters squared." [NIST:NIST]

Axiom
annotated source: kilogram per square meter
annotated property: hasExactSynonym
annotated target: kg/m^[2]

Axiom
annotated source: kilogram per square meter
annotated property: hasExactSynonym
annotated target: kilogram per square metre

Axiom
annotated source: kilogram per square meter
annotated property: label
annotated target: kilogram per square meter

turns per second
type: Class
subclass of: turns per second based unit
definition: "A rotational frequency unit which is equal to the number complete turn in a period of time that equals to 1 second." [NIST:NIST]
has exact synonym: 1/s
has exact synonym: one turn per second

Axiom
annotated source: turns per second
annotated property: definition
annotated target: "A rotational frequency unit which is equal to the number complete turn in a period of time that equals to 1 second." [NIST:NIST]

Axiom
annotated source: turns per second
annotated property: hasExactSynonym
annotated target: 1/s

Axiom
annotated source: turns per second
annotated property: hasExactSynonym
annotated target: one turn per second

Axiom
annotated source: turns per second
annotated property: label
annotated target: turns per second

meter per second
type: Class
subclass of: meter per second based unit
definition: "A speed/velocity unit which is equal to the speed of an object traveling 1 meter distance in one second." [NIST:NIST]
has exact synonym: m/s
has exact synonym: metre per second

Axiom
annotated source: meter per second
annotated property: definition
annotated target: "A speed/velocity unit which is equal to the speed of an object traveling 1 meter distance in one second." [NIST:NIST]

Axiom
annotated source: meter per second
annotated property: hasExactSynonym
annotated target: m/s

Axiom
annotated source: meter per second
annotated property: hasExactSynonym
annotated target: metre per second

Axiom
annotated source: meter per second
annotated property: label
annotated target: meter per second

volume unit
type: Class
subclass of: physical unit
definition: "A unit which is a standard measure of the amount of space occupied by any substance, whether solid, liquid, or gas." [NIST:NIST]
term tracker annotation: make subclass of 'physical unit' issue: https://github.com/OpenEnergyPlatform/ontology/issues/2135 pull request: https://github.com/OpenEnergyPlatform/ontology/pull/2141

Axiom
annotated source: volume unit
annotated property: definition
annotated target: "A unit which is a standard measure of the amount of space occupied by any substance, whether solid, liquid, or gas." [NIST:NIST]

Axiom
annotated source: volume unit
annotated property: label
annotated target: volume unit

cubic meter
type: Class
subclass of: cubic meter based unit
definition: "A volume unit which is equal to the volume of a cube with edges one meter in length. One cubic meter equals to 1000 liters." [NIST:NIST]
has exact synonym: cubic metre
has exact synonym: m^[3]

Axiom
annotated source: cubic meter
annotated property: definition
annotated target: "A volume unit which is equal to the volume of a cube with edges one meter in length. One cubic meter equals to 1000 liters." [NIST:NIST]

Axiom
annotated source: cubic meter
annotated property: hasExactSynonym
annotated target: cubic metre

Axiom
annotated source: cubic meter
annotated property: hasExactSynonym
annotated target: m^[3]

Axiom
annotated source: cubic meter
annotated property: label
annotated target: cubic meter

cubic centimeter
type: Class
subclass of: cubic centimeter based unit
definition: "A volume unit which is equal to one millionth of a cubic meter or 10^[-9] m^[3], or to 1 ml." [NIST:NIST]
has exact synonym: cc
has exact synonym: cm^3
has exact synonym: cubic centimetre

Axiom
annotated source: cubic centimeter
annotated property: definition
annotated target: "A volume unit which is equal to one millionth of a cubic meter or 10^[-9] m^[3], or to 1 ml." [NIST:NIST]

Axiom
annotated source: cubic centimeter
annotated property: hasExactSynonym
annotated target: cc

Axiom
annotated source: cubic centimeter
annotated property: hasExactSynonym
annotated target: cm^3

Axiom
annotated source: cubic centimeter
annotated property: hasExactSynonym
annotated target: cubic centimetre

Axiom
annotated source: cubic centimeter
annotated property: label
annotated target: cubic centimeter

liter
type: Class
subclass of: liter based unit
definition: "A volume unit which is equal to one thousandth of a cubic meter or 10^[-3] m^[3], or to 1 decimeter." [NIST:NIST]
has exact synonym: L
has exact synonym: l
has exact synonym: litre

Axiom
annotated source: liter
annotated property: definition
annotated target: "A volume unit which is equal to one thousandth of a cubic meter or 10^[-3] m^[3], or to 1 decimeter." [NIST:NIST]

Axiom
annotated source: liter
annotated property: hasExactSynonym
annotated target: L

Axiom
annotated source: liter
annotated property: hasExactSynonym
annotated target: l

Axiom
annotated source: liter
annotated property: hasExactSynonym
annotated target: litre

Axiom
annotated source: liter
annotated property: label
annotated target: liter

frequency unit
type: Class
subclass of: physical unit
definition: "A unit which is a standard measure of the number of repetitive actions in a particular time." [NIST:NIST]
term tracker annotation: make subclass of 'physical unit' issue: https://github.com/OpenEnergyPlatform/ontology/issues/2135 pull request: https://github.com/OpenEnergyPlatform/ontology/pull/2141

Axiom
annotated source: frequency unit
annotated property: definition
annotated target: "A unit which is a standard measure of the number of repetitive actions in a particular time." [NIST:NIST]

Axiom
annotated source: frequency unit
annotated property: label
annotated target: frequency unit

hertz
type: Class
subclass of: hertz based unit
definition: "A frequency unit which is equal to 1 complete cycle of a recurring phenomenon in 1 second." [NIST:NIST]
has exact synonym: Hz
has exact synonym: s^1

Axiom
annotated source: hertz
annotated property: definition
annotated target: "A frequency unit which is equal to 1 complete cycle of a recurring phenomenon in 1 second." [NIST:NIST]

Axiom
annotated source: hertz
annotated property: hasExactSynonym
annotated target: Hz

Axiom
annotated source: hertz
annotated property: hasExactSynonym
annotated target: s^1

Axiom
annotated source: hertz
annotated property: label
annotated target: hertz

force unit
type: Class
subclass of: physical unit
definition: "A unit which is a standard measure of the force is applied when a mass is accelerated." [NIST:NIST]
term tracker annotation: make subclass of 'physical unit' issue: https://github.com/OpenEnergyPlatform/ontology/issues/2135 pull request: https://github.com/OpenEnergyPlatform/ontology/pull/2141

Axiom
annotated source: force unit
annotated property: definition
annotated target: "A unit which is a standard measure of the force is applied when a mass is accelerated." [NIST:NIST]

Axiom
annotated source: force unit
annotated property: label
annotated target: force unit

newton
type: Class
subclass of: newton based unit
definition: "A force unit which is equal to the force required to cause an acceleration of 1m/s2 of a mass of 1 Kg in the direction of the force." [NIST:NIST]
has exact synonym: N

Axiom
annotated source: newton
annotated property: definition
annotated target: "A force unit which is equal to the force required to cause an acceleration of 1m/s2 of a mass of 1 Kg in the direction of the force." [NIST:NIST]

Axiom
annotated source: newton
annotated property: hasExactSynonym
annotated target: N

Axiom
annotated source: newton
annotated property: label
annotated target: newton

pressure unit
type: Class
subclass of: physical unit
definition: "A unit which is a standard measure of the force applied to a given area." [NIST:NIST]
term tracker annotation: make subclass of 'physical unit' issue: https://github.com/OpenEnergyPlatform/ontology/issues/2135 pull request: https://github.com/OpenEnergyPlatform/ontology/pull/2141

Axiom
annotated source: pressure unit
annotated property: definition
annotated target: "A unit which is a standard measure of the force applied to a given area." [NIST:NIST]

Axiom
annotated source: pressure unit
annotated property: label
annotated target: pressure unit

pascal
type: Class
subclass of: pascal based unit
definition: "A pressure unit which is equal to the pressure or stress on a surface caused by a force of 1 newton spread over a surface of 1 m^[2]." [NIST:NIST]
has exact synonym: Pa

Axiom
annotated source: pascal
annotated property: definition
annotated target: "A pressure unit which is equal to the pressure or stress on a surface caused by a force of 1 newton spread over a surface of 1 m^[2]." [NIST:NIST]

Axiom
annotated source: pascal
annotated property: hasExactSynonym
annotated target: Pa

Axiom
annotated source: pascal
annotated property: label
annotated target: pascal

energy unit
type: Class
subclass of: physical unit
definition: "A unit which is a standard measure of the work done by a certain force (gravitational, electric, magnetic, force of inertia, etc)." [NIST:NIST]
term tracker annotation: make subclass of 'physical unit' issue: https://github.com/OpenEnergyPlatform/ontology/issues/2135 pull request: https://github.com/OpenEnergyPlatform/ontology/pull/2141

Axiom
annotated source: energy unit
annotated property: definition
annotated target: "A unit which is a standard measure of the work done by a certain force (gravitational, electric, magnetic, force of inertia, etc)." [NIST:NIST]

Axiom
annotated source: energy unit
annotated property: label
annotated target: energy unit

joule
type: Class
subclass of: joule based unit
definition: "An energy unit which is equal to the energy required when a force of 1 newton moves an object 1 meter in the direction of the force." [NIST:NIST]
has exact synonym: J

Axiom
annotated source: joule
annotated property: definition
annotated target: "An energy unit which is equal to the energy required when a force of 1 newton moves an object 1 meter in the direction of the force." [NIST:NIST]

Axiom
annotated source: joule
annotated property: hasExactSynonym
annotated target: J

Axiom
annotated source: joule
annotated property: label
annotated target: joule

power unit
type: Class
subclass of: physical unit
definition: "A unit which is a standard measure power or the rate of doing work." [NIST:NIST]
term tracker annotation: make subclass of 'physical unit' issue: https://github.com/OpenEnergyPlatform/ontology/issues/2135 pull request: https://github.com/OpenEnergyPlatform/ontology/pull/2141

Axiom
annotated source: power unit
annotated property: definition
annotated target: "A unit which is a standard measure power or the rate of doing work." [NIST:NIST]

Axiom
annotated source: power unit
annotated property: label
annotated target: power unit

watt
type: Class
subclass of: watt based unit
definition: "A power unit which is equal to the power used when work is done at the rate of 1 joule per second." [NIST:NIST]
has exact synonym: W

Axiom
annotated source: watt
annotated property: definition
annotated target: "A power unit which is equal to the power used when work is done at the rate of 1 joule per second." [NIST:NIST]

Axiom
annotated source: watt
annotated property: hasExactSynonym
annotated target: W

Axiom
annotated source: watt
annotated property: label
annotated target: watt

illuminance unit
type: Class
subclass of: light unit
definition: "A unit which is a standard measure of the luminous flux incident on a unit area." [Wikipedia:Wikipedia]

Axiom
annotated source: illuminance unit
annotated property: definition
annotated target: "A unit which is a standard measure of the luminous flux incident on a unit area." [Wikipedia:Wikipedia]

Axiom
annotated source: illuminance unit
annotated property: label
annotated target: illuminance unit

lux
type: Class
subclass of: lux based unit
definition: "An illuminance unit which is equal to the illuminance produced by 1 lumen evenly spread over an area 1 m^[2]." [NIST:NIST]
has exact synonym: lx

Axiom
annotated source: lux
annotated property: definition
annotated target: "An illuminance unit which is equal to the illuminance produced by 1 lumen evenly spread over an area 1 m^[2]." [NIST:NIST]

Axiom
annotated source: lux
annotated property: hasExactSynonym
annotated target: lx

Axiom
annotated source: lux
annotated property: label
annotated target: lux

luminous flux unit
type: Class
subclass of: light unit
definition: "A unit which is a standard measure of the flow of radiant energy." [Wikipedia:Wikipedia]

Axiom
annotated source: luminous flux unit
annotated property: definition
annotated target: "A unit which is a standard measure of the flow of radiant energy." [Wikipedia:Wikipedia]

Axiom
annotated source: luminous flux unit
annotated property: label
annotated target: luminous flux unit

lumen
type: Class
subclass of: lumen based unit
definition: "A luminous flux unit which is equal to the luminous flux emitted into 1 steradian by a point source of 1 candela." [NIST:NIST]
has exact synonym: lm

Axiom
annotated source: lumen
annotated property: definition
annotated target: "A luminous flux unit which is equal to the luminous flux emitted into 1 steradian by a point source of 1 candela." [NIST:NIST]

Axiom
annotated source: lumen
annotated property: hasExactSynonym
annotated target: lm

Axiom
annotated source: lumen
annotated property: label
annotated target: lumen

angle unit
type: Class
subclass of: physical unit
definition: "A unit which is a standard measure of the figure or space formed by the junction of two lines or planes." [Wikipedia:Wikipedia]
term tracker annotation: make subclass of 'physical unit' issue: https://github.com/OpenEnergyPlatform/ontology/issues/2135 pull request: https://github.com/OpenEnergyPlatform/ontology/pull/2141

Axiom
annotated source: angle unit
annotated property: definition
annotated target: "A unit which is a standard measure of the figure or space formed by the junction of two lines or planes." [Wikipedia:Wikipedia]

Axiom
annotated source: angle unit
annotated property: label
annotated target: angle unit

plane angle unit
type: Class
subclass of: angle unit
definition: "A unit which is a standard measure of the angle formed by two straight lines in the same plane." [Wikipedia:Wikipedia]

Axiom
annotated source: plane angle unit
annotated property: definition
annotated target: "A unit which is a standard measure of the angle formed by two straight lines in the same plane." [Wikipedia:Wikipedia]

Axiom
annotated source: plane angle unit
annotated property: label
annotated target: plane angle unit

radian
type: Class
subclass of: radian based unit
definition: "A plane angle unit which is equal to the angle subtended at the center of a circle by an arc equal in length to the radius of the circle, approximately 57 degrees 17 minutes and 44.6 seconds." [NIST:NIST]
has exact synonym: rad

Axiom
annotated source: radian
annotated property: definition
annotated target: "A plane angle unit which is equal to the angle subtended at the center of a circle by an arc equal in length to the radius of the circle, approximately 57 degrees 17 minutes and 44.6 seconds." [NIST:NIST]

Axiom
annotated source: radian
annotated property: hasExactSynonym
annotated target: rad

Axiom
annotated source: radian
annotated property: label
annotated target: radian

irradiance unit
type: Class
subclass of: light unit
definition: "A unit which is a standard measure of the power of electromagnetic radiation at a surface, per unit area." [Wikipedia:Wikipedia]

Axiom
annotated source: irradiance unit
annotated property: definition
annotated target: "A unit which is a standard measure of the power of electromagnetic radiation at a surface, per unit area." [Wikipedia:Wikipedia]

Axiom
annotated source: irradiance unit
annotated property: label
annotated target: irradiance unit

watt per square meter
type: Class
subclass of: watt per square meter based unit
definition: "An irradiance unit which is equal to 1 watt of radiant power incident per one square meter surface area." [NIST:NIST]
has exact synonym: W/m^[2]
has exact synonym: watt per square metre

Axiom
annotated source: watt per square meter
annotated property: definition
annotated target: "An irradiance unit which is equal to 1 watt of radiant power incident per one square meter surface area." [NIST:NIST]

Axiom
annotated source: watt per square meter
annotated property: hasExactSynonym
annotated target: W/m^[2]

Axiom
annotated source: watt per square meter
annotated property: hasExactSynonym
annotated target: watt per square metre

Axiom
annotated source: watt per square meter
annotated property: label
annotated target: watt per square meter

light unit
type: Class
subclass of: physical unit
definition: "A unit which is a standard measure of the intensity of light." [NIST:NIST]
term tracker annotation: make subclass of 'physical unit' issue: https://github.com/OpenEnergyPlatform/ontology/issues/2135 pull request: https://github.com/OpenEnergyPlatform/ontology/pull/2141

Axiom
annotated source: light unit
annotated property: definition
annotated target: "A unit which is a standard measure of the intensity of light." [NIST:NIST]

Axiom
annotated source: light unit
annotated property: label
annotated target: light unit

parts per notation unit
type: Class
subclass of: dimensionless unit
definition: "A dimensionless concentration notation which describes the amount of one substance in another. It is the ratio of the amount of the substance of interest to the amount of that substance plus the amount of the substance." [Wikipedia:Wikipedia]

Axiom
annotated source: parts per notation unit
annotated property: definition
annotated target: "A dimensionless concentration notation which describes the amount of one substance in another. It is the ratio of the amount of the substance of interest to the amount of that substance plus the amount of the substance." [Wikipedia:Wikipedia]

Axiom
annotated source: parts per notation unit
annotated property: label
annotated target: parts per notation unit

parts per million
type: Class
subclass of: parts per million based unit
definition: "A dimensionless concentration notation which denotes the amount of a given substance in a total amount of 1,000,000 regardless of the units of measure used as long as they are the same or 1 part in 10^[6]." [UOC:GVG]
has exact synonym: 10^[-6]
has exact synonym: ppm

Axiom
annotated source: parts per million
annotated property: definition
annotated target: "A dimensionless concentration notation which denotes the amount of a given substance in a total amount of 1,000,000 regardless of the units of measure used as long as they are the same or 1 part in 10^[6]." [UOC:GVG]

Axiom
annotated source: parts per million
annotated property: hasExactSynonym
annotated target: 10^[-6]

Axiom
annotated source: parts per million
annotated property: hasExactSynonym
annotated target: ppm

Axiom
annotated source: parts per million
annotated property: label
annotated target: parts per million

density unit
type: Class
subclass of: physical unit
definition: "A unit which is a standard measure of the influence exerted by some mass." [Wikipedia:Wikipedia]
term tracker annotation: make subclass of 'physical unit' issue: https://github.com/OpenEnergyPlatform/ontology/issues/2135 pull request: https://github.com/OpenEnergyPlatform/ontology/pull/2141

Axiom
annotated source: density unit
annotated property: definition
annotated target: "A unit which is a standard measure of the influence exerted by some mass." [Wikipedia:Wikipedia]

Axiom
annotated source: density unit
annotated property: label
annotated target: density unit

degree
type: Class
subclass of: degree based unit
definition: "A plane angle unit which is equal to 1/360 of a full rotation or 1.7453310^[-2] rad." [Wikipedia:Wikipedia]

Axiom
annotated source: degree
annotated property: definition
annotated target: "A plane angle unit which is equal to 1/360 of a full rotation or 1.7453310^[-2] rad." [Wikipedia:Wikipedia]

Axiom
annotated source: degree
annotated property: label
annotated target: degree

dimensionless unit
type: Class
subclass of: physical unit
definition: "A unit which is a standard measure of physical quantity consisting of only a numerical number without any units." [Wikipedia:Wikipedia]
term tracker annotation: make subclass of 'physical unit' issue: https://github.com/OpenEnergyPlatform/ontology/issues/2135 pull request: https://github.com/OpenEnergyPlatform/ontology/pull/2141

Axiom
annotated source: dimensionless unit
annotated property: definition
annotated target: "A unit which is a standard measure of physical quantity consisting of only a numerical number without any units." [Wikipedia:Wikipedia]

Axiom
annotated source: dimensionless unit
annotated property: label
annotated target: dimensionless unit

percent
type: Class
subclass of: ratio unit
definition: "A dimensionless ratio unit which denotes numbers as fractions of 100." [Wikipedia:Wikipedia]
has exact synonym: %

Axiom
annotated source: percent
annotated property: definition
annotated target: "A dimensionless ratio unit which denotes numbers as fractions of 100." [Wikipedia:Wikipedia]

Axiom
annotated source: percent
annotated property: hasExactSynonym
annotated target: %

Axiom
annotated source: percent
annotated property: label
annotated target: percent

pi
type: Class
subclass of: pi based unit
definition: "A dimensionless unit which denoted an irrational real number, approximately equal to 3.14159 which is the ratio of a circle's circumference to its diameter in Euclidean geometry." [Wikipedia:Wikipedia]

Axiom
annotated source: pi
annotated property: definition
annotated target: "A dimensionless unit which denoted an irrational real number, approximately equal to 3.14159 which is the ratio of a circle's circumference to its diameter in Euclidean geometry." [Wikipedia:Wikipedia]

Axiom
annotated source: pi
annotated property: label
annotated target: pi

count unit
type: Class
subclass of: dimensionless unit
definition: "A dimensionless unit which denotes a simple count of things." [MGED:MGED]
has exact synonym: count

Axiom
annotated source: count unit
annotated property: definition
annotated target: "A dimensionless unit which denotes a simple count of things." [MGED:MGED]

Axiom
annotated source: count unit
annotated property: hasExactSynonym
annotated target: count

Axiom
annotated source: count unit
annotated property: label
annotated target: count unit

ratio unit
type: Class
subclass of: dimensionless unit
definition: "A dimensionless unit which denotes an amount or magnitude of one quantity relative to another." [Wikipedia:Wikipedia]

Axiom
annotated source: ratio unit
annotated property: definition
annotated target: "A dimensionless unit which denotes an amount or magnitude of one quantity relative to another." [Wikipedia:Wikipedia]

Axiom
annotated source: ratio unit
annotated property: label
annotated target: ratio unit

pH
type: Class
subclass of: pH based unit
definition: "A dimensionless concentration notation which denotes the acidity of a solution in terms of activity of hydrogen ions (H+)." [Wikipedia:Wikipedia]

Axiom
annotated source: pH
annotated property: definition
annotated target: "A dimensionless concentration notation which denotes the acidity of a solution in terms of activity of hydrogen ions (H+)." [Wikipedia:Wikipedia]

Axiom
annotated source: pH
annotated property: label
annotated target: pH

electric potential difference unit
type: Class
subclass of: physical unit
definition: "A unit which is a standard measure of the work done per unit charge as a charge is moved between two points in an electric field." [Wikipedia:Wikipedia]
term tracker annotation: make subclass of 'physical unit' issue: https://github.com/OpenEnergyPlatform/ontology/issues/2135 pull request: https://github.com/OpenEnergyPlatform/ontology/pull/2141

Axiom
annotated source: electric potential difference unit
annotated property: definition
annotated target: "A unit which is a standard measure of the work done per unit charge as a charge is moved between two points in an electric field." [Wikipedia:Wikipedia]

Axiom
annotated source: electric potential difference unit
annotated property: label
annotated target: electric potential difference unit

volt
type: Class
subclass of: volt based unit
definition: "An electric potential difference unit which is equal to the work per unit charge. One volt is the potential difference required to move one coulomb of charge between two points in a circuit while using one joule of energy." [Wikipedia:Wikipedia]
has exact synonym: V

Axiom
annotated source: volt
annotated property: definition
annotated target: "An electric potential difference unit which is equal to the work per unit charge. One volt is the potential difference required to move one coulomb of charge between two points in a circuit while using one joule of energy." [Wikipedia:Wikipedia]

Axiom
annotated source: volt
annotated property: hasExactSynonym
annotated target: V

Axiom
annotated source: volt
annotated property: label
annotated target: volt

electric charge
type: Class
subclass of: physical unit
definition: "A unit which is a standard measure of the quantity of unbalanced electricity in a body (either positive or negative) and construed as an excess or deficiency of electrons." [WordNet:WordNet]
term tracker annotation: make subclass of 'physical unit' issue: https://github.com/OpenEnergyPlatform/ontology/issues/2135 pull request: https://github.com/OpenEnergyPlatform/ontology/pull/2141

Axiom
annotated source: electric charge
annotated property: definition
annotated target: "A unit which is a standard measure of the quantity of unbalanced electricity in a body (either positive or negative) and construed as an excess or deficiency of electrons." [WordNet:WordNet]

Axiom
annotated source: electric charge
annotated property: label
annotated target: electric charge

coulomb
type: Class
subclass of: coulomb based unit
definition: "An electrical charge unit which is equal to the amount of charge transferred by a current of 1 ampere in 1 second." [WordNet:WordNet]
has exact synonym: C

Axiom
annotated source: coulomb
annotated property: definition
annotated target: "An electrical charge unit which is equal to the amount of charge transferred by a current of 1 ampere in 1 second." [WordNet:WordNet]

Axiom
annotated source: coulomb
annotated property: hasExactSynonym
annotated target: C

Axiom
annotated source: coulomb
annotated property: label
annotated target: coulomb

watt-hour
type: Class
subclass of: watt-hour based unit
definition: "An energy unit which is equal to the amount of electrical energy equivalent to a one-watt load drawing power for one hour." [Wikipedia:Wikipedia]
has exact synonym: Wh

Axiom
annotated source: watt-hour
annotated property: definition
annotated target: "An energy unit which is equal to the amount of electrical energy equivalent to a one-watt load drawing power for one hour." [Wikipedia:Wikipedia]

Axiom
annotated source: watt-hour
annotated property: hasExactSynonym
annotated target: Wh

Axiom
annotated source: watt-hour
annotated property: label
annotated target: watt-hour

kilowatt-hour
type: Class
subclass of: watt-hour based unit
definition: "An energy unit which is equal to 1,000 watt-hours." [Wikipedia:Wikipedia]
alternative label: kilowatt hours
has exact synonym: kWh
comment: The original term from UO had neither an alternative term nor has_exact_synonym. It was added for OEO purposes to include the Eurostat spellings.
term tracker annotation: add eurostat alternative term and has_exact_synonym: issue: https://github.com/OpenEnergyPlatform/ontology/issues/920 pull request: https://github.com/OpenEnergyPlatform/ontology/pull/924

Axiom
annotated source: kilowatt-hour
annotated property: definition
annotated target: "An energy unit which is equal to 1,000 watt-hours." [Wikipedia:Wikipedia]

Axiom
annotated source: kilowatt-hour
annotated property: label
annotated target: kilowatt-hour

information unit
type: Class
subclass of: physical unit
definition: "A unit which is a standard measure of the amount of information." [Wikipedia:Wikipedia]
term tracker annotation: make subclass of 'physical unit' issue: https://github.com/OpenEnergyPlatform/ontology/issues/2135 pull request: https://github.com/OpenEnergyPlatform/ontology/pull/2141

Axiom
annotated source: information unit
annotated property: definition
annotated target: "A unit which is a standard measure of the amount of information." [Wikipedia:Wikipedia]

Axiom
annotated source: information unit
annotated property: label
annotated target: information unit

bit
type: Class
subclass of: bit based unit
definition: "An information unit which refers to a digit in the binary numeral system, which consists of base 2 digits (ie there are only 2 possible values: 0 or 1)." [Wikipedia:Wikipedia]

Axiom
annotated source: bit
annotated property: definition
annotated target: "An information unit which refers to a digit in the binary numeral system, which consists of base 2 digits (ie there are only 2 possible values: 0 or 1)." [Wikipedia:Wikipedia]

Axiom
annotated source: bit
annotated property: label
annotated target: bit

byte
type: Class
subclass of: byte based unit
definition: "An information unit which is equal to 8 bits." [Wikipedia:Wikipedia]
has exact synonym: B

Axiom
annotated source: byte
annotated property: definition
annotated target: "An information unit which is equal to 8 bits." [Wikipedia:Wikipedia]

Axiom
annotated source: byte
annotated property: hasExactSynonym
annotated target: B

Axiom
annotated source: byte
annotated property: label
annotated target: byte

kilobyte
type: Class
subclass of: byte based unit
definition: "An information unit which is equal to 1000 bytes." [Wikipedia:Wikipedia]
has exact synonym: kB

Axiom
annotated source: kilobyte
annotated property: definition
annotated target: "An information unit which is equal to 1000 bytes." [Wikipedia:Wikipedia]

Axiom
annotated source: kilobyte
annotated property: hasExactSynonym
annotated target: kB

Axiom
annotated source: kilobyte
annotated property: label
annotated target: kilobyte

megabyte
type: Class
subclass of: byte based unit
definition: "An information unit which is equal to 1000 kB." [Wikipedia:Wikipedia]
has exact synonym: MB

Axiom
annotated source: megabyte
annotated property: definition
annotated target: "An information unit which is equal to 1000 kB." [Wikipedia:Wikipedia]

Axiom
annotated source: megabyte
annotated property: hasExactSynonym
annotated target: MB

Axiom
annotated source: megabyte
annotated property: label
annotated target: megabyte

kilovolt
type: Class
subclass of: volt based unit
definition: "An electric potential difference unit which is equal to one thousand volts or 10^[3] V." [UOC:GVG]
has exact synonym: kV

Axiom
annotated source: kilovolt
annotated property: definition
annotated target: "An electric potential difference unit which is equal to one thousand volts or 10^[3] V." [UOC:GVG]

Axiom
annotated source: kilovolt
annotated property: hasExactSynonym
annotated target: kV

Axiom
annotated source: kilovolt
annotated property: label
annotated target: kilovolt

megavolt
type: Class
subclass of: volt based unit
definition: "An electric potential difference unit which is equal to one million volts or 10^[6] V." [UOC:GVG]
has exact synonym: MV

Axiom
annotated source: megavolt
annotated property: definition
annotated target: "An electric potential difference unit which is equal to one million volts or 10^[6] V." [UOC:GVG]

Axiom
annotated source: megavolt
annotated property: hasExactSynonym
annotated target: MV

Axiom
annotated source: megavolt
annotated property: label
annotated target: megavolt

conduction unit
type: Class
subclass of: physical unit
definition: "A unit which represents a standard measurement of the transmission of an entity through a medium." [UOC:GVG]
term tracker annotation: make subclass of 'physical unit' issue: https://github.com/OpenEnergyPlatform/ontology/issues/2135 pull request: https://github.com/OpenEnergyPlatform/ontology/pull/2141

Axiom
annotated source: conduction unit
annotated property: definition
annotated target: "A unit which represents a standard measurement of the transmission of an entity through a medium." [UOC:GVG]

Axiom
annotated source: conduction unit
annotated property: label
annotated target: conduction unit

electrical conduction unit
type: Class
subclass of: conduction unit
definition: "A unit which represents a standard measurement of the movement of electrically charged particles through a transmission medium (electrical conductor)." [UOC:GVG]

Axiom
annotated source: electrical conduction unit
annotated property: definition
annotated target: "A unit which represents a standard measurement of the movement of electrically charged particles through a transmission medium (electrical conductor)." [UOC:GVG]

Axiom
annotated source: electrical conduction unit
annotated property: label
annotated target: electrical conduction unit

siemens
type: Class
subclass of: siemens based unit
definition: "An electrical conduction unit which is equal to A/V." [NIST:NIST]
has exact synonym: A V^-1
has exact synonym: mho
has_related_synonym: S

Axiom
annotated source: siemens
annotated property: definition
annotated target: "An electrical conduction unit which is equal to A/V." [NIST:NIST]

Axiom
annotated source: siemens
annotated property: hasExactSynonym
annotated target: A V^-1

Axiom
annotated source: siemens
annotated property: hasExactSynonym
annotated target: mho

Axiom
annotated source: siemens
annotated property: has_related_synonym
annotated target: S

Axiom
annotated source: siemens
annotated property: label
annotated target: siemens

volumetric flow rate unit
type: Class
subclass of: physical unit
definition: "A unit which is a standard measure of the volume of fluid which passes through a given surface per unit time ." [Wikipedia:Wikipedia]
term tracker annotation: make subclass of 'physical unit' issue: https://github.com/OpenEnergyPlatform/ontology/issues/2135 pull request: https://github.com/OpenEnergyPlatform/ontology/pull/2141

Axiom
annotated source: volumetric flow rate unit
annotated property: definition
annotated target: "A unit which is a standard measure of the volume of fluid which passes through a given surface per unit time ." [Wikipedia:Wikipedia]

Axiom
annotated source: volumetric flow rate unit
annotated property: label
annotated target: volumetric flow rate unit

rate unit
type: Class
subclass of: physical unit
definition: "A unit which represents a standard measurement occurrence of a process per unit time." [UOC:GVG]
term tracker annotation: make subclass of 'physical unit' issue: https://github.com/OpenEnergyPlatform/ontology/issues/2135 pull request: https://github.com/OpenEnergyPlatform/ontology/pull/2141

Axiom
annotated source: rate unit
annotated property: definition
annotated target: "A unit which represents a standard measurement occurrence of a process per unit time." [UOC:GVG]

Axiom
annotated source: rate unit
annotated property: label
annotated target: rate unit

yotta
type: Class
subclass of: prefix
definition: "A prefix in the metric system denoting a factor of ten to the power of 24." [UO:GVG]
has exact synonym: 10^[24]
has exact synonym: Y

Axiom
annotated source: yotta
annotated property: definition
annotated target: "A prefix in the metric system denoting a factor of ten to the power of 24." [UO:GVG]

Axiom
annotated source: yotta
annotated property: hasExactSynonym
annotated target: 10^[24]

Axiom
annotated source: yotta
annotated property: hasExactSynonym
annotated target: Y

Axiom
annotated source: yotta
annotated property: label
annotated target: yotta

hecto
type: Class
subclass of: prefix
definition: "A prefix in the metric system denoting a factor of one hundred." [UO:GVG]
has exact synonym: 10^[2]
has exact synonym: h

Axiom
annotated source: hecto
annotated property: definition
annotated target: "A prefix in the metric system denoting a factor of one hundred." [UO:GVG]

Axiom
annotated source: hecto
annotated property: hasExactSynonym
annotated target: 10^[2]

Axiom
annotated source: hecto
annotated property: hasExactSynonym
annotated target: h

Axiom
annotated source: hecto
annotated property: label
annotated target: hecto

zetta
type: Class
subclass of: prefix
definition: "A prefix in the metric system denoting a factor of ten to the power of 21." [UO:GVG]
has exact synonym: 10^[21]
has exact synonym: Z

Axiom
annotated source: zetta
annotated property: definition
annotated target: "A prefix in the metric system denoting a factor of ten to the power of 21." [UO:GVG]

Axiom
annotated source: zetta
annotated property: hasExactSynonym
annotated target: 10^[21]

Axiom
annotated source: zetta
annotated property: hasExactSynonym
annotated target: Z

Axiom
annotated source: zetta
annotated property: label
annotated target: zetta

exa
type: Class
subclass of: prefix
definition: "A prefix in the metric system denoting a factor of ten to the power of 18." [UO:GVG]
has exact synonym: 10^[18]
has exact synonym: E

Axiom
annotated source: exa
annotated property: definition
annotated target: "A prefix in the metric system denoting a factor of ten to the power of 18." [UO:GVG]

Axiom
annotated source: exa
annotated property: hasExactSynonym
annotated target: 10^[18]

Axiom
annotated source: exa
annotated property: hasExactSynonym
annotated target: E

Axiom
annotated source: exa
annotated property: label
annotated target: exa

peta
type: Class
subclass of: prefix
definition: "A prefix in the metric system denoting a factor of ten to the power of 15." [UO:GVG]
has exact synonym: 10^[15]
has exact synonym: P

Axiom
annotated source: peta
annotated property: definition
annotated target: "A prefix in the metric system denoting a factor of ten to the power of 15." [UO:GVG]

Axiom
annotated source: peta
annotated property: hasExactSynonym
annotated target: 10^[15]

Axiom
annotated source: peta
annotated property: hasExactSynonym
annotated target: P

Axiom
annotated source: peta
annotated property: label
annotated target: peta

tera
type: Class
subclass of: prefix
definition: "A prefix in the metric system denoting a factor of ten to the power of 12." [UO:GVG]
has exact synonym: T
has_related_synonym: 10^[12]

Axiom
annotated source: tera
annotated property: definition
annotated target: "A prefix in the metric system denoting a factor of ten to the power of 12." [UO:GVG]

Axiom
annotated source: tera
annotated property: hasExactSynonym
annotated target: T

Axiom
annotated source: tera
annotated property: has_related_synonym
annotated target: 10^[12]

Axiom
annotated source: tera
annotated property: label
annotated target: tera

giga
type: Class
subclass of: prefix
definition: "A prefix in the metric system denoting a factor of ten to the power of 9." [UO:GVG]
has exact synonym: 10^[9]
has exact synonym: G

Axiom
annotated source: giga
annotated property: definition
annotated target: "A prefix in the metric system denoting a factor of ten to the power of 9." [UO:GVG]

Axiom
annotated source: giga
annotated property: hasExactSynonym
annotated target: 10^[9]

Axiom
annotated source: giga
annotated property: hasExactSynonym
annotated target: G

Axiom
annotated source: giga
annotated property: label
annotated target: giga

mega
type: Class
subclass of: prefix
definition: "A prefix in the metric system denoting a factor of million." [UO:GVG]
has exact synonym: 10^[6]
has exact synonym: M

Axiom
annotated source: mega
annotated property: definition
annotated target: "A prefix in the metric system denoting a factor of million." [UO:GVG]

Axiom
annotated source: mega
annotated property: hasExactSynonym
annotated target: 10^[6]

Axiom
annotated source: mega
annotated property: hasExactSynonym
annotated target: M

Axiom
annotated source: mega
annotated property: label
annotated target: mega

kilo
type: Class
subclass of: prefix
definition: "A prefix in the metric system denoting a factor of one thousand." [UO:GVG]
has exact synonym: 10^[3]
has exact synonym: k

Axiom
annotated source: kilo
annotated property: definition
annotated target: "A prefix in the metric system denoting a factor of one thousand." [UO:GVG]

Axiom
annotated source: kilo
annotated property: hasExactSynonym
annotated target: 10^[3]

Axiom
annotated source: kilo
annotated property: hasExactSynonym
annotated target: k

Axiom
annotated source: kilo
annotated property: label
annotated target: kilo

deca
type: Class
subclass of: prefix
definition: "A prefix in the metric system denoting a factor of ten." [UO:GVG]
has exact synonym: 10^[1]
has exact synonym: da

Axiom
annotated source: deca
annotated property: definition
annotated target: "A prefix in the metric system denoting a factor of ten." [UO:GVG]

Axiom
annotated source: deca
annotated property: hasExactSynonym
annotated target: 10^[1]

Axiom
annotated source: deca
annotated property: hasExactSynonym
annotated target: da

Axiom
annotated source: deca
annotated property: label
annotated target: deca

milli
type: Class
subclass of: prefix
definition: "A prefix in the metric system denoting a factor of one thousand." [UO:GVG]
has exact synonym: 10^[-3]
has exact synonym: m

Axiom
annotated source: milli
annotated property: definition
annotated target: "A prefix in the metric system denoting a factor of one thousand." [UO:GVG]

Axiom
annotated source: milli
annotated property: hasExactSynonym
annotated target: 10^[-3]

Axiom
annotated source: milli
annotated property: hasExactSynonym
annotated target: m

Axiom
annotated source: milli
annotated property: label
annotated target: milli

centi
type: Class
subclass of: prefix
definition: "A prefix in the metric system denoting a factor of one hundred." [UO:GVG]
has exact synonym: 10^[-2]
has exact synonym: c

Axiom
annotated source: centi
annotated property: definition
annotated target: "A prefix in the metric system denoting a factor of one hundred." [UO:GVG]

Axiom
annotated source: centi
annotated property: hasExactSynonym
annotated target: 10^[-2]

Axiom
annotated source: centi
annotated property: hasExactSynonym
annotated target: c

Axiom
annotated source: centi
annotated property: label
annotated target: centi

micro
type: Class
subclass of: prefix
definition: "A prefix in the metric system denoting a factor of 10 to the power of -6." [UO:GVG]
has exact synonym: 10^[-6]

Axiom
annotated source: micro
annotated property: definition
annotated target: "A prefix in the metric system denoting a factor of 10 to the power of -6." [UO:GVG]

Axiom
annotated source: micro
annotated property: hasExactSynonym
annotated target: 10^[-6]

Axiom
annotated source: micro
annotated property: label
annotated target: micro

nano
type: Class
subclass of: prefix
definition: "A prefix in the metric system denoting a factor of 10 to the power of -9." [UO:GVG]
has exact synonym: 10^[-9]
has exact synonym: n

Axiom
annotated source: nano
annotated property: definition
annotated target: "A prefix in the metric system denoting a factor of 10 to the power of -9." [UO:GVG]

Axiom
annotated source: nano
annotated property: hasExactSynonym
annotated target: 10^[-9]

Axiom
annotated source: nano
annotated property: hasExactSynonym
annotated target: n

Axiom
annotated source: nano
annotated property: label
annotated target: nano

pico
type: Class
subclass of: prefix
definition: "A prefix in the metric system denoting a factor of 10 to the power of -12." [GVG:UO]
has exact synonym: 10^[-12]
has exact synonym: n

Axiom
annotated source: pico
annotated property: definition
annotated target: "A prefix in the metric system denoting a factor of 10 to the power of -12." [GVG:UO]

Axiom
annotated source: pico
annotated property: hasExactSynonym
annotated target: 10^[-12]

Axiom
annotated source: pico
annotated property: hasExactSynonym
annotated target: n

Axiom
annotated source: pico
annotated property: label
annotated target: pico

femto
type: Class
subclass of: prefix
definition: "A prefix in the metric system denoting a factor of 10 to the power of -15." [UO:GVG]
has exact synonym: 10^[-15]
has exact synonym: f

Axiom
annotated source: femto
annotated property: definition
annotated target: "A prefix in the metric system denoting a factor of 10 to the power of -15." [UO:GVG]

Axiom
annotated source: femto
annotated property: hasExactSynonym
annotated target: 10^[-15]

Axiom
annotated source: femto
annotated property: hasExactSynonym
annotated target: f

Axiom
annotated source: femto
annotated property: label
annotated target: femto

atto
type: Class
subclass of: prefix
definition: "A prefix in the metric system denoting a factor of 10 to the power of -18." [UO:GVG]
has exact synonym: a
has_related_synonym: 10^[-18]

Axiom
annotated source: atto
annotated property: definition
annotated target: "A prefix in the metric system denoting a factor of 10 to the power of -18." [UO:GVG]

Axiom
annotated source: atto
annotated property: hasExactSynonym
annotated target: a

Axiom
annotated source: atto
annotated property: has_related_synonym
annotated target: 10^[-18]

Axiom
annotated source: atto
annotated property: label
annotated target: atto

zepto
type: Class
subclass of: prefix
definition: "A prefix in the metric system denoting a factor of 10 to the power of -21." [UO:GVG]
has exact synonym: z
has_related_synonym: 10^[-21]

Axiom
annotated source: zepto
annotated property: definition
annotated target: "A prefix in the metric system denoting a factor of 10 to the power of -21." [UO:GVG]

Axiom
annotated source: zepto
annotated property: hasExactSynonym
annotated target: z

Axiom
annotated source: zepto
annotated property: has_related_synonym
annotated target: 10^[-21]

Axiom
annotated source: zepto
annotated property: label
annotated target: zepto

yocto
type: Class
subclass of: prefix
definition: "A prefix in the metric system denoting a factor of 10 to the power of -24." [UO:GVG]
has exact synonym: y
has_related_synonym: 10^[-24]

Axiom
annotated source: yocto
annotated property: definition
annotated target: "A prefix in the metric system denoting a factor of 10 to the power of -24." [UO:GVG]

Axiom
annotated source: yocto
annotated property: hasExactSynonym
annotated target: y

Axiom
annotated source: yocto
annotated property: has_related_synonym
annotated target: 10^[-24]

Axiom
annotated source: yocto
annotated property: label
annotated target: yocto

megaHertz
type: Class
subclass of: frequency unit
definition: "A frequency unit which is equal to one million hertz or 10^[6] V." [UOC:GVG]
has_related_synonym: mH
has_related_synonym: megahertz

Axiom
annotated source: megaHertz
annotated property: definition
annotated target: "A frequency unit which is equal to one million hertz or 10^[6] V." [UOC:GVG]

Axiom
annotated source: megaHertz
annotated property: has_related_synonym
annotated target: mH

Axiom
annotated source: megaHertz
annotated property: has_related_synonym
annotated target: megahertz

Axiom
annotated source: megaHertz
annotated property: label
annotated target: megaHertz

gigabyte
type: Class
subclass of: information unit
definition: "An information unit which is equal to 1000000000 bytes." [UO:GVG]
has exact synonym: GB

Axiom
annotated source: gigabyte
annotated property: definition
annotated target: "An information unit which is equal to 1000000000 bytes." [UO:GVG]

Axiom
annotated source: gigabyte
annotated property: hasExactSynonym
annotated target: GB

Axiom
annotated source: gigabyte
annotated property: label
annotated target: gigabyte

terabyte
type: Class
subclass of: information unit
definition: "An information unit which is equal to 1000 gigabytes." [UO:GVG]
has exact synonym: TB

Axiom
annotated source: terabyte
annotated property: definition
annotated target: "An information unit which is equal to 1000 gigabytes." [UO:GVG]

Axiom
annotated source: terabyte
annotated property: hasExactSynonym
annotated target: TB

Axiom
annotated source: terabyte
annotated property: label
annotated target: terabyte

ratio
type: Class
subclass of: ratio unit
definition: "A dimensionless ratio unit which, given a pair of quantities a and b, for which b is a multiple of a, denotes b by giving the multiplier (coefficient) c for a to result in b." [UOB:LKSR]

Axiom
annotated source: ratio
annotated property: definition
annotated target: "A dimensionless ratio unit which, given a pair of quantities a and b, for which b is a multiple of a, denotes b by giving the multiplier (coefficient) c for a to result in b." [UOB:LKSR]

Axiom
annotated source: ratio
annotated property: label
annotated target: ratio

kilometer per hour
type: Class
subclass of: speed/velocity unit
definition: "A speed/velocity unit which is equal to the speed of an object traveling 1 kilometer distance in one hour." [NIST:NIST]
has exact synonym: kilometre per hour
has exact synonym: km/h

Axiom
annotated source: kilometer per hour
annotated property: definition
annotated target: "A speed/velocity unit which is equal to the speed of an object traveling 1 kilometer distance in one hour." [NIST:NIST]

Axiom
annotated source: kilometer per hour
annotated property: hasExactSynonym
annotated target: kilometre per hour

Axiom
annotated source: kilometer per hour
annotated property: hasExactSynonym
annotated target: km/h

Axiom
annotated source: kilometer per hour
annotated property: label
annotated target: kilometer per hour

hectare
type: Class
subclass of: hectare based unit
definition: "An area unit which is equal to an area of 10,000 square meters. Equivalent to 2.471 acres." [Wikipedia:Wikipedia]
has exact synonym: HA

Axiom
annotated source: hectare
annotated property: definition
annotated target: "An area unit which is equal to an area of 10,000 square meters. Equivalent to 2.471 acres." [Wikipedia:Wikipedia]

Axiom
annotated source: hectare
annotated property: hasExactSynonym
annotated target: HA

Axiom
annotated source: hectare
annotated property: label
annotated target: hectare

kilometer
type: Class
subclass of: meter based unit
definition: "A length unit which is equal to one thousand meters." [UOB:LKSR]
has exact synonym: kilometre
has exact synonym: km

Axiom
annotated source: kilometer
annotated property: definition
annotated target: "A length unit which is equal to one thousand meters." [UOB:LKSR]

Axiom
annotated source: kilometer
annotated property: hasExactSynonym
annotated target: kilometre

Axiom
annotated source: kilometer
annotated property: hasExactSynonym
annotated target: km

Axiom
annotated source: kilometer
annotated property: label
annotated target: kilometer

meter based unit
type: Class
subclass of: length unit

Axiom
annotated source: meter based unit
annotated property: label
annotated target: meter based unit

second based unit
type: Class
subclass of: time unit

Axiom
annotated source: second based unit
annotated property: label
annotated target: second based unit

ampere based unit
type: Class
subclass of: electric current unit

Axiom
annotated source: ampere based unit
annotated property: label
annotated target: ampere based unit

kelvin based unit
type: Class
subclass of: temperature unit

Axiom
annotated source: kelvin based unit
annotated property: label
annotated target: kelvin based unit

candela based unit
type: Class
subclass of: luminous intensity unit

Axiom
annotated source: candela based unit
annotated property: label
annotated target: candela based unit

gram based unit
type: Class
subclass of: mass unit

Axiom
annotated source: gram based unit
annotated property: label
annotated target: gram based unit

degree Celsius based unit
type: Class
subclass of: temperature unit

Axiom
annotated source: degree Celsius based unit
annotated property: label
annotated target: degree Celsius based unit

minute based unit
type: Class
subclass of: time unit

Axiom
annotated source: minute based unit
annotated property: label
annotated target: minute based unit

hour based unit
type: Class
subclass of: time unit

Axiom
annotated source: hour based unit
annotated property: label
annotated target: hour based unit

day based unit
type: Class
subclass of: time unit

Axiom
annotated source: day based unit
annotated property: label
annotated target: day based unit

week based unit
type: Class
subclass of: time unit

Axiom
annotated source: week based unit
annotated property: label
annotated target: week based unit

month based unit
type: Class
subclass of: time unit

Axiom
annotated source: month based unit
annotated property: label
annotated target: month based unit

year based unit
type: Class
subclass of: time unit

Axiom
annotated source: year based unit
annotated property: label
annotated target: year based unit

square meter based unit
type: Class
subclass of: area unit

Axiom
annotated source: square meter based unit
annotated property: label
annotated target: square meter based unit

square millimeter based unit
type: Class
subclass of: area unit

Axiom
annotated source: square millimeter based unit
annotated property: label
annotated target: square millimeter based unit

turns per second based unit
type: Class
subclass of: rotational frequency unit

Axiom
annotated source: turns per second based unit
annotated property: label
annotated target: turns per second based unit

meter per second based unit
type: Class
subclass of: speed/velocity unit

Axiom
annotated source: meter per second based unit
annotated property: label
annotated target: meter per second based unit

cubic meter based unit
type: Class
subclass of: volume unit

Axiom
annotated source: cubic meter based unit
annotated property: label
annotated target: cubic meter based unit

cubic centimeter based unit
type: Class
subclass of: volume unit

Axiom
annotated source: cubic centimeter based unit
annotated property: label
annotated target: cubic centimeter based unit

liter based unit
type: Class
subclass of: volume unit

Axiom
annotated source: liter based unit
annotated property: label
annotated target: liter based unit

hertz based unit
type: Class
subclass of: frequency unit

Axiom
annotated source: hertz based unit
annotated property: label
annotated target: hertz based unit

newton based unit
type: Class
subclass of: force unit

Axiom
annotated source: newton based unit
annotated property: label
annotated target: newton based unit

pascal based unit
type: Class
subclass of: pressure unit

Axiom
annotated source: pascal based unit
annotated property: label
annotated target: pascal based unit

joule based unit
type: Class
subclass of: energy unit

Axiom
annotated source: joule based unit
annotated property: label
annotated target: joule based unit

watt based unit
type: Class
subclass of: power unit

Axiom
annotated source: watt based unit
annotated property: label
annotated target: watt based unit

lux based unit
type: Class
subclass of: illuminance unit

Axiom
annotated source: lux based unit
annotated property: label
annotated target: lux based unit

lumen based unit
type: Class
subclass of: luminous flux unit

Axiom
annotated source: lumen based unit
annotated property: label
annotated target: lumen based unit

radian based unit
type: Class
subclass of: plane angle unit

Axiom
annotated source: radian based unit
annotated property: label
annotated target: radian based unit

watt per square meter based unit
type: Class
subclass of: irradiance unit

Axiom
annotated source: watt per square meter based unit
annotated property: label
annotated target: watt per square meter based unit

parts per million based unit
type: Class
subclass of: parts per notation unit

Axiom
annotated source: parts per million based unit
annotated property: label
annotated target: parts per million based unit

degree based unit
type: Class
subclass of: plane angle unit

Axiom
annotated source: degree based unit
annotated property: label
annotated target: degree based unit

pi based unit
type: Class
subclass of: dimensionless unit

Axiom
annotated source: pi based unit
annotated property: label
annotated target: pi based unit

pH based unit
type: Class
subclass of: concentration unit
subclass of: dimensionless unit

Axiom
annotated source: pH based unit
annotated property: label
annotated target: pH based unit

volt based unit
type: Class
subclass of: electric potential difference unit

Axiom
annotated source: volt based unit
annotated property: label
annotated target: volt based unit

coulomb based unit
type: Class
subclass of: electric charge

Axiom
annotated source: coulomb based unit
annotated property: label
annotated target: coulomb based unit

watt-hour based unit
type: Class
subclass of: energy unit

Axiom
annotated source: watt-hour based unit
annotated property: label
annotated target: watt-hour based unit

bit based unit
type: Class
subclass of: information unit

Axiom
annotated source: bit based unit
annotated property: label
annotated target: bit based unit

byte based unit
type: Class
subclass of: information unit

Axiom
annotated source: byte based unit
annotated property: label
annotated target: byte based unit

siemens based unit
type: Class
subclass of: electrical conduction unit

Axiom
annotated source: siemens based unit
annotated property: label
annotated target: siemens based unit

hectare based unit
type: Class
subclass of: area unit

Axiom
annotated source: hectare based unit
annotated property: label
annotated target: hectare based unit

gram per square meter based unit
type: Class
subclass of: area density unit

Axiom
annotated source: gram per square meter based unit
annotated property: label
annotated target: gram per square meter based unit

fuel role
type: Class
subclass of: role
subclass of: Restriction
  on property: characteristic of
  some values from: portion of matter
definition: A fuel role is a role of a portion of matter that has the disposition to be an energy carrier and is used in a process that releases the carried energy by transforming the portion of matter into a different kind of portion of matter in a way that releases heat or does work.
may be identical to: http://purl.obolibrary.org/obo/CHEBI_33292
term tracker annotation: issue: https://github.com/OpenEnergyPlatform/ontology/issues/227 pull request: https://github.com/OpenEnergyPlatform/ontology/pull/279 add has bearer axiom: issue: https://github.com/OpenEnergyPlatform/ontology/issues/1167 pull request: https://github.com/OpenEnergyPlatform/ontology/pull/1178 move to oeo-shared: issue: https://github.com/OpenEnergyPlatform/ontology/issues/1384 pull request: https://github.com/OpenEnergyPlatform/ontology/pull/1390 rework module structure issue: https://github.com/OpenEnergyPlatform/ontology/issues/1592 pull request: https://github.com/OpenEnergyPlatform/ontology/pull/1652 replaced 'has bearer' with 'characteristic of' issue: https://github.com/OpenEnergyPlatform/ontology/issues/1907 pull request: https://github.com/OpenEnergyPlatform/ontology/pull/1928

Axiom
annotated source: fuel role
annotated property: may be identical to
annotated target: http://purl.obolibrary.org/obo/CHEBI_33292
term tracker annotation: issue: https://github.com/OpenEnergyPlatform/ontology/issues/636 pull request: https://github.com/OpenEnergyPlatform/ontology/pull/810

biofuel power unit
type: Class
subclass of: power generating unit
subclass of: Restriction
subclass of: Restriction
  on property: uses
  some values from: biofuel
definition: A biofuel power unit is a power generating unit using biofuel.

Axiom
annotated source: biofuel power unit
annotated property: subClassOf
annotated target: Restriction
term tracker annotation: issue: https://github.com/OpenEnergyPlatform/ontology/issues/636 pull request: https://github.com/OpenEnergyPlatform/ontology/pull/810

biogas power plant
type: Class
subclass of: biofuel power plant
subclass of: Restriction
  on property: has part
  some values from: biogas power unit
definition: A biogas power plant is a biofuel power plant that has biogas power units as parts.
alternative label: Biogaskraftwerk @de
term tracker annotation: issue: https://github.com/OpenEnergyPlatform/ontology/issues/750 pull request: https://github.com/OpenEnergyPlatform/ontology/pull/752

biogas power unit
type: Class
subclass of: biofuel power unit
subclass of: Restriction
  on property: uses
  some values from: biogas
definition: A biogas power unit is a biofuel power unit using biogas as fuel.

carbon dioxide
type: Class
subclass of: portion of matter
subclass of: Restriction
  on property: has disposition
  some values from: greenhouse effect disposition
subclass of: Restriction
  on property: has normal state of matter
  has value: OEO_00000182
definition: Carbon dioxide is a portion of matter with the chemical formula CO2. It has a gaseous normal state of matter. It occurs naturally in the atmosphere as a trace gas and can work as a greenhouse gas.
alternative label: CO2
alternative label: Kohlendioxid @de
may be identical to: http://purl.obolibrary.org/obo/CHEBI_16526
term tracker annotation: move to oeo-shared: issue: https://github.com/OpenEnergyPlatform/ontology/issues/1329 pull request: https://github.com/OpenEnergyPlatform/ontology/pull/1615 rework module structure issue: https://github.com/OpenEnergyPlatform/ontology/issues/1592 pull request: https://github.com/OpenEnergyPlatform/ontology/pull/1652

Axiom
annotated source: carbon dioxide
annotated property: may be identical to
annotated target: http://purl.obolibrary.org/obo/CHEBI_16526
term tracker annotation: issue: https://github.com/OpenEnergyPlatform/ontology/issues/636 pull request: https://github.com/OpenEnergyPlatform/ontology/pull/810

chemical energy
type: Class
subclass of: energy
definition: Chemical energy is energy that is stored in the chemical bonds of a substance, which can be released by a chemical reaction.
alternative label: chemische Energie @de
term tracker annotation: issue: https://github.com/OpenEnergyPlatform/ontology/issues/174 pull request: https://github.com/OpenEnergyPlatform/ontology/pull/214 issue: https://github.com/OpenEnergyPlatform/ontology/issues/1384 pull request: https://github.com/OpenEnergyPlatform/ontology/pull/1390 rework module structure issue: https://github.com/OpenEnergyPlatform/ontology/issues/1592 pull request: https://github.com/OpenEnergyPlatform/ontology/pull/1652

Axiom
annotated source: chemical energy
annotated property: closeMatch
annotated target: ENVO_2000023
term tracker annotation: issue: https://github.com/OpenEnergyPlatform/ontology/issues/636 pull request: https://github.com/OpenEnergyPlatform/ontology/pull/810 Convert to skos:closeMatch issue: https://github.com/OpenEnergyPlatform/ontology/issues/636 pull request: https://github.com/OpenEnergyPlatform/ontology/pull/1879

coal power unit
type: Class
subclass of: power generating unit
subclass of: Restriction
subclass of: Restriction
  on property: has part
  some values from: steam turbine
subclass of: Restriction
  on property: uses
  some values from: coal
definition: A coal power unit is a power generating unit using coal as fuel.
alternative label: Kohlekraftwerksblock @de
term tracker annotation: issue: https://github.com/OpenEnergyPlatform/ontology/issues/750 pull request: https://github.com/OpenEnergyPlatform/ontology/pull/752

Axiom
annotated source: coal power unit
annotated property: subClassOf
annotated target: Restriction
term tracker annotation: issue: https://github.com/OpenEnergyPlatform/ontology/issues/636 pull request: https://github.com/OpenEnergyPlatform/ontology/pull/810

electric heat pump
type: Class
subclass of: heat pump
subclass of: Restriction
definition: An electric heat pump is a heat pump that uses electrical energy as drive energy.
alternative label: elektrische Wärmepumpe @de
term tracker annotation: fix energy axiom: issue: https://github.com/OpenEnergyPlatform/ontology/issues/1281 pull: https://github.com/OpenEnergyPlatform/ontology/pulls/1282

Axiom
annotated source: electric heat pump
annotated property: subClassOf
annotated target: Restriction
term tracker annotation: issue: https://github.com/OpenEnergyPlatform/ontology/issues/761 pull request: https://github.com/OpenEnergyPlatform/ontology/pull/782 change uses energy axiom to 'has energy input': issue: https://github.com/OpenEnergyPlatform/ontology/issues/994 pull request: https://github.com/OpenEnergyPlatform/ontology/pull/1006

electromotive generator
type: Class
subclass of: generator
subclass of: Restriction
definition: An electro motive generator is a generator that converts kinetic energy into electric energy.
alternative label: Generator @de

Axiom
annotated source: electromotive generator
annotated property: subClassOf
annotated target: Restriction
term tracker annotation: issue: https://github.com/OpenEnergyPlatform/ontology/issues/761 pull request: https://github.com/OpenEnergyPlatform/ontology/pull/782

energy converting component
type: Class
subclass of: artificial object
subclass of: Restriction
  on property: part of
  some values from: energy transformation unit
subclass of: Restriction
  on property: participates in
  some values from: energy transformation
subclass of: Restriction
  on property: has energy output
  some values from: waste thermal energy
definition: An energy converting component is an artificial object that is usually a discrete part of an energy transformation unit with the function of transforming, transferring or changing a certain type of energy.
comment: formerly called energy transformer and formerly called energy converting device
term tracker annotation: issue: https://github.com/OpenEnergyPlatform/ontology/issues/173 pull request: https://github.com/OpenEnergyPlatform/ontology/pull/273 issue: https://github.com/OpenEnergyPlatform/ontology/issues/372 pull request: https://github.com/OpenEnergyPlatform/ontology/pull/646 renaming to component pull request: https://github.com/OpenEnergyPlatform/ontology/pull/895 redefine pull request: https://github.com/OpenEnergyPlatform/ontology/pull/1010 issue: https://github.com/OpenEnergyPlatform/ontology/issues/1265 pull request: https://github.com/OpenEnergyPlatform/ontology/pull/1359 move to oeo-shared: issue: https://github.com/OpenEnergyPlatform/ontology/issues/1384 pull request: https://github.com/OpenEnergyPlatform/ontology/pull/1390 rework module structure issue: https://github.com/OpenEnergyPlatform/ontology/issues/1592 pull request: https://github.com/OpenEnergyPlatform/ontology/pull/1652

energy storage function
type: Class
subclass of: energy carrier disposition
subclass of: Restriction
  on property: characteristic of
  some values from: artificial object
definition: An energy storage function is the function of an artificial object that has been engineered to contain energy for later usage whereby input energy and usable output energy are of the same type.
term tracker annotation: issue: https://github.com/OpenEnergyPlatform/ontology/issues/209 pull request: https://github.com/OpenEnergyPlatform/ontology/pull/276 Improve definition: issue: https://github.com/OpenEnergyPlatform/ontology/issues/1170 pull request: https://github.com/OpenEnergyPlatform/ontology/pull/1348 replaced 'has bearer' with 'characteristic of' issue: https://github.com/OpenEnergyPlatform/ontology/issues/1907 pull request: https://github.com/OpenEnergyPlatform/ontology/pull/1928

fluorinated greenhouse gas
type: Class
equivalent class: Class
  union of: nitrogen trifluoride
  union of: sulphur hexafluoride
  union of: hydrofluorocarbon
  union of: perfluorocarbon
subclass of: greenhouse gas
definition: A fluorinated greenhouse gas is a greenhouse gas that is produced by fluorination. Hence it contains Fluor (F) atoms and is of anthropogenic origin.
alternative label: F-Gas @de
alternative label: Fluoriertes Treibhausgas @de

fossil combustion fuel
type: Class
equivalent class: Class
  intersection of: combustion fuel
  intersection of: Restriction
    on property: has origin
    some values from: fossil
subclass of: combustion fuel
subclass of: Restriction
  on property: has origin
  some values from: geogenic
disjoint with: biofuel
definition: A fossil combustion fuel is a combustion fuel with the origin fossil.
alternative label: fossiler Brennstoff @de
comment: This class is used to implement the subset relationship between origins fossil and geogenic: Every object with the origin fossil also has the origin geogenic.
term tracker annotation: move to oeo-shared: issue: https://github.com/OpenEnergyPlatform/ontology/issues/1384 pull request: https://github.com/OpenEnergyPlatform/ontology/pull/1390 rework module structure issue: https://github.com/OpenEnergyPlatform/ontology/issues/1592 pull request: https://github.com/OpenEnergyPlatform/ontology/pull/1652

Axiom
annotated source: fossil combustion fuel
annotated property: subClassOf
annotated target: combustion fuel
term tracker annotation: Add `SubClass Of` axiom for `fossil combustion fuel` issue: https://github.com/OpenEnergyPlatform/ontology/issues/1191 pull request: https://github.com/OpenEnergyPlatform/ontology/pull/1201

fuel cell
type: Class
subclass of: generator
subclass of: Restriction
subclass of: Restriction
  on property: has energy input
  some values from: chemical energy
definition: A fuel cell is a generator that converts chemical energy into electricity using redox reactions.
alternative label: Brennstoffzelle @de
term tracker annotation: Improve axioms: issue: https://github.com/OpenEnergyPlatform/ontology/issues/1337 pull request: https://github.com/OpenEnergyPlatform/ontology/pull/1340

Axiom
annotated source: fuel cell
annotated property: subClassOf
annotated target: Restriction
term tracker annotation: issue: https://github.com/OpenEnergyPlatform/ontology/issues/761 pull request: https://github.com/OpenEnergyPlatform/ontology/pull/782

Axiom
annotated source: fuel cell
annotated property: subClassOf
annotated target: Restriction
term tracker annotation: issue: https://github.com/OpenEnergyPlatform/ontology/issues/761 pull request: https://github.com/OpenEnergyPlatform/ontology/pull/782

gas fired power unit
type: Class
subclass of: power generating unit
subclass of: Restriction
subclass of: Restriction
  on property: uses
  some values from: Class
    intersection of: fuel
    intersection of: Restriction
      on property: has normal state of matter
      has value: OEO_00000182
definition: A gas fired power unit is a power generating unit using gas as fuel.
alternative label: Gaskraftwerksblock @de
alternative label: gas power unit
term tracker annotation: Add 'gas power unit' as alternative term: issue: https://github.com/OpenEnergyPlatform/ontology/issues/1256 pull request: https://github.com/OpenEnergyPlatform/ontology/pull/1362/

Axiom
annotated source: gas fired power unit
annotated property: subClassOf
annotated target: Restriction
term tracker annotation: issue: https://github.com/OpenEnergyPlatform/ontology/issues/636 pull request: https://github.com/OpenEnergyPlatform/ontology/pull/810

geothermal power unit
type: Class
subclass of: power generating unit
subclass of: Restriction
subclass of: Restriction
  on property: has part
  some values from: steam turbine
subclass of: Restriction
  on property: has function
  some values from: renewable energy transformation function
subclass of: Restriction
  on property: has energy input
  some values from: geothermal energy
definition: A geothermal power unit is a power unit using geothermal heat.
term tracker annotation: issue: https://github.com/OpenEnergyPlatform/ontology/issues/750 pull request: https://github.com/OpenEnergyPlatform/ontology/pull/752 Add 'has energy input' axiom: issue:https://github.com/OpenEnergyPlatform/ontology/issues/1423 pull request: https://github.com/OpenEnergyPlatform/ontology/pull/1437 Add function: issue: https://github.com/OpenEnergyPlatform/ontology/issues/1423 pull request: https://github.com/OpenEnergyPlatform/ontology/pull/1437

Axiom
annotated source: geothermal power unit
annotated property: subClassOf
annotated target: Restriction
term tracker annotation: issue: https://github.com/OpenEnergyPlatform/ontology/issues/636 pull request: https://github.com/OpenEnergyPlatform/ontology/pull/810

greenhouse gas
type: Class
equivalent class: Class
  intersection of: portion of matter
  intersection of: Restriction
    on property: has disposition
    some values from: greenhouse effect disposition
subclass of: portion of matter
subclass of: Restriction
  on property: has global warming potential
  some values from: global warming potential
subclass of: Restriction
  on property: has normal state of matter
  has value: OEO_00000182
definition: A greenhouse gas is a portion of matter that has the disposition to contribute to the greenhouse effect.
alternative label: Treibhausgas @de
term tracker annotation: issue: https://github.com/OpenEnergyPlatform/ontology/issues/56 pull request: https://github.com/OpenEnergyPlatform/ontology/pull/234 move to oeo-shared: issue: https://github.com/OpenEnergyPlatform/ontology/issues/1384 pull request: https://github.com/OpenEnergyPlatform/ontology/pull/1390 Add global warming potential axiom: pull request: https://github.com/OpenEnergyPlatform/ontology/pull/1410 rework module structure issue: https://github.com/OpenEnergyPlatform/ontology/issues/1592 pull request: https://github.com/OpenEnergyPlatform/ontology/pull/1652

hard coal power unit
type: Class
subclass of: coal power unit
subclass of: Restriction
  on property: uses
  some values from: hard coal
definition: A hard coal power unit is a coal power unit using hard coal as fuel.
alternative label: Steinkohlekraftwerksblock @de

hydrogen power unit
type: Class
subclass of: power generating unit
subclass of: Restriction
subclass of: Restriction
  on property: has part
  some values from: hydrogen turbine
subclass of: Restriction
  on property: uses
  some values from: hydrogen
definition: A hydrogen power unit is a power generating unit using hydrogen as fuel.
alternative label: Wasserstoffkraftwerksblock @de
term tracker annotation: issue: https://github.com/OpenEnergyPlatform/ontology/issues/750 pull request: https://github.com/OpenEnergyPlatform/ontology/pull/752

Axiom
annotated source: hydrogen power unit
annotated property: subClassOf
annotated target: Restriction
term tracker annotation: issue: https://github.com/OpenEnergyPlatform/ontology/issues/636 pull request: https://github.com/OpenEnergyPlatform/ontology/pull/810

lignite power unit
type: Class
subclass of: coal power unit
subclass of: Restriction
  on property: uses
  some values from: lignite
definition: A lignite power unit is a coal power unit using lignite as fuel.
alternative label: Braunkohlenkraftwerksblock @de

methane
type: Class
subclass of: hydrocarbon
subclass of: Restriction
  on property: has role
  some values from: fuel role
subclass of: Restriction
  on property: has disposition
  some values from: combustible energy carrier disposition
subclass of: Restriction
  on property: has disposition
  some values from: greenhouse effect disposition
subclass of: Restriction
  on property: has disposition
  some values from: volatility
subclass of: Restriction
  on property: has normal state of matter
  has value: OEO_00000182
definition: Methane is a hydrocarbon with the chemical formula CH4. It has a gaseous normal state of matter. It occurs naturally in the atmosphere as a trace gas and can work as a greenhouse gas. As it can be oxidised it can be used as a fuel.
alternative label: CH4
alternative label: Methan @de
may be identical to: http://purl.obolibrary.org/obo/CHEBI_16183
term tracker annotation: classification changed: issue: https://github.com/OpenEnergyPlatform/ontology/issues/786 pull request: https://github.com/OpenEnergyPlatform/ontology/pull/805

Axiom
annotated source: methane
annotated property: may be identical to
annotated target: http://purl.obolibrary.org/obo/CHEBI_16183
term tracker annotation: issue: https://github.com/OpenEnergyPlatform/ontology/issues/636 pull request: https://github.com/OpenEnergyPlatform/ontology/pull/810

nitrogen trifluoride
type: Class
subclass of: portion of matter
subclass of: Restriction
  on property: has origin
  some values from: anthropogenic
subclass of: Restriction
  on property: has normal state of matter
  has value: OEO_00000182
definition: Nitrogen trifluoride is a portion of matter with the chemical formula NF3. It has a gaseous normal state of matter. It can work as a potent greenhouse gas and has an anthropogenic origin.
alternative label: NF3
alternative label: Stickstofftrifluorid @de

nitrous oxide
type: Class
subclass of: portion of matter
subclass of: Restriction
  on property: has disposition
  some values from: greenhouse effect disposition
subclass of: Restriction
  on property: has normal state of matter
  has value: OEO_00000182
definition: Nitrous oxide is a portion of matter with the chemical formula N2O. It has a gaseous normal state of matter. It occurs naturally in the atmosphere as a trace gas and it can work as a greenhouse gas.
alternative label: Lachgas @de
alternative label: N2O
alternative label: dinitrogen oxide
may be identical to: http://purl.obolibrary.org/obo/CHEBI_17045

Axiom
annotated source: nitrous oxide
annotated property: alternative label
annotated target: dinitrogen oxide
term tracker annotation: issue: https://github.com/OpenEnergyPlatform/ontology/issues/636 pull request: https://github.com/OpenEnergyPlatform/ontology/pull/810

Axiom
annotated source: nitrous oxide
annotated property: may be identical to
annotated target: http://purl.obolibrary.org/obo/CHEBI_17045
term tracker annotation: issue: https://github.com/OpenEnergyPlatform/ontology/issues/636 pull request: https://github.com/OpenEnergyPlatform/ontology/pull/810

nuclear energy carrier disposition
type: Class
subclass of: energy carrier disposition
definition: A nuclear energy carrier is an energy carrier used in nuclear power stations to produce heat for steam turbines. Heat is created when the nuclear fuel undergoes nuclear fission.
term tracker annotation: issue: https://github.com/OpenEnergyPlatform/ontology/issues/182 pull request: https://github.com/OpenEnergyPlatform/ontology/pull/237

nuclear power unit
type: Class
subclass of: power generating unit
subclass of: Restriction
subclass of: Restriction
  on property: has part
  some values from: steam turbine
subclass of: Restriction
  on property: uses
  some values from: nuclear fuel
definition: A nuclear power unit is a power generating unit using nuclear fuel.
alternative label: Kernkraftwerksblock @de
term tracker annotation: issue: https://github.com/OpenEnergyPlatform/ontology/issues/750 pull request: https://github.com/OpenEnergyPlatform/ontology/pull/752

Axiom
annotated source: nuclear power unit
annotated property: subClassOf
annotated target: Restriction
term tracker annotation: issue: https://github.com/OpenEnergyPlatform/ontology/issues/636 pull request: https://github.com/OpenEnergyPlatform/ontology/pull/810

oil power unit
type: Class
subclass of: power generating unit
subclass of: Restriction
subclass of: Restriction
  on property: has part
  some values from: steam turbine
definition: An oil power unit is a power generating unit using oil as fuel.
alternative label: Ölkraftwerksblock @de

Axiom
annotated source: oil power unit
annotated property: subClassOf
annotated target: Restriction
term tracker annotation: issue: https://github.com/OpenEnergyPlatform/ontology/issues/636 pull request: https://github.com/OpenEnergyPlatform/ontology/pull/810

Axiom
annotated source: oil power unit
annotated property: subClassOf
annotated target: Restriction
term tracker annotation: issue: https://github.com/OpenEnergyPlatform/ontology/issues/811 https://github.com/OpenEnergyPlatform/ontology/pull/1024

power plant
type: Class
equivalent class: Class
  intersection of: energy transformation unit
  intersection of: Restriction
    on property: has part
    some values from: electricity grid component
  intersection of: Restriction
    on property: has part
    some values from: power generating unit
subclass of: energy transformation unit
subclass of: Restriction
  on property: has part
  some values from: electricity grid component
subclass of: Restriction
  on property: has part
  some values from: power generating unit
subclass of: Restriction
  on property: participates in
  some values from: OEO_00240014
definition: A power plant is an energy transformation unit consisting of power generating units and a grid component that feeds electric energy into an electric grid.
alternative label: Kraftwerk @de
term tracker annotation: issue: https://github.com/OpenEnergyPlatform/ontology/issues/173 pull request: https://github.com/OpenEnergyPlatform/ontology/pull/273 issue: https://github.com/OpenEnergyPlatform/ontology/issues/588 pull request: https://github.com/OpenEnergyPlatform/ontology/pull/594 issue: https://github.com/OpenEnergyPlatform/ontology/issues/372 pull request: https://github.com/OpenEnergyPlatform/ontology/pull/646 subclass of energy transformation unit pull request: https://github.com/OpenEnergyPlatform/ontology/pull/895 more precise axioms pull request: https://github.com/OpenEnergyPlatform/ontology/pull/1360 rework module structure issue: https://github.com/OpenEnergyPlatform/ontology/issues/1592 pull request: https://github.com/OpenEnergyPlatform/ontology/pull/1652

photovoltaic cell
type: Class
subclass of: generator
subclass of: Restriction
  on property: has part
  some values from: solar radiation receiving surface
subclass of: Restriction
  on property: has energy output
  some values from: electrical energy
definition: A photovoltaic cell (PV cell) is a generator that converts solar energy into electrical energy.
alternative label: PV cell
alternative label: Photovoltaikzelle @de
alternative label: Solarzelle @de
alternative label: solar cell
term tracker annotation: change produces axiom to 'has energy output' issue: https://github.com/OpenEnergyPlatform/ontology/issues/994 pull request: https://github.com/OpenEnergyPlatform/ontology/pull/1006 Add axiom to 'has part some solar radiation receiving surface' issue: https://github.com/OpenEnergyPlatform/ontology/issues/1074 pull request: https://github.com/OpenEnergyPlatform/ontology/pull/1228 Update definition, label and axioms, add alternative terms: issue: https://github.com/OpenEnergyPlatform/ontology/issues/1152 pull request: https://github.com/OpenEnergyPlatform/ontology/pull/1220

Axiom
annotated source: photovoltaic cell
annotated property: subClassOf
annotated target: Restriction
term tracker annotation: issue: https://github.com/OpenEnergyPlatform/ontology/issues/761 pull request: https://github.com/OpenEnergyPlatform/ontology/pull/782

Axiom
annotated source: photovoltaic cell
annotated property: subClassOf
annotated target: Restriction
term tracker annotation: issue: https://github.com/OpenEnergyPlatform/ontology/issues/761 pull request: https://github.com/OpenEnergyPlatform/ontology/pull/782

renewable fuel
type: Class
equivalent class: Class
  intersection of: fuel
  intersection of: Restriction
    on property: has disposition
    some values from: renewable energy carrier disposition
subclass of: fuel
subclass of: Restriction
  on property: has disposition
  some values from: combustible energy carrier disposition
definition: A renewable fuel is a fuel that has a renewable origin and an renewable energy carrier disposition
alternative label: erneuerbarer Brennstoff @de
term tracker annotation: issue: https://github.com/OpenEnergyPlatform/ontology/issues/741 pull request: https://github.com/OpenEnergyPlatform/ontology/pull/861

Axiom
annotated source: renewable fuel
annotated property: subClassOf
annotated target: fuel
term tracker annotation: Add `SubClass Of` axiom for `renevable fuel` issue: https://github.com/OpenEnergyPlatform/ontology/issues/1191 pull request: https://github.com/OpenEnergyPlatform/ontology/pull/1201

solar power unit
type: Class
subclass of: power generating unit
subclass of: Restriction
  on property: has function
  some values from: renewable energy transformation function
definition: A solar power unit is a power generating unit using solar power.
alternative label: Solarkraftwerksblock @de
term tracker annotation: Add function: issue: https://github.com/OpenEnergyPlatform/ontology/issues/1423 pull request: https://github.com/OpenEnergyPlatform/ontology/pull/1437

Axiom
annotated source: solar power unit
annotated property: subClassOf
annotated target: Restriction
term tracker annotation: issue: https://github.com/OpenEnergyPlatform/ontology/issues/761 pull request: https://github.com/OpenEnergyPlatform/ontology/pull/782 change uses energy axiom to 'has energy input': issue: https://github.com/OpenEnergyPlatform/ontology/issues/994 pull request: https://github.com/OpenEnergyPlatform/ontology/pull/1006

solar thermal power unit
type: Class
subclass of: solar power unit
subclass of: Restriction
  on property: has part
  some values from: solar thermal collector
definition: A solar thermal power unit is a solar power unit that has solar thermal collectors as parts.
term tracker annotation: change produces energy axiom to 'has energy output': issue: https://github.com/OpenEnergyPlatform/ontology/issues/994 pull request: https://github.com/OpenEnergyPlatform/ontology/pull/1006

Axiom
annotated source: solar thermal power unit
annotated property: subClassOf
annotated target: Restriction
term tracker annotation: issue: https://github.com/OpenEnergyPlatform/ontology/issues/761 pull request: https://github.com/OpenEnergyPlatform/ontology/pull/782

solid biomass power plant
type: Class
subclass of: biofuel power plant
subclass of: Restriction
  on property: has part
  some values from: solid biomass power unit
definition: A solid biomass power plant is a biofuel power plant that has solid biomass power units as parts.
term tracker annotation: issue: https://github.com/OpenEnergyPlatform/ontology/issues/750 pull request: https://github.com/OpenEnergyPlatform/ontology/pull/752

solid biomass power unit
type: Class
subclass of: biofuel power unit
subclass of: Restriction
  on property: uses
  some values from: solid biofuel
definition: A solid biomass power unit is a biomass power unit using solid biomass as fuel.

sulphur hexafluoride
type: Class
subclass of: portion of matter
subclass of: Restriction
  on property: has origin
  some values from: anthropogenic
subclass of: Restriction
  on property: has normal state of matter
  has value: OEO_00000182
definition: Sulphur hexafluoride is a portion of matter with the chemical formula SF6. It has a gaseous normal state of matter. It can work as a potent greenhouse gas and has an anthropogenic origin.
alternative label: SF6
alternative label: Schwefelhexafluorid @de
alternative label: sulfur hexafluoride

thermal energy storage function
type: Class
subclass of: energy storage function
definition: A thermal energy storage function is an energy storage function with thermal energy as input and output.
term tracker annotation: Improve definition and label: issue: https://github.com/OpenEnergyPlatform/ontology/issues/1262 pull request: https://github.com/OpenEnergyPlatform/ontology/pull/1348

uranium
type: Class
subclass of: portion of matter
subclass of: Restriction
  on property: has role
  some values from: fuel role
subclass of: Restriction
  on property: has disposition
  some values from: nuclear energy carrier disposition
subclass of: Restriction
  on property: has origin
  some values from: geogenic
subclass of: Restriction
  on property: has normal state of matter
  has value: OEO_00000390
definition: Uranium is a portion of matter that has the atomic number 92. It is a silver-grey metal.
alternative label: Uran @de
may be identical to: http://purl.obolibrary.org/obo/CHEBI_33499
term tracker annotation: issue: https://github.com/OpenEnergyPlatform/ontology/issues/182 pull request: https://github.com/OpenEnergyPlatform/ontology/pull/237

Axiom
annotated source: uranium
annotated property: may be identical to
annotated target: http://purl.obolibrary.org/obo/CHEBI_33499
term tracker annotation: issue: https://github.com/OpenEnergyPlatform/ontology/issues/636 pull request: https://github.com/OpenEnergyPlatform/ontology/pull/810

waste power unit
type: Class
subclass of: power generating unit
subclass of: Restriction
subclass of: Restriction
  on property: has part
  some values from: steam turbine
subclass of: Restriction
  on property: uses
  some values from: waste fuel
definition: A waste power unit is a power generating unit using waste as fuel.
alternative label: Müllkraftwerksblock @de
term tracker annotation: issue: https://github.com/OpenEnergyPlatform/ontology/issues/750 pull request: https://github.com/OpenEnergyPlatform/ontology/pull/752

Axiom
annotated source: waste power unit
annotated property: subClassOf
annotated target: Restriction
term tracker annotation: issue: https://github.com/OpenEnergyPlatform/ontology/issues/636 pull request: https://github.com/OpenEnergyPlatform/ontology/pull/810

waste role
type: Class
subclass of: role
subclass of: Restriction
  on property: characteristic of
  some values from: material entity
definition: A waste role is a role of a material entity that has been discarded after primary use.
term tracker annotation: issue: https://github.com/OpenEnergyPlatform/ontology/issues/132 pull request: https://github.com/OpenEnergyPlatform/ontology/pull/207 add 'has bearer' axiom issue: https://github.com/OpenEnergyPlatform/ontology/issues/1305 pull request: https://github.com/OpenEnergyPlatform/ontology/pull/1310 changed bearer to material entity issue: https://github.com/OpenEnergyPlatform/ontology/issues/1376 pull request: https://github.com/OpenEnergyPlatform/ontology/pull/1638 replaced 'has bearer' with 'characteristic of' issue: https://github.com/OpenEnergyPlatform/ontology/issues/1907 pull request: https://github.com/OpenEnergyPlatform/ontology/pull/1928

Axiom
annotated source: waste role
annotated property: closeMatch
annotated target: ENVO_01000665
term tracker annotation: issue: https://github.com/OpenEnergyPlatform/ontology/issues/636 pull request: https://github.com/OpenEnergyPlatform/ontology/pull/810 Convert to skos:closeMatch issue: https://github.com/OpenEnergyPlatform/ontology/issues/636 pull request: https://github.com/OpenEnergyPlatform/ontology/pull/1879

wind
type: Class
subclass of: process
subclass of: Restriction
  on property: has participant
  some values from: air
definition: Wind is a process of air naturally moving.
alternative label: Wind @de
term tracker annotation: issue: https://github.com/OpenEnergyPlatform/ontology/issues/211 pull request: https://github.com/OpenEnergyPlatform/ontology/pull/225

Axiom
annotated source: wind
annotated property: closeMatch
annotated target: ENVO_01000793
term tracker annotation: issue: https://github.com/OpenEnergyPlatform/ontology/issues/636 pull request: https://github.com/OpenEnergyPlatform/ontology/pull/810 Convert to skos:closeMatch issue: https://github.com/OpenEnergyPlatform/ontology/issues/636 pull request: https://github.com/OpenEnergyPlatform/ontology/pull/1879

wind energy converting unit
type: Class
subclass of: power generating unit
subclass of: Restriction
subclass of: Restriction
  on property: has part
  some values from: wind rotor
subclass of: Restriction
  on property: has function
  some values from: renewable energy transformation function
subclass of: Restriction
  on property: has quality
  some values from: rotor diameter
subclass of: Restriction
  on property: has quality
  some values from: hub height
definition: A wind energy converting unit is a power generating unit that uses wind energy.
alternative label: Windenergieanlage @de
alternative label: Windkraftanlage @de
alternative label: wind turbine
term tracker annotation: Issue: https://github.com/OpenEnergyPlatform/ontology/issues/753 Pull Request: https://github.com/OpenEnergyPlatform/ontology/pull/754 change uses energy axiom to 'has energy input': issue: https://github.com/OpenEnergyPlatform/ontology/issues/994 pull request: https://github.com/OpenEnergyPlatform/ontology/pull/1006 Add function: issue: https://github.com/OpenEnergyPlatform/ontology/issues/1423 pull request: https://github.com/OpenEnergyPlatform/ontology/pull/1437

Axiom
annotated source: wind energy converting unit
annotated property: subClassOf
annotated target: Restriction
term tracker annotation: issue: https://github.com/OpenEnergyPlatform/ontology/issues/636 pull request: https://github.com/OpenEnergyPlatform/ontology/pull/810

Axiom
annotated source: wind energy converting unit
annotated property: subClassOf
annotated target: Restriction
term tracker annotation: issue: https://github.com/OpenEnergyPlatform/ontology/issues/761 pull request: https://github.com/OpenEnergyPlatform/ontology/pull/782

producer
type: Class
subclass of: agent
subclass of: Restriction
  on property: participates in
  some values from: OEO_00240003
definition: A producer is an agent that makes goods.
alternative label: Produzent @de
alternative label: Produzentin @de
term tracker annotation: issue: https://github.com/OpenEnergyPlatform/ontology/issues/835 pull request: https://github.com/OpenEnergyPlatform/ontology/pull/845 issue: https://github.com/OpenEnergyPlatform/ontology/issues/314 pull request: https://github.com/OpenEnergyPlatform/ontology/pull/370 move axiom to shared-axioms issue: https://github.com/OpenEnergyPlatform/ontology/issues/1703 pull request: https://github.com/OpenEnergyPlatform/ontology/pull/1706

AC-line
type: Class
subclass of: power line
disjoint with: HVDC-line
definition: An AC-line is a powerline for transferring high voltage alternating current.
alternative label: Wechselstromleitung @de
comment: undirected
term tracker annotation: issue: https://github.com/OpenEnergyPlatform/ontology/issues/231 pull request: https://github.com/OpenEnergyPlatform/ontology/pull/385

acronym
type: Class
subclass of: abbreviation
definition: An acronym is an abbreviation of the title by using the first letters of each part of the title.
alternative label: Akronym @de
term tracker annotation: make subclass of abbreviation: issue: https://github.com/OpenEnergyPlatform/ontology/issues/1039 pull request: https://github.com/OpenEnergyPlatform/ontology/pull/1075

agent
type: Class
subclass of: role
subclass of: Restriction
  on property: characteristic of
  some values from: Class
    union of: person
    union of: organisation
definition: Agent is a role of a person or organisation that directs its activity towards achieving goals.
alternative label: Agent @de
alternative label: Agentin @de
term tracker annotation: issue:https://github.com/OpenEnergyPlatform/ontology/issues/148 pull request: https://github.com/OpenEnergyPlatform/ontology/pull/210 add 'has bearer' axiom issue: https://github.com/OpenEnergyPlatform/ontology/issues/1305 pull request: https://github.com/OpenEnergyPlatform/ontology/pull/1310 replaced 'has bearer' with 'characteristic of' issue: https://github.com/OpenEnergyPlatform/ontology/issues/1907 pull request: https://github.com/OpenEnergyPlatform/ontology/pull/1928

air
type: Class
subclass of: gas mixture
subclass of: Restriction
  on property: has quality
  some values from: wind energy
subclass of: Restriction
  on property: has disposition
  some values from: primary energy carrier disposition
subclass of: Restriction
  on property: has normal state of matter
  has value: OEO_00000182
definition: Air is a gas mixture that forms the Earth's atmosphere.
alternative label: Luft @de
definition source: https://en.wikipedia.org/wiki/Air_(disambiguation)
term tracker annotation: add origin issue: https://github.com/OpenEnergyPlatform/ontology/issues/515 pull request: https://github.com/OpenEnergyPlatform/ontology/pull/684 remove origin pull request: https://github.com/OpenEnergyPlatform/ontology/pull/861 make subclass of gas mixture and improve definition: issue: https://github.com/OpenEnergyPlatform/ontology/issues/988 pull request: https://github.com/OpenEnergyPlatform/ontology/pull/1009 remove axiom 'is used by' some 'energy storage unit' issue: https://github.com/OpenEnergyPlatform/ontology/issues/1495 pull request: https://github.com/OpenEnergyPlatform/ontology/pull/1499 added axiom 'has disposition' some 'primary energy carrier disposition' issue: https://github.com/OpenEnergyPlatform/ontology/issues/1032 pull request: https://github.com/OpenEnergyPlatform/ontology/pull/2095

Axiom
annotated source: air
annotated property: closeMatch
annotated target: ENVO_00002005
term tracker annotation: issue: https://github.com/OpenEnergyPlatform/ontology/issues/636 pull request: https://github.com/OpenEnergyPlatform/ontology/pull/810 Convert to skos:closeMatch issue: https://github.com/OpenEnergyPlatform/ontology/issues/636 pull request: https://github.com/OpenEnergyPlatform/ontology/pull/1879

air pollution
type: Class
subclass of: pollution
subclass of: Restriction
  on property: has participant
  some values from: air pollutant
definition: Air pollution occurs when harmful or excessive quantities of substances including gases, particles, and biological molecules are introduced into Earth's atmosphere.
alternative label: Luftverschmutzung @de
definition source: https://en.wikipedia.org/w/index.php
term tracker annotation: issue: https://github.com/OpenEnergyPlatform/ontology/issues/406 pull request: https://github.com/OpenEnergyPlatform/ontology/pull/410

Axiom
annotated source: air pollution
annotated property: closeMatch
annotated target: ENVO_02500037
term tracker annotation: issue: https://github.com/OpenEnergyPlatform/ontology/issues/636 pull request: https://github.com/OpenEnergyPlatform/ontology/pull/810 Convert to skos:closeMatch issue: https://github.com/OpenEnergyPlatform/ontology/issues/636 pull request: https://github.com/OpenEnergyPlatform/ontology/pull/1879

ambient thermal energy
type: Class
subclass of: thermal energy
definition: Ambient thermal energy is thermal energy that is stored in the ambient air, beneath the surface of solid earth or in surface water. It is captured by heat pumps.
alternative label: Umgebungswärme @de
term tracker annotation: issue: https://github.com/OpenEnergyPlatform/ontology/issues/728 pull request: https://github.com/OpenEnergyPlatform/ontology/pull/742

anthracite
type: Class
subclass of: hard coal
definition: Anthracite is a hard coal with a high caloric value due to its high carbon content (about 90 % fixed carbon).
alternative label: Anthrazit @de
definition source: REGULATION (EC) No 1099/2008 OF THE EUROPEAN PARLIAMENT AND OF THE COUNCIL of 22 October 2008 on energy statistics https://eur-lex.europa.eu/legal-content/EN/TXT/HTML/?uri=CELEX:32008R1099&from=EN
comment: Its gross calorific value is greater than 23 865 kJ/kg (5 700 kcal/kg) on an ash-free but moist basis.

Axiom
annotated source: anthracite
annotated property: closeMatch
annotated target: ENVO_2000011
term tracker annotation: issue: https://github.com/OpenEnergyPlatform/ontology/issues/636 pull request: https://github.com/OpenEnergyPlatform/ontology/pull/810 Convert to skos:closeMatch issue: https://github.com/OpenEnergyPlatform/ontology/issues/636 pull request: https://github.com/OpenEnergyPlatform/ontology/pull/1879

application programming interface
type: Class
subclass of: software interface
disjoint with: graphical user interface
definition: An application programming interface (API) is a software interface allowing two software applications to communicate with each other.
alternative label: API
alternative label: Programmierschnittstelle @de
term tracker annotation: Change label: issue: https://github.com/OpenEnergyPlatform/ontology/issues/1804 pull request: https://github.com/OpenEnergyPlatform/ontology/pull/1810

artificial object
type: Class
subclass of: object
subclass of: Restriction
  on property: functionally related to
  some values from: space requirement
definition: An artificial object is an object that was deliberately manufactured by humans to address a particular purpose.
alternative label: Artefakt @de
alternative label: künstliches Objekt @de
term tracker annotation: issue: https://github.com/OpenEnergyPlatform/ontology/issues/86 pull requests: https://github.com/OpenEnergyPlatform/ontology/pull/121 (artificial object definition) subclasses https://github.com/OpenEnergyPlatform/ontology/pull/128 relation to space requirement https://github.com/OpenEnergyPlatform/ontology/pull/933 rework module structure issue: https://github.com/OpenEnergyPlatform/ontology/issues/1592 pull request: https://github.com/OpenEnergyPlatform/ontology/pull/1652

associated gas
type: Class
subclass of: natural gas
definition: Associated gas is a natural gas that is a byproduct from crude oil exploitation.
alternative label: Begleitgas @de
definition source: REGULATION (EC) No 1099/2008 OF THE EUROPEAN PARLIAMENT AND OF THE COUNCIL of 22 October 2008 on energy statistics https://eur-lex.europa.eu/legal-content/EN/TXT/HTML/?uri=CELEX:32008R1099&from=EN

assumption
type: Class
subclass of: information content entity
subclass of: Restriction
  on property: part of
  some values from: scenario
definition: An assumption is an information content entity about a property of a system or process. It determines a part of a scenario content.
alternative label: Annahme @de
term tracker annotation: issue: https://github.com/OpenEnergyPlatform/ontology/issues/353 pull request: https://github.com/OpenEnergyPlatform/ontology/pull/525

author
type: Class
subclass of: agent
definition: An author is an agent that creates or has created written work.
alternative label: Autor @de
alternative label: Autorin @de

aviation gasoline
type: Class
subclass of: gasoline
subclass of: Restriction
  on property: physical output of
  some values from: mineral oil refining process
definition: Aviation gasoline is gasoline used as motor spirit and prepared especially for aviation piston engines, with an octane number suited to the engine, a freezing point of -60 °C and a distillation range usually within the limits of 30 °C and 180 °C.
editor note: The term gasoline was chosen as this term is more often used in energy modelling and energy statistics. This is a deliberate deviation from the convention of British English spelling in the OEO.
alternative label: Flugzeugbenzin @de
definition source: REGULATION (EC) No 1099/2008 OF THE EUROPEAN PARLIAMENT AND OF THE COUNCIL of 22 October 2008 on energy statistics https://eur-lex.europa.eu/legal-content/EN/TXT/HTML/?uri=CELEX:32008R1099&from=EN
term tracker annotation: Add 'physical output of' axiom: issue: https://github.com/OpenEnergyPlatform/ontology/issues/1318 pull request: https://github.com/OpenEnergyPlatform/ontology/pull/1331

Axiom
annotated source: aviation gasoline
annotated property: editor note
annotated target: The term gasoline was chosen as this term is more often used in energy modelling and energy statistics. This is a deliberate deviation from the convention of British English spelling in the OEO.
term tracker annotation: https://github.com/OpenEnergyPlatform/ontology/issues/1028 https://github.com/OpenEnergyPlatform/ontology/pull/1037

battery
type: Class
subclass of: energy storage object
subclass of: Restriction
  on property: participates in
  some values from: electrochemical reaction
subclass of: Restriction
  on property: has function
  some values from: electrical energy storage function
subclass of: Restriction
  on property: has energy input
  some values from: electrical energy
subclass of: Restriction
  on property: has energy output
  some values from: electrical energy
definition: A battery is an energy storage object using different chemical or physical reactions to store energy.
alternative label: Akku @de
alternative label: Batterie @de
term tracker annotation: issue: https://github.com/OpenEnergyPlatform/ontology/issues/773 pull request: https://github.com/OpenEnergyPlatform/ontology/pull/801

biodiesel
type: Class
subclass of: portion of matter
subclass of: Restriction
  on property: has role
  some values from: diesel fuel role
subclass of: Restriction
  on property: has disposition
  some values from: combustible energy carrier disposition
subclass of: Restriction
  on property: has origin
  some values from: biogenic
subclass of: Restriction
  on property: has normal state of matter
  has value: OEO_00000256
definition: Biodiesel is a portion of matter that has a liquid state of matter and has a diesel fuel role. It is produced from plants or animals and thus has a biogenic origin.
alternative label: Biodiesel @de
term tracker annotation: redefine and change axiom: issue: https://github.com/OpenEnergyPlatform/ontology/issues/960 pull request: https://github.com/OpenEnergyPlatform/ontology/pull/1027

biofuel
type: Class
equivalent class: Class
  intersection of: combustion fuel
  intersection of: Restriction
    on property: has origin
    some values from: biogenic
subclass of: combustion fuel
subclass of: Restriction
  on property: has disposition
  some values from: combustible energy carrier disposition
subclass of: Restriction
  on property: has disposition
  some values from: primary energy carrier disposition
subclass of: Restriction
  on property: has origin
  some values from: biogenic
definition: A biofuel is a combustion fuel that has a biogenic origin.
alternative label: biogener Brennstoff @de
alternative label: biogenic combustion fuel
term tracker annotation: issue: https://github.com/OpenEnergyPlatform/ontology/issues/396 pull request: https://github.com/OpenEnergyPlatform/ontology/pull/400 remove origin pull request: https://github.com/OpenEnergyPlatform/ontology/pull/861 redefine: issue: https://github.com/OpenEnergyPlatform/ontology/issues/872 pull request: https://github.com/OpenEnergyPlatform/ontology/pull/952 fix subclassof: pull request: https://github.com/OpenEnergyPlatform/ontology/pull/965 alternative term and disjoint: https://github.com/OpenEnergyPlatform/ontology/issues/872 https://github.com/OpenEnergyPlatform/ontology/pull/1048 delete 'renewable energy carrier disposition': issue: https://github.com/OpenEnergyPlatform/ontology/issues/872 pull request: https://github.com/OpenEnergyPlatform/ontology/pull/1409 added axiom 'has disposition' some 'primary energy carrier disposition' issue: https://github.com/OpenEnergyPlatform/ontology/issues/1032 pull request: https://github.com/OpenEnergyPlatform/ontology/pull/2095

biofuel power plant
type: Class
subclass of: power plant
subclass of: Restriction
  on property: has part
  some values from: biofuel power unit
definition: A biofuel power plant is a power plant that has biofuel power units as parts.
term tracker annotation: issue: https://github.com/OpenEnergyPlatform/ontology/issues/750 pull request: https://github.com/OpenEnergyPlatform/ontology/pull/752

biogas
type: Class
subclass of: gas mixture
subclass of: Class
  intersection of: Restriction
    on property: has part
    some values from: carbon dioxide
  intersection of: Restriction
    on property: has part
    some values from: methane
subclass of: Restriction
  on property: has role
  some values from: fuel role
subclass of: Restriction
  on property: has disposition
  some values from: combustible energy carrier disposition
subclass of: Restriction
  on property: has origin
  some values from: biogenic
subclass of: Restriction
  on property: has normal state of matter
  has value: OEO_00000182
definition: Biogas is a gas mixture produced by anaerobic digestion. It consists mainly of methane and carbon dioxide and can be used as fuel.
alternative label: Biogas @de
term tracker annotation: issue: https://github.com/OpenEnergyPlatform/ontology/issues/872 pull request: https://github.com/OpenEnergyPlatform/ontology/pull/952 improve definition and make subclass of gas mixture: issue: https://github.com/OpenEnergyPlatform/ontology/issues/988 pull request: https://github.com/OpenEnergyPlatform/ontology/pull/1009

Axiom
annotated source: biogas
annotated property: closeMatch
annotated target: ENVO_01000556
term tracker annotation: issue: https://github.com/OpenEnergyPlatform/ontology/issues/636 pull request: https://github.com/OpenEnergyPlatform/ontology/pull/810 Convert to skos:closeMatch issue: https://github.com/OpenEnergyPlatform/ontology/issues/636 pull request: https://github.com/OpenEnergyPlatform/ontology/pull/1879

biogasoline
type: Class
subclass of: portion of matter
subclass of: Restriction
  on property: has part
  some values from: ethanol
subclass of: Restriction
  on property: has role
  some values from: gasoline fuel role
subclass of: Restriction
  on property: has disposition
  some values from: combustible energy carrier disposition
subclass of: Restriction
  on property: has origin
  some values from: biogenic
subclass of: Restriction
  on property: has normal state of matter
  has value: OEO_00000256
definition: Biogasoline is a portion of matter that has a liquid state of matter and has a gasoline fuel role. It consists of bioethanol, biomethanol and products of these two substances. It is made from vegetable or animal material and thus has a biogenic origin.
editor note: The term gasoline was chosen as this term is more often used in energy modelling and energy statistics. This is a deliberate deviation from the convention of British English spelling in the OEO.
alternative label: bioethanol
comment: biopetrol
term tracker annotation: issue: https://github.com/OpenEnergyPlatform/ontology/issues/439 pull request: https://github.com/OpenEnergyPlatform/ontology/pull/445 redefine and change axiom: issue: https://github.com/OpenEnergyPlatform/ontology/issues/960 pull request: https://github.com/OpenEnergyPlatform/ontology/pull/1027 add editor note: issue: https://github.com/OpenEnergyPlatform/ontology/issues/1028 pull request: https://github.com/OpenEnergyPlatform/ontology/pull/1037

blast furnace gas
type: Class
subclass of: manufactured coal based gas
definition: Blast furnace gas is manufactured coal based gas produced during the combustion of coke in blast furnaces in the iron and steel industry. It is recovered and used as a fuel partly within the plant and partly in other steel industry processes or in power stations equipped to burn it. The quantity of fuel should be reported on a gross calorific value basis.
alternative label: Gichtgas @de
alternative label: Hochofengas @de
definition source: REGULATION (EC) No 1099/2008 OF THE EUROPEAN PARLIAMENT AND OF THE COUNCIL of 22 October 2008 on energy statistics https://eur-lex.europa.eu/legal-content/EN/TXT/HTML/?uri=CELEX:32008R1099&from=EN

boolean variable
type: Class
subclass of: variable
subclass of: Restriction
  on property: is about
  some values from: boolean value
disjoint with: OEO_00240004
definition: A boolean variable is a variable that represents a boolean value.
alternative label: boolsche Variable @de
term tracker annotation: definition: issue: https://github.com/OpenEnergyPlatform/ontology/issues/1148 pull request: https://github.com/OpenEnergyPlatform/ontology/pull/1255

charcoal
type: Class
subclass of: portion of matter
subclass of: Restriction
  on property: has role
  some values from: fuel role
subclass of: Restriction
  on property: has disposition
  some values from: combustible energy carrier disposition
subclass of: Restriction
  on property: has disposition
  some values from: secondary energy carrier disposition
subclass of: Restriction
  on property: has origin
  some values from: biogenic
subclass of: Restriction
  on property: has normal state of matter
  has value: OEO_00000390
definition: Charcoal is a portion of matter produced from wood via pyrolysis. It has a solid state of matter and can be used as fuel.
alternative label: Holzkohle @de
term tracker annotation: issue:https://github.com/OpenEnergyPlatform/ontology/issues/872 pull request: https://github.com/OpenEnergyPlatform/ontology/pull/952 add axiom to secondary energy carrier disposition issue:https://github.com/OpenEnergyPlatform/ontology/issues/1222 pull request: https://github.com/OpenEnergyPlatform/ontology/pull/1243

Axiom
annotated source: charcoal
annotated property: closeMatch
annotated target: ENVO_01000560
term tracker annotation: issue: https://github.com/OpenEnergyPlatform/ontology/issues/636 pull request: https://github.com/OpenEnergyPlatform/ontology/pull/810 Convert to skos:closeMatch issue: https://github.com/OpenEnergyPlatform/ontology/issues/636 pull request: https://github.com/OpenEnergyPlatform/ontology/pull/1879

citation reference
type: Class
subclass of: reference
definition: A citation reference is a reference stating where a citation was taken from.
alternative label: Quellenverweis @de

client
type: Class
subclass of: agent
definition: A client is an agent that receives a product or service.
alternative label: Kunde @de
alternative label: Kundin @de
term tracker annotation: rework module structure issue: https://github.com/OpenEnergyPlatform/ontology/issues/1592 pull request: https://github.com/OpenEnergyPlatform/ontology/pull/1652

coal
type: Class
subclass of: portion of matter
subclass of: Restriction
  on property: has role
  some values from: fuel role
subclass of: Restriction
  on property: has disposition
  some values from: combustible energy carrier disposition
subclass of: Restriction
  on property: has origin
  some values from: fossil
subclass of: Restriction
  on property: has normal state of matter
  has value: OEO_00000390
definition: Coal is a portion of matter consisting of combustible black or brownish-black sedimentary rock, formed as rock strata called coal seams.
alternative label: Kohle @de
definition source: https://en.wikipedia.org/w/index.php
comment: Coal is mostly carbon with variable amounts of other elements; chiefly hydrogen, sulphur, oxygen, and nitrogen. Coal is formed if dead plant matter decays into peat and over millions of years the heat and pressure of deep burial converts the peat into coal.

Axiom
annotated source: coal
annotated property: subClassOf
annotated target: Restriction
term tracker annotation: issue: https://github.com/OpenEnergyPlatform/ontology/issues/1032 pull request: https://github.com/OpenEnergyPlatform/ontology/pull/1033

Axiom
annotated source: coal
annotated property: closeMatch
annotated target: ENVO_02000091
term tracker annotation: issue: https://github.com/OpenEnergyPlatform/ontology/issues/636 pull request: https://github.com/OpenEnergyPlatform/ontology/pull/810 Convert to skos:closeMatch issue: https://github.com/OpenEnergyPlatform/ontology/issues/636 pull request: https://github.com/OpenEnergyPlatform/ontology/pull/1879

coal power plant
type: Class
subclass of: power plant
subclass of: Restriction
  on property: has part
  some values from: coal power unit
definition: A coal power plant is a power plant that has coal power units as parts.
alternative label: Kohlekraftwerk @de
term tracker annotation: issue: https://github.com/OpenEnergyPlatform/ontology/issues/750 pull request: https://github.com/OpenEnergyPlatform/ontology/pull/752

Axiom
annotated source: coal power plant
annotated property: closeMatch
annotated target: ENVO_2000038
term tracker annotation: issue: https://github.com/OpenEnergyPlatform/ontology/issues/636 pull request: https://github.com/OpenEnergyPlatform/ontology/pull/810 Convert to skos:closeMatch issue: https://github.com/OpenEnergyPlatform/ontology/issues/636 pull request: https://github.com/OpenEnergyPlatform/ontology/pull/1879

code documentation
type: Class
subclass of: software documentation
definition: A code documentation is a documentation explaining and annotating software code.

code source
type: Class
subclass of: data descriptor
definition: A code source is a data descriptor describing the origin of some code.

coke oven gas
type: Class
subclass of: manufactured coal based gas
definition: Coke oven gas is manufactured coal based gas obtained as a by-product of the manufacture of coke oven coke for the production of iron and steel.
alternative label: Kokereigas @de
definition source: REGULATION (EC) No 1099/2008 OF THE EUROPEAN PARLIAMENT AND OF THE COUNCIL of 22 October 2008 on energy statistics https://eur-lex.europa.eu/legal-content/EN/TXT/HTML/?uri=CELEX:32008R1099&from=EN

coking coal
type: Class
subclass of: hard coal
definition: Coking coal is hard coal that is bituminous with a quality that allows the production of a coke suitable to support a blast furnace charge. Its gross calorific value is greater than 23 865 kJ/kg (5 700 kcal/kg) on an ash-free but moist basis.
alternative label: Kokskohle @de
definition source: REGULATION (EC) No 1099/2008 OF THE EUROPEAN PARLIAMENT AND OF THE COUNCIL of 22 October 2008 on energy statistics https://eur-lex.europa.eu/legal-content/EN/TXT/HTML/?uri=CELEX:32008R1099&from=EN

colliery gas
type: Class
subclass of: natural gas
definition: Colliery gas is natural gas found in coal mines (British English: colliery). The main component is methane. Synonyms are firedamp, mine gas. It is used as a fossil fuel.
alternative label: Grubengas @de
alternative label: firedamp
alternative label: mine gas
term tracker annotation: Add alternative labels: pull request: https://github.com/OpenEnergyPlatform/ontology/pull/1406

combustible energy carrier disposition
type: Class
subclass of: energy carrier disposition
subclass of: Restriction
  on property: realized in
  some values from: chemical reaction
definition: A combustible energy carrier is an energy carrier that releases energy from a material entity in form of heat or work, by chemical reaction with other substances.
term tracker annotation: Add 'realized in' axiom: issue: https://github.com/OpenEnergyPlatform/ontology/issues/1320 pull request: https://github.com/OpenEnergyPlatform/ontology/pull/1353 move to oeo-shared: issue: https://github.com/OpenEnergyPlatform/ontology/issues/1384 pull request: https://github.com/OpenEnergyPlatform/ontology/pull/1390 rework module structure issue: https://github.com/OpenEnergyPlatform/ontology/issues/1592 pull request: https://github.com/OpenEnergyPlatform/ontology/pull/1652

combustion fuel
type: Class
equivalent class: Class
  intersection of: fuel
  intersection of: Restriction
    on property: has disposition
    some values from: combustible energy carrier disposition
subclass of: fuel
definition: A combustion fuel is a fuel that realises its fuel role in processes that release energy in the form of heat or work by chemical reaction with other substances.
term tracker annotation: issue: https://github.com/OpenEnergyPlatform/ontology/issues/182 pull request: https://github.com/OpenEnergyPlatform/ontology/pull/237 Update definition: https://github.com/OpenEnergyPlatform/ontology/pull/931 move to oeo-shared: issue: https://github.com/OpenEnergyPlatform/ontology/issues/1384 pull request: https://github.com/OpenEnergyPlatform/ontology/pull/1390 rework module structure issue: https://github.com/OpenEnergyPlatform/ontology/issues/1592 pull request: https://github.com/OpenEnergyPlatform/ontology/pull/1652

compressed air
type: Class
subclass of: air
subclass of: Restriction
  on property: has disposition
  some values from: secondary energy carrier disposition
definition: Compressed air is air that has been compressed to store energy. To discharge energy, the air is expanded.
alternative label: verdichtete Luft @de
term tracker annotation: add axiom to secondary energy carrier disposition issue:https://github.com/OpenEnergyPlatform/ontology/issues/1222 pull request: https://github.com/OpenEnergyPlatform/ontology/pull/1243

constraint
type: Class
subclass of: information content entity
example of usage: "The carbon dioxide emissions in Germany have to be reduced by 95% till 2050." is a constraint for a model calculation about the energy system.
definition: A constraint is a condition that has to be fulfilled within a calculation.
alternative label: Nebenbedingung @de

consumer
type: Class
subclass of: user
definition: A consumer is a user of a commercial product or service.
alternative label: Verbraucher @de
alternative label: Verbraucherin @de

contact person
type: Class
subclass of: agent
definition: A contact person is an agent that can be contacted for help or information about a specific service or good.
alternative label: Kontaktperson @de
term tracker annotation: rework module structure issue: https://github.com/OpenEnergyPlatform/ontology/issues/1592 pull request: https://github.com/OpenEnergyPlatform/ontology/pull/1652

crude oil
type: Class
subclass of: portion of matter
subclass of: Restriction
  on property: has part
  some values from: hydrocarbon
subclass of: Restriction
  on property: has role
  some values from: fuel role
subclass of: Restriction
  on property: has disposition
  some values from: combustible energy carrier disposition
subclass of: Restriction
  on property: has origin
  some values from: fossil
subclass of: Restriction
  on property: has normal state of matter
  has value: OEO_00000256
definition: Crude oil is a portion of mater of fossil origin comprising a mixture of hydrocarbons and associated impurities, such as sulphur. It exists in the liquid phase under normal surface temperature and pressure and its physical characteristics (density, viscosity, etc.) are highly variable. This category includes field or lease condensate recovered from associated and non-associated gas where it is commingled with the commercial crude oil stream.
alternative label: Rohöl @de
alternative label: petroleum
definition source: REGULATION (EC) No 1099/2008 OF THE EUROPEAN PARLIAMENT AND OF THE COUNCIL of 22 October 2008 on energy statistics https://eur-lex.europa.eu/legal-content/EN/TXT/HTML/?uri=CELEX:32008R1099&from=EN
term tracker annotation: make direct subclass of 'portion of matter' and preserve axioms from old class 'oil and petroleum products' issue: https://github.com/OpenEnergyPlatform/ontology/issues/811 https://github.com/OpenEnergyPlatform/ontology/pull/1024 Add petroleum as alternative label: issue: https://github.com/OpenEnergyPlatform/ontology/issues/1318 pull request: https://github.com/OpenEnergyPlatform/ontology/pull/1331 rework module structure issue: https://github.com/OpenEnergyPlatform/ontology/issues/1592 pull request: https://github.com/OpenEnergyPlatform/ontology/pull/1652

Axiom
annotated source: crude oil
annotated property: subClassOf
annotated target: Restriction
term tracker annotation: issue: https://github.com/OpenEnergyPlatform/ontology/issues/1032 pull request: https://github.com/OpenEnergyPlatform/ontology/pull/1033

dam
type: Class
subclass of: artificial object
subclass of: Restriction
  on property: is used by
  some values from: energy storage unit
definition: A dam is an artificial object that stops or restricts the flow of water or underground streams.
alternative label: Staudamm @de
term tracker annotation: issue: https://github.com/OpenEnergyPlatform/ontology/issues/681 pull request: https://github.com/OpenEnergyPlatform/ontology/pull/755

database
type: Class
subclass of: information content entity
subclass of: Restriction
  on property: has part
  some values from: data item
subclass of: Restriction
  on property: has licence
  some values from: data licence
definition: A database is an information content entity that stores data items and data sets.
alternative label: Datenbank @de
term tracker annotation: issue: https://github.com/OpenEnergyPlatform/ontology/issues/253 pull request: https://github.com/OpenEnergyPlatform/ontology/pull/272 Add 'has licence' axiom: issue: https://github.com/OpenEnergyPlatform/ontology/issues/1275 pull request: https://github.com/OpenEnergyPlatform/ontology/pull/1547

data descriptor
type: Class
subclass of: information content entity
definition: A data descriptor is an information content entity that contains additional information about some data.
alternative label: metadata
term tracker annotation: issue: https://github.com/OpenEnergyPlatform/ontology/issues/612 pull request: https://github.com/OpenEnergyPlatform/ontology/pull/724 move to oeo-shared issue: https://github.com/OpenEnergyPlatform/ontology/issues/1384 pull request: https://github.com/OpenEnergyPlatform/ontology/pull/1390 rework module structure issue: https://github.com/OpenEnergyPlatform/ontology/issues/1592 pull request: https://github.com/OpenEnergyPlatform/ontology/pull/1652 add alternative label "metadata" issue: https://github.com/OpenEnergyPlatform/ontology/issues/1548 pull request: https://github.com/OpenEnergyPlatform/ontology/pull/1775

data format
type: Class
subclass of: data descriptor
disjoint with: open source
definition: A data format is a data descriptor that specifies the structure in which the data item is encoded.
alternative label: Datenformat @de
term tracker annotation: issue: https://github.com/OpenEnergyPlatform/ontology/issues/1145 pull request: https://github.com/OpenEnergyPlatform/ontology/pull/1326

data postprocessing
type: Class
subclass of: data processing
definition: Data postprocessing is data processing that transforms the output of a model calculation into a form that is suitable for presentation.

data preprocessing
type: Class
subclass of: data processing
definition: Data preprocessing is data processing that transforms the input into a form that is useable for a model calculation.

data processing
type: Class
subclass of: transformation
subclass of: Restriction
  on property: has participant
  some values from: data item
alternative label: Datenverarbeitung @de
comment: data processing is a transformation in which a data item gets transformed.
term tracker annotation: issue: https://github.com/OpenEnergyPlatform/ontology/issues/252 pull request: https://github.com/OpenEnergyPlatform/ontology/pull/289

data processing software
type: Class
subclass of: software
definition: data processing software is software used in the context of data processing.
alternative label: Datenverarbeitungssoftware @de

HVDC-line
type: Class
subclass of: power line
definition: An HVDC-line is a powerline for transferring high voltage direct current.
alternative label: HGÜ-Leitung @de
alternative label: Hochspannungsgleichstromübertragungsleitung @de
comment: directed
term tracker annotation: issue: https://github.com/OpenEnergyPlatform/ontology/issues/231 pull request: https://github.com/OpenEnergyPlatform/ontology/pull/385

energy demand sector
type: Class
subclass of: sector
definition: An energy demand sector is a sector that covers energy consumers.
alternative label: Energienachfragesektor @de
alternative label: final energy sector
term tracker annotation: issue: https://github.com/OpenEnergyPlatform/ontology/issues/30 pull request: https://github.com/OpenEnergyPlatform/ontology/pull/484 move to oeo-sector issue: https://github.com/OpenEnergyPlatform/ontology/issues/1399 pull request: https://github.com/OpenEnergyPlatform/ontology/pull/1724

Axiom
annotated source: energy demand sector
annotated property: alternative label
annotated target: final energy sector
term tracker annotation: issue: https://github.com/OpenEnergyPlatform/ontology/issues/1014 pull request: https://github.com/OpenEnergyPlatform/ontology/pull/1015

grid transferred thermal energy
type: Class
subclass of: thermal energy
subclass of: Restriction
  on property: participates in
  some values from: grid-bound heating
definition: Grid transferred thermal energy is thermal energy that is transferred via the grid-bound heating process.
alternative label: derived heat
term tracker annotation: issue: https://github.com/OpenEnergyPlatform/ontology/issues/393 pull request: https://github.com/OpenEnergyPlatform/ontology/pull/770

fossil diesel fuel
type: Class
subclass of: gas diesel oil
subclass of: Restriction
  on property: has role
  some values from: diesel fuel role
subclass of: Restriction
  on property: physical output of
  some values from: mineral oil refining process
definition: Diesel fuel is gas diesel oil used on-road for diesel compression ignition (cars, trucks, etc.), usually of low sulphur content.
alternative label: fossiler Dieselkraftstoff @de
alternative label: transport diesel
definition source: REGULATION (EC) No 1099/2008 OF THE EUROPEAN PARLIAMENT AND OF THE COUNCIL of 22 October 2008 on energy statistics https://eur-lex.europa.eu/legal-content/EN/TXT/HTML/?uri=CELEX:32008R1099&from=EN
term tracker annotation: relabel and add axiom issue: https://github.com/OpenEnergyPlatform/ontology/issues/960 pull request: https://github.com/OpenEnergyPlatform/ontology/pull/1027 Add 'physical output of' axiom: issue: https://github.com/OpenEnergyPlatform/ontology/issues/1318 pull request: https://github.com/OpenEnergyPlatform/ontology/pull/1331

district heating
type: Class
subclass of: grid-bound heating
definition: District heating is a grid-bound heating transfer to residential or commercial buildings.
alternative label: Fernwärme @de
alternative label: district grid-bound heating
term tracker annotation: issue: https://github.com/OpenEnergyPlatform/ontology/issues/393 pull request: https://github.com/OpenEnergyPlatform/ontology/pull/770

DOI
type: Class
subclass of: symbol
definition: A DOI (digital object identifier) is a persistent identifier or handle used to uniquely identify objects, standardized by the International Organization for Standardization (ISO). source: https://en.wikipedia.org/wiki/Digital_object_identifier
alternative label: digital object identifier

electrical energy
type: Class
subclass of: energy
subclass of: Restriction
  on property: has role
  some values from: commodity role
subclass of: Restriction
  on property: is energy participant of
  some values from: electricity import
subclass of: Restriction
  on property: is energy participant of
  some values from: electricity export
definition: Electrical energy is a form of energy derived from the potential or kinetic energy of charged particles.
alternative label: Elektroenergie @de
alternative label: electricity
alternative label: elektrische Energie @de
definition source: https://en.wikipedia.org/wiki/Electrical_energy
term tracker annotation: definition of electrical energy: issue: https://github.com/OpenEnergyPlatform/ontology/issues/224 pull request: https://github.com/OpenEnergyPlatform/ontology/pull/524 alternative term electricity: issue: https://github.com/OpenEnergyPlatform/ontology/issues/381 pull request: https://github.com/OpenEnergyPlatform/ontology/pull/621 add commodity role: issue: https://github.com/OpenEnergyPlatform/ontology/issues/891 pull request: https://github.com/OpenEnergyPlatform/ontology/pull/1022 add axiom to electricity im/exports: issue: https://github.com/OpenEnergyPlatform/ontology/issues/998 pull request: https://github.com/OpenEnergyPlatform/ontology/pull/1221 move class to oeo-shared: issue: https://github.com/OpenEnergyPlatform/ontology/issues/1327 pull request: https://github.com/OpenEnergyPlatform/ontology/pull/1395 rework module structure issue: https://github.com/OpenEnergyPlatform/ontology/issues/1592 pull request: https://github.com/OpenEnergyPlatform/ontology/pull/1652

Axiom
annotated source: electrical energy
annotated property: closeMatch
annotated target: ENVO_2000020
term tracker annotation: issue: https://github.com/OpenEnergyPlatform/ontology/issues/636 pull request: https://github.com/OpenEnergyPlatform/ontology/pull/810 Convert to skos:closeMatch issue: https://github.com/OpenEnergyPlatform/ontology/issues/636 pull request: https://github.com/OpenEnergyPlatform/ontology/pull/1879

electricity grid
type: Class
subclass of: supply grid
subclass of: Restriction
  on property: part of
  some values from: OEO_00360017
subclass of: Restriction
  on property: has part
  some values from: electricity grid component
subclass of: Restriction
  on property: has part
  some values from: power line
definition: An electricity grid is a supply grid that transfers electrical energy / electricity.
alternative label: Stromnetz @de
oekg annotation: study descriptor
term tracker annotation: issue: https://github.com/OpenEnergyPlatform/ontology/issues/138 pull request: https://github.com/OpenEnergyPlatform/ontology/pull/165 Move to oeo-shared: https://github.com/OpenEnergyPlatform/ontology/pull/1360 updated part relation between electricity grid and power line to have simple restrictions: replace min 1 restriction by some restriction issue: https://github.com/OpenEnergyPlatform/ontology/issues/1430 pull request: https://github.com/OpenEnergyPlatform/ontology/pull/1479 rework module structure issue: https://github.com/OpenEnergyPlatform/ontology/issues/1592 pull request: https://github.com/OpenEnergyPlatform/ontology/pull/1652 add oekg annotation issue: https://github.com/OpenEnergyPlatform/ontology/issues/1529 pull request: https://github.com/OpenEnergyPlatform/ontology/pull/1897 Changed definition to use verb 'transfer' issue: https://github.com/OpenEnergyPlatform/ontology/issues/2044 pull request: https://github.com/OpenEnergyPlatform/ontology/pull/2073 Added 'part of' some 'power system' axiom issue: https://github.com/OpenEnergyPlatform/ontology/issues/1960 pull request: https://github.com/OpenEnergyPlatform/ontology/pull/2042

electricity grid component
type: Class
equivalent class: Class
  intersection of: grid component
  intersection of: Restriction
    on property: part of
    some values from: electricity grid
subclass of: grid component
subclass of: Restriction
  on property: is subject of
  some values from: OEO_00410068
definition: An electricity grid component is a grid component that is part of an electricity grid.
term tracker annotation: issue: https://github.com/OpenEnergyPlatform/ontology/issues/36 pull request: https://github.com/OpenEnergyPlatform/ontology/pull/385 Move to oeo-shared: https://github.com/OpenEnergyPlatform/ontology/pull/1360 rework module structure issue: https://github.com/OpenEnergyPlatform/ontology/issues/1592 pull request: https://github.com/OpenEnergyPlatform/ontology/pull/1652 added 'is subject of' some 'rated voltage' subclass axiom issue: https://github.com/OpenEnergyPlatform/ontology/issues/2107 pull request: https://github.com/OpenEnergyPlatform/ontology/pull/2108

electricity sector
type: Class
subclass of: energy transformation sector
subclass of: Restriction
  on property: is sector of
  some values from: OEO_00240014
definition: An electricity sector is a transformation sector that covers electricity generation and transport of electrical energy to consumers of electrical energy.
alternative label: Stromsektor @de
term tracker annotation: issue: https://github.com/OpenEnergyPlatform/ontology/issues/30 pull request: https://github.com/OpenEnergyPlatform/ontology/pull/484 move to oeo-sector issue: https://github.com/OpenEnergyPlatform/ontology/issues/1399 pull request: https://github.com/OpenEnergyPlatform/ontology/pull/1724 Add 'is sector of' axiom: issue: https://github.com/OpenEnergyPlatform/ontology/issues/1333 pull request: https://github.com/OpenEnergyPlatform/ontology/pull/1788

electric vehicle
type: Class
equivalent class: Class
  intersection of: vehicle
  intersection of: Restriction
    on property: has part
    some values from: electric traction motor
subclass of: vehicle
subclass of: Restriction
  on property: has energy input
  some values from: electrical energy
definition: An electric vehicle (abbreviated as EV) is a vehicle that uses one or more electric traction motors.
alternative label: EV
alternative label: Elektrofahrzeug @de
term tracker annotation: https://github.com/OpenEnergyPlatform/ontology/issues/425 pull request: https://github.com/OpenEnergyPlatform/ontology/pull/431 change uses energy axiom to 'has energy input': issue: https://github.com/OpenEnergyPlatform/ontology/issues/994 pull request: https://github.com/OpenEnergyPlatform/ontology/pull/1006 Adapt definition and convert to equivalent class: issue: https://github.com/OpenEnergyPlatform/ontology/issues/1311 pull request: https://github.com/OpenEnergyPlatform/ontology/pull/1315

emission
type: Class
subclass of: process
subclass of: Restriction
  on property: has process attribute
  some values from: emission factor
definition: emission is a process releasing by-products from human activity (e.g. production, distribution or consumption) into the environment.
alternative label: Emission @de
term tracker annotation: issue: https://github.com/OpenEnergyPlatform/ontology/issues/56 pull request: https://github.com/OpenEnergyPlatform/ontology/pull/234 moved to oeo-shared https://github.com/OpenEnergyPlatform/ontology/pull/956 rework module structure issue: https://github.com/OpenEnergyPlatform/ontology/issues/1592 pull request: https://github.com/OpenEnergyPlatform/ontology/pull/1652

emission factor
type: Class
subclass of: process attribute
subclass of: Restriction
  on property: process attribute of
  some values from: Class
    intersection of: process
    intersection of: Restriction
      on property: causally upstream of or within
      some values from: emission
definition: An emission factor is a process attribute that describes the correlation of emissions and the activity causing that emission.
alternative label: Emissionsfaktor @de
term tracker annotation: issue: https://github.com/OpenEnergyPlatform/ontology/issues/243 pull request: https://github.com/OpenEnergyPlatform/ontology/pull/581 moved to oeo-shared https://github.com/OpenEnergyPlatform/ontology/pull/956 rework module structure issue: https://github.com/OpenEnergyPlatform/ontology/issues/1592 pull request: https://github.com/OpenEnergyPlatform/ontology/pull/1652 restructuring emission rate and emission value issue: https://github.com/OpenEnergyPlatform/ontology/issues/1759 pull request: https://github.com/OpenEnergyPlatform/ontology/pull/1846

empirical data set
type: Class
subclass of: data set
disjoint with: synthetic data set
example of usage: The measurement series of some experiment.
definition: An empirical data set is a dataset that is obtained from observations in the real world.
alternative label: Empirischer Datensatz @de
term tracker annotation: Move to oeo-shared and harmonise label: https://github.com/OpenEnergyPlatform/ontology/pull/1463 rework module structure issue: https://github.com/OpenEnergyPlatform/ontology/issues/1592 pull request: https://github.com/OpenEnergyPlatform/ontology/pull/1652

energy
type: Class
subclass of: quality
subclass of: Restriction
  on property: characteristic of
  some values from: material entity
subclass of: Restriction
  on property: has origin
  some values from: origin
definition: Energy is a quality of material entities which manifests as a capacity to perform work (such as causing motion or the interaction of molecules)
alternative label: Energie @de
definition source: Derived from https://www.lexico.com/en/definition/energy
comment: Energy is power integrated over time.
term tracker annotation: issue: https://github.com/OpenEnergyPlatform/ontology/issues/224 pull request: https://github.com/OpenEnergyPlatform/ontology/pull/364 fix grammar error: pull request: https://github.com/OpenEnergyPlatform/ontology/pull/657 update definition issue: https://github.com/OpenEnergyPlatform/ontology/issues/660 pull request: https://github.com/OpenEnergyPlatform/ontology/pull/665 move to oeo-shared issue: https://github.com/OpenEnergyPlatform/ontology/issues/1030 pull request: https://github.com/OpenEnergyPlatform/ontology/pull/1101 adjust definition pull request: https://github.com/OpenEnergyPlatform/ontology/pull/1165 Axiomatise relations between origin, energy and portion of matter: issue: https://github.com/OpenEnergyPlatform/ontology/issues/1183 pull request: https://github.com/OpenEnergyPlatform/ontology/pull/1192 Add bearer: issue: https://github.com/OpenEnergyPlatform/ontology/issues/1305 pull request: https://github.com/OpenEnergyPlatform/ontology/pull/1485 rework module structure issue: https://github.com/OpenEnergyPlatform/ontology/issues/1592 pull request: https://github.com/OpenEnergyPlatform/ontology/pull/1652 replaced 'has bearer' with 'characteristic of' issue: https://github.com/OpenEnergyPlatform/ontology/issues/1907 pull request: https://github.com/OpenEnergyPlatform/ontology/pull/1928

Axiom
annotated source: energy
annotated property: closeMatch
annotated target: ENVO_2000015
term tracker annotation: issue: https://github.com/OpenEnergyPlatform/ontology/issues/636 pull request: https://github.com/OpenEnergyPlatform/ontology/pull/810 Convert to skos:closeMatch issue: https://github.com/OpenEnergyPlatform/ontology/issues/636 pull request: https://github.com/OpenEnergyPlatform/ontology/pull/1879

energy carrier disposition
type: Class
subclass of: disposition
subclass of: Restriction
  on property: realized in
  some values from: energy transformation
subclass of: Restriction
  on property: characteristic of
  some values from: material entity
definition: An energy carrier disposition is a disposition of an material entity that contains energy for conversion as usable energy.
term tracker annotation: issue: https://github.com/OpenEnergyPlatform/ontology/issues/209 pull request: https://github.com/OpenEnergyPlatform/ontology/pull/276 issue: https://github.com/OpenEnergyPlatform/ontology/issues/407 pull request: https://github.com/OpenEnergyPlatform/ontology/pull/627 move to oeo-shared pull request: https://github.com/OpenEnergyPlatform/ontology/pull/869 add has bearer axiom: issue: https://github.com/OpenEnergyPlatform/ontology/issues/1167 pull request: https://github.com/OpenEnergyPlatform/ontology/pull/1178 rework module structure issue: https://github.com/OpenEnergyPlatform/ontology/issues/1592 pull request: https://github.com/OpenEnergyPlatform/ontology/pull/1652 replaced 'has bearer' with 'characteristic of' issue: https://github.com/OpenEnergyPlatform/ontology/issues/1907 pull request: https://github.com/OpenEnergyPlatform/ontology/pull/1928

energy transformation sector
type: Class
subclass of: sector
definition: An energy transformation sector is a sector that covers energy production, energy transformation from primary to secondary energy and transport of energy to the demand sector.
alternative label: energy industry sector
alternative label: energy sector
term tracker annotation: issue: https://github.com/OpenEnergyPlatform/ontology/issues/30 pull request: https://github.com/OpenEnergyPlatform/ontology/pull/484 move to oeo-sector issue: https://github.com/OpenEnergyPlatform/ontology/issues/1399 pull request: https://github.com/OpenEnergyPlatform/ontology/pull/1724

energy storage object
type: Class
equivalent class: Class
  intersection of: artificial object
  intersection of: Restriction
    on property: has function
    some values from: energy storage function
subclass of: artificial object
subclass of: Restriction
  on property: has energy output
  some values from: waste thermal energy
definition: An energy storage object is an artificial object that has the function energy storage.
alternative label: Energiespeicher @de
term tracker annotation: issue: https://github.com/OpenEnergyPlatform/ontology/issues/209 pull request: https://github.com/OpenEnergyPlatform/ontology/pull/276 Make equivalent class: issue: https://github.com/OpenEnergyPlatform/ontology/issues/1262 pull request: https://github.com/OpenEnergyPlatform/ontology/pull/1348 issue: https://github.com/OpenEnergyPlatform/ontology/issues/1265 pull request: https://github.com/OpenEnergyPlatform/ontology/pull/1359

external optimiser
type: Class
subclass of: software
definition: An external optimiser is a software external to a model that computes an optimisation.
alternative label: external optimizer
alternative label: externer Optimierer @de

factsheet
type: Class
subclass of: document
subclass of: Restriction
  on property: has licence
  some values from: creative work licence
definition: A factsheet is a document that collects information about a specific topic in a structured way.
comment: this entity is general and not specific to the OEP factsheets.
term tracker annotation: issue: https://github.com/OpenEnergyPlatform/ontology/issues/250 pull request: https://github.com/OpenEnergyPlatform/ontology/pull/271 Add 'has licence' axiom: issue: https://github.com/OpenEnergyPlatform/ontology/issues/1275 pull request: https://github.com/OpenEnergyPlatform/ontology/pull/1547

field photovoltaic power plant
type: Class
subclass of: photovoltaic power plant
disjoint with: rooftop photovoltaic power plant
definition: A field photovoltaic power plant (also: solar farm, solar park) is a photovoltaic power plant that is installed out in the open on the ground.
alternative label: Freiflächen-PV-Anlage @de
alternative label: Freiflächenphotovoltaikanlage @de
alternative label: solar park

flow battery
type: Class
subclass of: battery
definition: A flow battery is a battery in which chemical energy is provided by two chemical components dissolved in liquids contained within the system and separated by a membrane.
alternative label: redox flow battery
definition source: https://en.wikipedia.org/w/index.php
comment: Ion exchange (accompanied by flow of electric current) occurs through the membrane while both liquids circulate in their own respective space.
term tracker annotation: Updated definition: issue: https://github.com/OpenEnergyPlatform/ontology/issues/1979 pull request: https://github.com/OpenEnergyPlatform/ontology/pull/2055 Created: issue: https://github.com/OpenEnergyPlatform/ontology/issues/773 pull request: https://github.com/OpenEnergyPlatform/ontology/pull/801

framework factsheet
type: Class
subclass of: factsheet
subclass of: Restriction
  on property: is about
  some values from: software framework
definition: A framework factsheet is a factsheet that contains information about a software framework.
term tracker annotation: issue: https://github.com/OpenEnergyPlatform/ontology/issues/414 pull request: https://github.com/OpenEnergyPlatform/ontology/pull/440 pull request: https://github.com/OpenEnergyPlatform/ontology/pull/584

fuel
type: Class
equivalent class: Class
  intersection of: Restriction
    on property: has role
    some values from: fuel role
  intersection of: Restriction
    on property: has disposition
    some values from: energy carrier disposition
subclass of: portion of matter
subclass of: Restriction
  on property: has role
  some values from: good role
definition: A fuel is a portion of matter that has the disposition to be an energy carrier and that has a fuel role.
alternative label: Brennstoff @de
term tracker annotation: issue: https://github.com/OpenEnergyPlatform/ontology/issues/227 pull request: https://github.com/OpenEnergyPlatform/ontology/pull/279 add role fuel commodity https://github.com/OpenEnergyPlatform/ontology/pull/748 shorten definition: issue: https://github.com/OpenEnergyPlatform/ontology/issues/1184 pull request: https://github.com/OpenEnergyPlatform/ontology/pull/1187 Add good role: issue: https://github.com/OpenEnergyPlatform/ontology/issues/1269 pull request: https://github.com/OpenEnergyPlatform/ontology/pull/1299 move to oeo-shared: issue: https://github.com/OpenEnergyPlatform/ontology/issues/1384 pull request: https://github.com/OpenEnergyPlatform/ontology/pull/1390 rework module structure issue: https://github.com/OpenEnergyPlatform/ontology/issues/1592 pull request: https://github.com/OpenEnergyPlatform/ontology/pull/1652

fueled power plant
type: Class
equivalent class: Restriction
  on property: has part
  some values from: fueled power unit
subclass of: power plant
subclass of: Restriction
  on property: participates in
  some values from: fuel-powered electricity generation process
definition: A fueled power plant is a power plant that has fueled power units as parts.
term tracker annotation: issue: https://github.com/OpenEnergyPlatform/ontology/issues/292 pull request: https://github.com/OpenEnergyPlatform/ontology/pull/306

fueled power unit
type: Class
equivalent class: Class
  intersection of: power generating unit
  intersection of: Restriction
    on property: uses
    some values from: fuel
subclass of: power generating unit
subclass of: Restriction
  on property: participates in
  some values from: fuel-powered electricity generation process
definition: A fueled power unit is a power generating unit that uses fuel.
term tracker annotation: issue: https://github.com/OpenEnergyPlatform/ontology/issues/292 pull request: https://github.com/OpenEnergyPlatform/ontology/pull/306

gas diesel oil
type: Class
subclass of: portion of matter
subclass of: Restriction
  on property: has part
  some values from: hydrocarbon
subclass of: Restriction
  on property: has role
  some values from: fuel role
subclass of: Restriction
  on property: has disposition
  some values from: combustible energy carrier disposition
subclass of: Restriction
  on property: has disposition
  some values from: secondary energy carrier disposition
subclass of: Restriction
  on property: has origin
  some values from: fossil
subclass of: Restriction
  on property: physical output of
  some values from: mineral oil refining process
subclass of: Restriction
  on property: has normal state of matter
  has value: OEO_00000256
definition: Gas/diesel oil is a portion of matter that is primarily a medium distillate distilling between 180 °C and 380 °C. Includes blending components. Several grades are available depending on uses.
alternative label: Gasöl @de
definition source: REGULATION (EC) No 1099/2008 OF THE EUROPEAN PARLIAMENT AND OF THE COUNCIL of 22 October 2008 on energy statistics https://eur-lex.europa.eu/legal-content/EN/TXT/HTML/?uri=CELEX:32008R1099&from=EN
term tracker annotation: make direct subclass of 'portion of matter' and preserve axioms from old class 'oil and petroleum products' issue: https://github.com/OpenEnergyPlatform/ontology/issues/811 https://github.com/OpenEnergyPlatform/ontology/pull/1024 add axiom to secondary energy carrier disposition issue:https://github.com/OpenEnergyPlatform/ontology/issues/1222 pull request: https://github.com/OpenEnergyPlatform/ontology/pull/1243 Add 'physical output of' axiom: issue: https://github.com/OpenEnergyPlatform/ontology/issues/1318 pull request: https://github.com/OpenEnergyPlatform/ontology/pull/1331

gasoline
type: Class
subclass of: portion of matter
subclass of: Restriction
  on property: has part
  some values from: hydrocarbon
subclass of: Restriction
  on property: has role
  some values from: gasoline fuel role
subclass of: Restriction
  on property: has disposition
  some values from: combustible energy carrier disposition
subclass of: Restriction
  on property: has disposition
  some values from: secondary energy carrier disposition
subclass of: Restriction
  on property: has origin
  some values from: fossil
subclass of: Restriction
  on property: physical output of
  some values from: mineral oil refining process
subclass of: Restriction
  on property: has normal state of matter
  has value: OEO_00000256
definition: Gasoline (American English) or petrol (British English) is a portion of matter in the form of a transparent petroleum-derived liquid that is used primarily as a fuel in spark-ignited internal combustion engines. It consists mostly of organic compounds obtained by the fractional distillation of petroleum, enhanced with a variety of additives.
definition: https://en.wikipedia.org/w/index.php
editor note: The term gasoline was chosen as this term is more often used in energy modelling and energy statistics. This is a deliberate deviation from the convention of British English spelling in the OEO.
alternative label: Benzin @de
alternative label: petrol
term tracker annotation: make direct subclass of 'portion of matter' and preserve axioms from old class 'oil and petroleum products' issue: https://github.com/OpenEnergyPlatform/ontology/issues/811 https://github.com/OpenEnergyPlatform/ontology/pull/1024 relabel and add axiom: issue: https://github.com/OpenEnergyPlatform/ontology/issues/960 pull request: https://github.com/OpenEnergyPlatform/ontology/pull/1027 add axiom to secondary energy carrier disposition issue:https://github.com/OpenEnergyPlatform/ontology/issues/1222 pull request: https://github.com/OpenEnergyPlatform/ontology/pull/1243 Add 'physical output of' axiom: issue: https://github.com/OpenEnergyPlatform/ontology/issues/1318 pull request: https://github.com/OpenEnergyPlatform/ontology/pull/1331

Axiom
annotated source: gasoline
annotated property: editor note
annotated target: The term gasoline was chosen as this term is more often used in energy modelling and energy statistics. This is a deliberate deviation from the convention of British English spelling in the OEO.
term tracker annotation: https://github.com/OpenEnergyPlatform/ontology/issues/1028 https://github.com/OpenEnergyPlatform/ontology/pull/1037

gas power plant
type: Class
subclass of: power plant
subclass of: Restriction
  on property: has part
  some values from: gas fired power unit
definition: A gas power plant is a power plant that has gas fired power units as parts.
alternative label: Gaskraftwerk @de
term tracker annotation: issue: https://github.com/OpenEnergyPlatform/ontology/issues/750 pull request: https://github.com/OpenEnergyPlatform/ontology/pull/752

gas turbine
type: Class
subclass of: turbine
subclass of: Restriction
definition: A gas turbine is a turbine that participates in a gas turbine process. It is also called combustion turbine.
alternative label: Gasturbine @de
alternative label: combustion turbine
term tracker annotation: issue: https://github.com/OpenEnergyPlatform/ontology/issues/299 pull request: https://github.com/OpenEnergyPlatform/ontology/pull/300 change produces energy axiom to 'has energy output': issue: https://github.com/OpenEnergyPlatform/ontology/issues/994 pull request: https://github.com/OpenEnergyPlatform/ontology/pull/1006

Axiom
annotated source: gas turbine
annotated property: subClassOf
annotated target: Restriction
term tracker annotation: issue: https://github.com/OpenEnergyPlatform/ontology/issues/787 pull request: https://github.com/OpenEnergyPlatform/ontology/pull/817 issue: https://github.com/OpenEnergyPlatform/ontology/issues/736 pull request: https://github.com/OpenEnergyPlatform/ontology/pull/766 issue: https://github.com/OpenEnergyPlatform/ontology/issues/761 pull request: https://github.com/OpenEnergyPlatform/ontology/pull/782

Axiom
annotated source: gas turbine
annotated property: subClassOf
annotated target: Restriction
term tracker annotation: issue: https://github.com/OpenEnergyPlatform/ontology/issues/736 pull request: https://github.com/OpenEnergyPlatform/ontology/pull/766 issue: https://github.com/OpenEnergyPlatform/ontology/issues/761 pull request: https://github.com/OpenEnergyPlatform/ontology/pull/782

gasworks gas
type: Class
subclass of: manufactured coal based gas
definition: Gasworks gas is manufactured coal based gas that covers all types of gases produced in public utility or private plants, whose main purpose is manufacture, transport and distribution of gas. It includes gas produced by carbonisation (including gas produced by coke ovens and transferred to gasworks gas), by total gasification with or without enrichment with oil products (LPG, residual fuel oil, etc.), and by reforming and simple mixing of gases and/or air, reported under the rows ‘from other sources’. Under the transformation sector identify amounts of gasworks gas transferred to blended natural gas which will be distributed and consumed through the natural gas grid. The production of other coal gases (i.e. coke oven gas, blast furnace gas and oxygen steel furnace gas) should be reported in the columns concerning such gases, and not as production of gasworks gas. The coal gases transferred to gasworks plants should then be reported (in their own column) in the transformation sector in the gasworks plants row. The total amount of gasworks gas resulting from transfers of other coal gases should appear in the production line for gasworks gas.
alternative label: Stadtgas @de
definition source: REGULATION (EC) No 1099/2008 OF THE EUROPEAN PARLIAMENT AND OF THE COUNCIL of 22 October 2008 on energy statistics https://eur-lex.europa.eu/legal-content/EN/TXT/HTML/?uri=CELEX:32008R1099&from=EN

generator
type: Class
subclass of: energy converting component
subclass of: Restriction
  on property: part of
  some values from: power generating unit
definition: A generator is an energy converting component that converts other forms of energy into electrical energy.
alternative label: Generator @de
alternative label: Stromerzeuger @de
term tracker annotation: issue: https://github.com/OpenEnergyPlatform/ontology/issues/173 pull request: https://github.com/OpenEnergyPlatform/ontology/pull/273 axiom pull request: https://github.com/OpenEnergyPlatform/ontology/pull/895 change produces energy axiom to 'has energy output': issue: https://github.com/OpenEnergyPlatform/ontology/issues/994 pull request: https://github.com/OpenEnergyPlatform/ontology/pull/1006 rework module structure issue: https://github.com/OpenEnergyPlatform/ontology/issues/1592 pull request: https://github.com/OpenEnergyPlatform/ontology/pull/1652

Axiom
annotated source: generator
annotated property: subClassOf
annotated target: Restriction
term tracker annotation: issue: https://github.com/OpenEnergyPlatform/ontology/issues/736 pull request: https://github.com/OpenEnergyPlatform/ontology/pull/766

geographic coordinate
type: Class
subclass of: information content entity
subclass of: Restriction
  on property: is about
  some values from: zero-dimensional spatial region
definition: A geographic coordinate is an information content entity explicitly stating the geographic position of a zero-dimensional spatial region on Earth, by using a set of numbers with respect to a geographic coordinate system.
alternative label: geographische Koordinate @de
term tracker annotation: issue: https://github.com/OpenEnergyPlatform/ontology/issues/795 pull request: https://github.com/OpenEnergyPlatform/ontology/pull/803 rework module structure issue: https://github.com/OpenEnergyPlatform/ontology/issues/1592 pull request: https://github.com/OpenEnergyPlatform/ontology/pull/1652

geothermal energy
type: Class
subclass of: thermal energy
subclass of: Restriction
  on property: has origin
  some values from: renewable
definition: Geothermal energy is thermal energy that is released from within the earth's crust.
alternative label: Erdwärme @de
alternative label: Geothermie @de
term tracker annotation: issue: https://github.com/OpenEnergyPlatform/ontology/issues/727 pull request: https://github.com/OpenEnergyPlatform/ontology/pull/739

Axiom
annotated source: geothermal energy
annotated property: closeMatch
annotated target: ENVO_2000034
term tracker annotation: issue: https://github.com/OpenEnergyPlatform/ontology/issues/636 pull request: https://github.com/OpenEnergyPlatform/ontology/pull/810 Convert to skos:closeMatch issue: https://github.com/OpenEnergyPlatform/ontology/issues/636 pull request: https://github.com/OpenEnergyPlatform/ontology/pull/1879

geothermal power plant
type: Class
subclass of: power plant
subclass of: Restriction
  on property: has part
  some values from: geothermal power unit
definition: A geothermal power plant is a power plant that has geothermal power units as parts.
term tracker annotation: issue: https://github.com/OpenEnergyPlatform/ontology/issues/750 pull request: https://github.com/OpenEnergyPlatform/ontology/pull/752

Axiom
annotated source: geothermal power plant
annotated property: closeMatch
annotated target: ENVO_00002215
term tracker annotation: issue: https://github.com/OpenEnergyPlatform/ontology/issues/636 pull request: https://github.com/OpenEnergyPlatform/ontology/pull/810 Convert to skos:closeMatch issue: https://github.com/OpenEnergyPlatform/ontology/issues/636 pull request: https://github.com/OpenEnergyPlatform/ontology/pull/1879

greenhouse effect disposition
type: Class
subclass of: disposition
subclass of: Restriction
  on property: realized in
  some values from: greenhouse gas emission
subclass of: Restriction
  on property: characteristic of
  some values from: Class
    intersection of: portion of matter
    intersection of: Restriction
      on property: has state of matter
      has value: OEO_00000182
definition: The greenhouse effect disposition is the disposition of a gas to contribute to the greenhouse effect, when it is emitted into the atmosphere.
may be identical to: http://purl.obolibrary.org/obo/CHEBI_76413
term tracker annotation: issue: https://github.com/OpenEnergyPlatform/ontology/issues/56 pull request: https://github.com/OpenEnergyPlatform/ontology/pull/234 add 'has bearer' axiom issue: https://github.com/OpenEnergyPlatform/ontology/issues/1305 pull request: https://github.com/OpenEnergyPlatform/ontology/pull/1310 Add 'realized in' axiom: issue: https://github.com/OpenEnergyPlatform/ontology/issues/1320 pull request: https://github.com/OpenEnergyPlatform/ontology/pull/1353 move to oeo-shared: issue: https://github.com/OpenEnergyPlatform/ontology/issues/1384 pull request: https://github.com/OpenEnergyPlatform/ontology/pull/1390 rework module structure issue: https://github.com/OpenEnergyPlatform/ontology/issues/1592 pull request: https://github.com/OpenEnergyPlatform/ontology/pull/1652 replaced 'has bearer' with 'characteristic of' issue: https://github.com/OpenEnergyPlatform/ontology/issues/1907 pull request: https://github.com/OpenEnergyPlatform/ontology/pull/1928

Axiom
annotated source: greenhouse effect disposition
annotated property: may be identical to
annotated target: http://purl.obolibrary.org/obo/CHEBI_76413
term tracker annotation: issue: https://github.com/OpenEnergyPlatform/ontology/issues/636 pull request: https://github.com/OpenEnergyPlatform/ontology/pull/810

greenhouse gas emission
type: Class
equivalent class: Class
  intersection of: emission
  intersection of: Restriction
    on property: has participant
    some values from: greenhouse gas
subclass of: emission
definition: A greenhouse gas emission is an emission that releases a greenhouse gas.
alternative label: Treibhausgasemission @de
oekg annotation: study descriptor
term tracker annotation: issue: https://github.com/OpenEnergyPlatform/ontology/issues/406 pull request: https://github.com/OpenEnergyPlatform/ontology/pull/410 issue: https://github.com/OpenEnergyPlatform/ontology/issues/56 pull request: https://github.com/OpenEnergyPlatform/ontology/pull/234 make equivalent class: issue: https://github.com/OpenEnergyPlatform/ontology/issues/1012 pull request: https://github.com/OpenEnergyPlatform/ontology/pull/1100 move to oeo-shared: issue: https://github.com/OpenEnergyPlatform/ontology/issues/1384 pull request: https://github.com/OpenEnergyPlatform/ontology/pull/1390 rework module structure issue: https://github.com/OpenEnergyPlatform/ontology/issues/1592 pull request: https://github.com/OpenEnergyPlatform/ontology/pull/1652 add oekg annotation issue: https://github.com/OpenEnergyPlatform/ontology/issues/1529 pull request: https://github.com/OpenEnergyPlatform/ontology/pull/1897 add subclassof axiom issue: https://github.com/OpenEnergyPlatform/ontology/issues/2138 pull request: https://github.com/OpenEnergyPlatform/ontology/pull/2143

supply grid
type: Class
subclass of: supply system
definition: A supply grid is a supply system of systematically connected artificial objects that can work as a supply system.
alternative label: Versorgungsnetz @de
alternative label: grid
alternative label: network
term tracker annotation: issue: https://github.com/OpenEnergyPlatform/ontology/issues/36 pull request: https://github.com/OpenEnergyPlatform/ontology/pull/385 issue: https://github.com/OpenEnergyPlatform/ontology/issues/114 pull request: https://github.com/OpenEnergyPlatform/ontology/pull/137 rework module structure issue: https://github.com/OpenEnergyPlatform/ontology/issues/1592 pull request: https://github.com/OpenEnergyPlatform/ontology/pull/1652 make subclass of supply system: issue: https://github.com/OpenEnergyPlatform/ontology/issues/1833 pull request: https://github.com/OpenEnergyPlatform/ontology/pull/1947

graphical user interface
type: Class
subclass of: software interface
definition: A graphical user interface (GUI) is a software interface allowing users to communicate with a software application through a graphical window.
alternative label: GUI
alternative label: Graphische Benutzeroberfläche @de
term tracker annotation: Change label: issue: https://github.com/OpenEnergyPlatform/ontology/issues/1804 pull request: https://github.com/OpenEnergyPlatform/ontology/pull/1810

hard coal
type: Class
subclass of: coal
disjoint with: lignite
definition: Hard coal is coal with a gross calorific value greater than 23 865 kJ/kg (5 700 kcal/kg) on an ashfree but moist basis and with a mean random reflectance of vitrinite of at least 0,6.
alternative label: Steinkohle @de
definition source: REGULATION (EC) No 1099/2008 OF THE EUROPEAN PARLIAMENT AND OF THE COUNCIL of 22 October 2008 on energy statistics https://eur-lex.europa.eu/legal-content/EN/TXT/HTML/?uri=CELEX:32008R1099&from=EN

hard coal power plant
type: Class
subclass of: coal power plant
subclass of: Restriction
  on property: has part
  some values from: hard coal power unit
definition: A hard coal power plant is a coal power plant that has hard coal power units as parts.
alternative label: Steinkohlekraftwerk @de
term tracker annotation: issue: https://github.com/OpenEnergyPlatform/ontology/issues/750 pull request: https://github.com/OpenEnergyPlatform/ontology/pull/752

hardware
type: Class
subclass of: artificial object
subclass of: Restriction
  on property: has energy output
  some values from: waste thermal energy
definition: Hardware is an artificial object that is part of an electronic system.
term tracker annotation: issue: https://github.com/OpenEnergyPlatform/ontology/issues/319 pull request: https://github.com/OpenEnergyPlatform/ontology/pull/350 issue: https://github.com/OpenEnergyPlatform/ontology/issues/1265 pull request: https://github.com/OpenEnergyPlatform/ontology/pull/1359 rework module structure issue: https://github.com/OpenEnergyPlatform/ontology/issues/1592 pull request: https://github.com/OpenEnergyPlatform/ontology/pull/1652

thermal energy
type: Class
subclass of: energy
definition: Thermal energy is the energy that a material entity contains in the undirected motion of its constituent parts (e.g. molecules and atoms).
alternative label: Wärme @de
alternative label: thermische Energie @de
term tracker annotation: issue: https://github.com/OpenEnergyPlatform/ontology/issues/522 pull request: https://github.com/OpenEnergyPlatform/ontology/pull/609 move to oeo-shared: issue: https://github.com/OpenEnergyPlatform/ontology/issues/1384 pull request: https://github.com/OpenEnergyPlatform/ontology/pull/1390 rework module structure issue: https://github.com/OpenEnergyPlatform/ontology/issues/1592 pull request: https://github.com/OpenEnergyPlatform/ontology/pull/1652

Axiom
annotated source: thermal energy
annotated property: closeMatch
annotated target: ENVO_2000032
term tracker annotation: issue: https://github.com/OpenEnergyPlatform/ontology/issues/636 pull request: https://github.com/OpenEnergyPlatform/ontology/pull/810 Convert to skos:closeMatch issue: https://github.com/OpenEnergyPlatform/ontology/issues/636 pull request: https://github.com/OpenEnergyPlatform/ontology/pull/1879

heater
type: Class
subclass of: energy converting component
subclass of: Restriction
definition: A heater is an energy converting component that converts other forms of energy into useful heat.
term tracker annotation: issue: https://github.com/OpenEnergyPlatform/ontology/issues/173 pull request: https://github.com/OpenEnergyPlatform/ontology/pull/273 use energy converting component in definition: https://github.com/OpenEnergyPlatform/ontology/pull/993 change produces energy axiom to 'has energy output': issue: https://github.com/OpenEnergyPlatform/ontology/issues/994 pull request: https://github.com/OpenEnergyPlatform/ontology/pull/1006

Axiom
annotated source: heater
annotated property: subClassOf
annotated target: Restriction
term tracker annotation: issue: https://github.com/OpenEnergyPlatform/ontology/issues/736 pull request: https://github.com/OpenEnergyPlatform/ontology/pull/766

heating oil
type: Class
subclass of: gas diesel oil
subclass of: Restriction
  on property: physical output of
  some values from: mineral oil refining process
definition: Heating oil is gas diesel oil for industrial and commercial uses, marine diesel and diesel used in rail traffic, other gas oil, including heavy gas oils which distil between 380 °C and 540 °C and which are used as petrochemical feedstocks.
alternative label: Heizöl @de
alternative label: other gas oil
definition source: REGULATION (EC) No 1099/2008 OF THE EUROPEAN PARLIAMENT AND OF THE COUNCIL of 22 October 2008 on energy statistics https://eur-lex.europa.eu/legal-content/EN/TXT/HTML/?uri=CELEX:32008R1099&from=EN
term tracker annotation: Add 'physical output of' axiom: issue: https://github.com/OpenEnergyPlatform/ontology/issues/1318 pull request: https://github.com/OpenEnergyPlatform/ontology/pull/1331

heat pump
type: Class
subclass of: heater
definition: A heat pump is a heater that transforms low temperature heat to high temperature heat using external energy.
alternative label: Wärmepumpe @de

heating and cooling sector
type: Class
subclass of: energy demand sector
definition: A heating and cooling sector is a sector that covers heating and cooling activities.
alternative label: H&C sector
alternative label: Wärme- und Kältesektor @de
term tracker annotation: issue: https://github.com/OpenEnergyPlatform/ontology/issues/30 pull request: https://github.com/OpenEnergyPlatform/ontology/pull/484 move to oeo-sector issue: https://github.com/OpenEnergyPlatform/ontology/issues/1399 pull request: https://github.com/OpenEnergyPlatform/ontology/pull/1724

household sector
type: Class
subclass of: energy demand sector
definition: A household sector is a sector that covers households.
alternative label: Haushaltssektor @de
alternative label: private household sector
term tracker annotation: issue: https://github.com/OpenEnergyPlatform/ontology/issues/30 pull request: https://github.com/OpenEnergyPlatform/ontology/pull/484 move to oeo-sector issue: https://github.com/OpenEnergyPlatform/ontology/issues/1399 pull request: https://github.com/OpenEnergyPlatform/ontology/pull/1724

hydro energy
type: Class
subclass of: OEO_00230020
subclass of: Restriction
  on property: characteristic of
  some values from: water
definition: Hydro energy is kinetic energy of moving liquid water which can result directly from its potential energy.
alternative label: Wasserkraft @de
term tracker annotation: issue: https://github.com/OpenEnergyPlatform/ontology/issues/679 pull request: https://github.com/OpenEnergyPlatform/ontology/pull/681 change axiom from participates in to is energy participant of pull request: https://github.com/OpenEnergyPlatform/ontology/pull/1065 added axiom issue: https://github.com/OpenEnergyPlatform/ontology/issues/1600 pull request: https://github.com/OpenEnergyPlatform/ontology/pull/1620 replaced 'has bearer' with 'characteristic of' issue: https://github.com/OpenEnergyPlatform/ontology/issues/1907 pull request: https://github.com/OpenEnergyPlatform/ontology/pull/1928

Axiom
annotated source: hydro energy
annotated property: subClassOf
annotated target: Restriction
term tracker annotation: issue: https://github.com/OpenEnergyPlatform/ontology/issues/762 pull request: https://github.com/OpenEnergyPlatform/ontology/pull/806 change axiom to 'participates in' issue: https://github.com/OpenEnergyPlatform/ontology/issues/850 pull request: https://github.com/OpenEnergyPlatform/ontology/pull/871/

hydrofluorocarbon
type: Class
subclass of: portion of matter
subclass of: Restriction
  on property: has origin
  some values from: anthropogenic
definition: Hydrofluorocarbons (HFCs) are portions of matter consisting of organic compounds that contain fluorine and hydrogen atoms, and are the most common type of organofluorine compounds. They are frequently used in air conditioning and as refrigerants in place of the older chlorofluorocarbons such as R-12 and hydrochlorofluorocarbons such as R-21.
alternative label: Fluorkohlenwasserstoff @de
alternative label: HFC
definition source: https://en.wikipedia.org/w/index.php

hydrogen
type: Class
subclass of: portion of matter
subclass of: Restriction
  on property: has role
  some values from: fuel role
subclass of: Restriction
  on property: has disposition
  some values from: combustible energy carrier disposition
subclass of: Restriction
  on property: has normal state of matter
  has value: OEO_00000182
definition: Hydrogen is a portion of matter with the chemical formula H2. It has a gaseous normal state of matter. As it can be oxidised it can be used as a fuel.
alternative label: H2
alternative label: Wasserstoff @de
may be identical to: http://purl.obolibrary.org/obo/CHEBI_18276
term tracker annotation: issue: https://github.com/OpenEnergyPlatform/ontology/issues/134

Axiom
annotated source: hydrogen
annotated property: may be identical to
annotated target: http://purl.obolibrary.org/obo/CHEBI_18276
term tracker annotation: issue: https://github.com/OpenEnergyPlatform/ontology/issues/636 pull request: https://github.com/OpenEnergyPlatform/ontology/pull/810

hydrogen power plant
type: Class
subclass of: power plant
subclass of: Restriction
  on property: has part
  some values from: hydrogen power unit
definition: A hydrogen power plant is a power plant that has hydrogen power units as parts.
alternative label: Wasserstoffkraftwerk @de
term tracker annotation: issue: https://github.com/OpenEnergyPlatform/ontology/issues/750 pull request: https://github.com/OpenEnergyPlatform/ontology/pull/752

hydrogen turbine
type: Class
subclass of: gas turbine
subclass of: Restriction
definition: A hydrogen turbine is a gas turbine fueled with hydrogen.
alternative label: Wasserstoffturbine @de
term tracker annotation: issue: https://github.com/OpenEnergyPlatform/ontology/issues/873 pull request: https://github.com/OpenEnergyPlatform/ontology/pull/877 issue: https://github.com/OpenEnergyPlatform/ontology/issues/299 pull request: https://github.com/OpenEnergyPlatform/ontology/pull/300

Axiom
annotated source: hydrogen turbine
annotated property: subClassOf
annotated target: Restriction
term tracker annotation: issue: https://github.com/OpenEnergyPlatform/ontology/issues/736 pull request: https://github.com/OpenEnergyPlatform/ontology/pull/766 issue: https://github.com/OpenEnergyPlatform/ontology/issues/761 pull request: https://github.com/OpenEnergyPlatform/ontology/pull/782

industrial waste fuel
type: Class
subclass of: waste fuel
definition: An industrial waste fuel is waste fuel produced by industry.
term tracker annotation: issue: https://github.com/OpenEnergyPlatform/ontology/issues/925 pull request: https://github.com/OpenEnergyPlatform/ontology/pull/961

industry sector
type: Class
subclass of: sector
subclass of: Restriction
  on property: is sector of
  some values from: manufacturing process
definition: An industry sector is a sector that covers industrial activities with other main purposes of energy transformation.
alternative label: Industriesektor @de
term tracker annotation: issue: https://github.com/OpenEnergyPlatform/ontology/issues/30 pull request: https://github.com/OpenEnergyPlatform/ontology/pull/484 move to oeo-sector issue: https://github.com/OpenEnergyPlatform/ontology/issues/1399 pull request: https://github.com/OpenEnergyPlatform/ontology/pull/1724 Add 'is sector of' axiom: issue: https://github.com/OpenEnergyPlatform/ontology/issues/1333 pull request: https://github.com/OpenEnergyPlatform/ontology/pull/1788

installation guide
type: Class
subclass of: software documentation
definition: An installation guide is a documentation intended to help users install a Software.
alternative label: Installationsanleitung @de

institution
type: Class
subclass of: organisation
definition: An institution is an organisation that serves a social purpose.
alternative label: Institution @de
term tracker annotation: moved term to oeo-shared: pull request: https://github.com/OpenEnergyPlatform/ontology/pull/871 rework module structure issue: https://github.com/OpenEnergyPlatform/ontology/issues/1592 pull request: https://github.com/OpenEnergyPlatform/ontology/pull/1652

software interface
type: Class
subclass of: software
definition: A software interface is a software that enables an agent to interact with it.
alternative label: Softwareschnittstelle @de

internal combustion vehicle
type: Class
equivalent class: Class
  intersection of: vehicle
  intersection of: Restriction
    on property: has part
    some values from: Class
      intersection of: internal combustion engine
      intersection of: Restriction
        on property: participates in
        some values from: traction
subclass of: vehicle
subclass of: Restriction
  on property: has part
  some values from: OEO_00320056
subclass of: Restriction
  on property: uses
  some values from: combustion fuel
definition: An internal combustion vehicle is a vehicle that uses an internal combustion engine for propulsion.
alternative label: Verbrennungsmotorfahrzeug @de
term tracker annotation: issue: https://github.com/OpenEnergyPlatform/ontology/issues/425 pull request: https://github.com/OpenEnergyPlatform/ontology/pull/431 extend internal combustion engine axiom: issue: https://github.com/OpenEnergyPlatform/ontology/issues/1277 pull request: https://github.com/OpenEnergyPlatform/ontology/pull/1293 Adapt definition and convert to equivalent class: issue: https://github.com/OpenEnergyPlatform/ontology/issues/1311 pull request: https://github.com/OpenEnergyPlatform/ontology/pull/1315 Add fuel tank axiom: issue: https://github.com/OpenEnergyPlatform/ontology/issues/1301 pull request: https://github.com/OpenEnergyPlatform/ontology/pull/1356

jet fuel
type: Class
subclass of: kerosene
subclass of: Restriction
  on property: physical output of
  some values from: mineral oil refining process
definition: Jet fuel is kerosene used for aviation turbine power units. It has the same distillation characteristics between 150 °C and 300 °C (generally not above 250 °C) and flash point as kerosene. In addition, it has particular specifications (such as freezing point) which are established by the International Air Transport Association (IATA).
alternative label: kerosene type jet fuel
definition source: REGULATION (EC) No 1099/2008 OF THE EUROPEAN PARLIAMENT AND OF THE COUNCIL of 22 October 2008 on energy statistics https://eur-lex.europa.eu/legal-content/EN/TXT/HTML/?uri=CELEX:32008R1099&from=EN
term tracker annotation: Add 'physical output of' axiom: issue: https://github.com/OpenEnergyPlatform/ontology/issues/1318 pull request: https://github.com/OpenEnergyPlatform/ontology/pull/1331
term tracker annotation: convert second label to alternative term: issue: https://github.com/OpenEnergyPlatform/ontology/issues/1230 pull request: https://github.com/OpenEnergyPlatform/ontology/pull/1237

kerosene
type: Class
subclass of: portion of matter
subclass of: Restriction
  on property: has part
  some values from: hydrocarbon
subclass of: Restriction
  on property: has role
  some values from: fuel role
subclass of: Restriction
  on property: has disposition
  some values from: combustible energy carrier disposition
subclass of: Restriction
  on property: has disposition
  some values from: secondary energy carrier disposition
subclass of: Restriction
  on property: has origin
  some values from: fossil
subclass of: Restriction
  on property: physical output of
  some values from: mineral oil refining process
subclass of: Restriction
  on property: has normal state of matter
  has value: OEO_00000256
definition: Kerosene, also known as paraffin, lamp oil, and coal oil (an obsolete term), is a portion of matter consisting of combustible hydrocarbon liquid which is derived from petroleum. It is widely used as a fuel in industry as well as households. It is sometimes spelled kerosine in scientific and industrial usage. [...] Kerosene is widely used to power jet engines of aircraft (jet fuel) and some rocket engines and is also commonly used as a cooking and lighting fuel and for fire toys such as poi. In parts of Asia, kerosene is sometimes used as fuel for small outboard motors or even motorcycles.
alternative label: Kerosin @de
definition source: https://en.wikipedia.org/w/index.php
term tracker annotation: Add 'physical output of' axiom: issue: https://github.com/OpenEnergyPlatform/ontology/issues/1318 pull request: https://github.com/OpenEnergyPlatform/ontology/pull/1331
term tracker annotation: make direct subclass of 'portion of matter' and preserve axioms from old class 'oil and petroleum products' issue: https://github.com/OpenEnergyPlatform/ontology/issues/811 https://github.com/OpenEnergyPlatform/ontology/pull/1024 add axiom to secondary energy carrier disposition issue:https://github.com/OpenEnergyPlatform/ontology/issues/1222 pull request: https://github.com/OpenEnergyPlatform/ontology/pull/1243

lithium-ion battery
type: Class
subclass of: battery
definition: A lithium-ion battery is a battery that is rechargeable and in which lithium ions move from the negative electrode to the positive electrode during discharge, and back when charging. Li-ion batteries use an intercalated lithium compound as one electrode material.
alternative label: LIB
alternative label: Li-ion battery
alternative label: Lithium-Ionen-Batterie @de
definition source: https://en.wikipedia.org/w/index.php
term tracker annotation: issue: https://github.com/OpenEnergyPlatform/ontology/issues/773 pull request: https://github.com/OpenEnergyPlatform/ontology/pull/801

lignite
type: Class
subclass of: coal
subclass of: Restriction
  on property: has origin
  some values from: fossil
subclass of: Restriction
  on property: has normal state of matter
  has value: OEO_00000390
definition: Lignite is coal that is non-agglomerating with a gross calorific value less than 17 435 kJ/kg (4 165 kcal/kg) and greater than 31 % volatile matter on a dry mineral matter free basis.
alternative label: Braunkohle @de
definition source: REGULATION (EC) No 1099/2008 OF THE EUROPEAN PARLIAMENT AND OF THE COUNCIL of 22 October 2008 on energy statistics https://eur-lex.europa.eu/legal-content/EN/TXT/HTML/?uri=CELEX:32008R1099&from=EN
comment: Oil shale and tar sands produced and combusted directly should be reported in this category. Oil shale and tar sands used as inputs for other transformation processes should also be reported in this category. This includes the portion of the oil shale or tar sands consumed in the transformation process.

Axiom
annotated source: lignite
annotated property: closeMatch
annotated target: ENVO_2000008
term tracker annotation: issue: https://github.com/OpenEnergyPlatform/ontology/issues/636 pull request: https://github.com/OpenEnergyPlatform/ontology/pull/810 Convert to skos:closeMatch issue: https://github.com/OpenEnergyPlatform/ontology/issues/636 pull request: https://github.com/OpenEnergyPlatform/ontology/pull/1879

lignite power plant
type: Class
subclass of: coal power plant
subclass of: Restriction
  on property: has part
  some values from: lignite power unit
definition: A lignite power plant is a coal power plant that has lignite power units as parts.
alternative label: Braunkohlenkraftwerk @de
term tracker annotation: issue: https://github.com/OpenEnergyPlatform/ontology/issues/750 pull request: https://github.com/OpenEnergyPlatform/ontology/pull/752

Axiom
annotated source: lignite power plant
annotated property: closeMatch
annotated target: ENVO_2000040
term tracker annotation: issue: https://github.com/OpenEnergyPlatform/ontology/issues/636 pull request: https://github.com/OpenEnergyPlatform/ontology/pull/810 Convert to skos:closeMatch issue: https://github.com/OpenEnergyPlatform/ontology/issues/636 pull request: https://github.com/OpenEnergyPlatform/ontology/pull/1879

power line
type: Class
subclass of: grid component link
subclass of: Restriction
  on property: part of
  some values from: electricity grid
subclass of: Restriction
  on property: has function
  some values from: energy transfer function
definition: A power line is a grid component link that enables the transfer of electricity between nodes in an electricity grid.
alternative label: Stromleitung @de
term tracker annotation: issue: https://github.com/OpenEnergyPlatform/ontology/issues/231 pull request: https://github.com/OpenEnergyPlatform/ontology/pull/385 Move to oeo-shared: https://github.com/OpenEnergyPlatform/ontology/pull/1360 rework module structure issue: https://github.com/OpenEnergyPlatform/ontology/issues/1592 pull request: https://github.com/OpenEnergyPlatform/ontology/pull/1652 update definition and add axiom issue: https://github.com/OpenEnergyPlatform/ontology/issues/2154 pull request: https://github.com/OpenEnergyPlatform/ontology/pull/ 2191

grid component link
type: Class
subclass of: grid component
disjoint with: grid node
definition: A grid component link is a grid component that serves as a connection between two other grid components.
term tracker annotation: issue: https://github.com/OpenEnergyPlatform/ontology/issues/36 pull request: https://github.com/OpenEnergyPlatform/ontology/pull/385 Move to oeo-shared: https://github.com/OpenEnergyPlatform/ontology/pull/1360 rework module structure issue: https://github.com/OpenEnergyPlatform/ontology/issues/1592 pull request: https://github.com/OpenEnergyPlatform/ontology/pull/1652

liquid air
type: Class
equivalent class: Class
  intersection of: air
  intersection of: Restriction
    on property: has state of matter
    has value: OEO_00000256
subclass of: air
definition: Liquid air is air that has a liquid state of matter.
alternative label: verflüssigte Luft @de
term tracker annotation: redefine definition and add equivalent issue: https://github.com/OpenEnergyPlatform/ontology/issues/937 pull request: https://github.com/OpenEnergyPlatform/ontology/pull/945

liquid biofuel
type: Class
equivalent class: Class
  intersection of: biofuel
  intersection of: Restriction
    on property: has normal state of matter
    has value: OEO_00000256
subclass of: biofuel
subclass of: Restriction
  on property: has origin
  some values from: biogenic
subclass of: Restriction
  on property: has normal state of matter
  has value: OEO_00000256
definition: A liquid biofuel is a biofuel that has liquid as its normal state of matter.
alternative label: biogener Flüssigkraftstoff @de
term tracker annotation: issue: https://github.com/OpenEnergyPlatform/ontology/issues/811 pull request: https://github.com/OpenEnergyPlatform/ontology/pull/931

Axiom
annotated source: liquid biofuel
annotated property: subClassOf
annotated target: biofuel
term tracker annotation: Add `SubClass Of` axiom for `liquid biofuel` issue: https://github.com/OpenEnergyPlatform/ontology/issues/1191 pull request: https://github.com/OpenEnergyPlatform/ontology/pull/1201

liquid-metal battery
type: Class
subclass of: battery
definition: A liquid-metal battery is a battery that consists of two molten metal alloys separated by an electrolyte. The rechargeable batteries are used for electric vehicles and potentially also for grid energy storage.
alternative label: Flüssigmetallbatterie @de
definition source: https://en.wikipedia.org/w/index.php
term tracker annotation: reclassification and integration of molten state battery issue: https://github.com/OpenEnergyPlatform/ontology/issues/773 pull request: https://github.com/OpenEnergyPlatform/ontology/pull/801

manufactured coal based gas
type: Class
subclass of: gas mixture
subclass of: Restriction
  on property: has role
  some values from: fuel role
subclass of: Restriction
  on property: has disposition
  some values from: combustible energy carrier disposition
subclass of: Restriction
  on property: has disposition
  some values from: secondary energy carrier disposition
subclass of: Restriction
  on property: has origin
  some values from: fossil
subclass of: Restriction
  on property: has normal state of matter
  has value: OEO_00000182
definition: A manufactured coal based gas is a gas mixture that is manufactured from coal. It is used as fossil fuel.
term tracker annotation: improve definition and make subclass of gas mixture: issue: https://github.com/OpenEnergyPlatform/ontology/issues/988 pull request: https://github.com/OpenEnergyPlatform/ontology/pull/1009 add axiom to secondary energy carrier disposition issue:https://github.com/OpenEnergyPlatform/ontology/issues/1222 pull request: https://github.com/OpenEnergyPlatform/ontology/pull/1243

energy market model
type: Class
subclass of: numerical computer model
subclass of: Restriction
definition: An energy market model is a model that is about the energy market.
alternative label: Energiemarktmodell @de
term tracker annotation: issue: https://github.com/OpenEnergyPlatform/ontology/issues/415 pull request: https://github.com/OpenEnergyPlatform/ontology/pull/821 rework module structure issue: https://github.com/OpenEnergyPlatform/ontology/issues/1592 pull request: https://github.com/OpenEnergyPlatform/ontology/pull/1652

Axiom
annotated source: energy market model
annotated property: subClassOf
annotated target: Restriction
term tracker annotation: issue: https://github.com/OpenEnergyPlatform/ontology/issues/415 pull request: https://github.com/OpenEnergyPlatform/ontology/pull/821

power-to-methane system
type: Class
subclass of: power-to-gas system
subclass of: Restriction
  on property: participates in
  some values from: power-to-methane process
definition: A power-to-methane system is a power-to-gas system that implements the power-to-methane process.
alternative label: methanation gas storage
term tracker annotation: Improve definition and classification: issue: https://github.com/OpenEnergyPlatform/ontology/issues/1262 pull request: https://github.com/OpenEnergyPlatform/ontology/pull/1348

numerical computer model
type: Class
subclass of: mathematical model
definition: A numerical computer model is a mathematical model that is calculated by a computer.
editor note: formerly called "model"
term tracker annotation: issue: https://github.com/OpenEnergyPlatform/ontology/issues/180 pull request: https://github.com/OpenEnergyPlatform/ontology/pull/349 issue: https://github.com/OpenEnergyPlatform/ontology/issues/208 pull request: https://github.com/OpenEnergyPlatform/ontology/pull/287 add axiom to model calculation pull request: https://github.com/OpenEnergyPlatform/ontology/pull/1113 rework module structure issue: https://github.com/OpenEnergyPlatform/ontology/issues/1592 pull request: https://github.com/OpenEnergyPlatform/ontology/pull/1652 rename and reclassify issue: https://github.com/OpenEnergyPlatform/ontology/issues/1444 pull request: https://github.com/OpenEnergyPlatform/ontology/pull/1707

model calculation
type: Class
subclass of: process
subclass of: Restriction
subclass of: Restriction
  on property: has information input
  some values from: exogenous data
subclass of: Restriction
  on property: has information output
  some values from: endogenous data
definition: A model calculation is a process of solving mathematical equations of a model.
alternative label: Modellrechnung @de
term tracker annotation: issue: https://github.com/OpenEnergyPlatform/ontology/issues/73 pull request: https://github.com/OpenEnergyPlatform/ontology/pull/504 moved to oeo-shared pull request: https://github.com/OpenEnergyPlatform/ontology/pull/1113 rework module structure issue: https://github.com/OpenEnergyPlatform/ontology/issues/1592 pull request: https://github.com/OpenEnergyPlatform/ontology/pull/1652

Axiom
annotated source: model calculation
annotated property: subClassOf
annotated target: Restriction
term tracker annotation: issue: https://github.com/OpenEnergyPlatform/ontology/issues/850 pull request: https://github.com/OpenEnergyPlatform/ontology/pull/871

model component
type: Class
equivalent class: Restriction
  on property: part of
  some values from: numerical computer model
subclass of: generically dependent continuant
definition: A model component is a generically dependent continuant that is part of a model.
alternative label: Modellkomponente @de
alternative label: model element

model factsheet
type: Class
subclass of: factsheet
subclass of: Restriction
  on property: is about
  some values from: numerical computer model
definition: A model factsheet is a model descriptor that contains a brief description of all relevant model information.
term tracker annotation: issue: https://github.com/OpenEnergyPlatform/ontology/issues/414 pull request: https://github.com/OpenEnergyPlatform/ontology/pull/440 pull request: https://github.com/OpenEnergyPlatform/ontology/pull/577 pull request: https://github.com/OpenEnergyPlatform/ontology/pull/584 issue: https://github.com/OpenEnergyPlatform/ontology/issues/851 pull request: https://github.com/OpenEnergyPlatform/ontology/pull/854 Fix SubClassOf axioms: issue: https://github.com/OpenEnergyPlatform/ontology/issues/1750 pull request: https://github.com/OpenEnergyPlatform/ontology/pull/1751

modelling software
type: Class
subclass of: software
subclass of: Restriction
  on property: has licence
  some values from: software licence
definition: A modelling software is a software used to create and maintain a (mathematical) model.
alternative label: Modellierungssoftware @de
alternative label: modeling software
term tracker annotation: issue: https://github.com/OpenEnergyPlatform/ontology/issues/338 pull request: https://github.com/OpenEnergyPlatform/ontology/pull/345 Add 'has licence' axiom: issue: https://github.com/OpenEnergyPlatform/ontology/issues/1275 pull request: https://github.com/OpenEnergyPlatform/ontology/pull/1547

modus
type: Class
subclass of: information content entity
definition: A modus is an information content entity describing the state of activity something has, e.g. active, inactive or passive.

molten-salt battery
type: Class
subclass of: battery
definition: A molten-salt battery is a battery that uses molten salts as an electrolyte and offers both a high energy density and a high power density.
alternative label: Flüssigsalzbatterie @de
definition source: https://en.wikipedia.org/w/index.php
term tracker annotation: reclassification issue: https://github.com/OpenEnergyPlatform/ontology/issues/773 pull request: https://github.com/OpenEnergyPlatform/ontology/pull/801

motor gasoline
type: Class
subclass of: gasoline
subclass of: Restriction
  on property: physical output of
  some values from: mineral oil refining process
definition: Motor gasoline is gasoline consisting of a mixture of light hydrocarbons distilling between 35 °C and 215 °C. It is used as a fuel for land based spark ignition engines. Motor gasoline may include additives, oxygenates and octane enhancers, including lead compounds such as TEL and TML. Includes motor gasoline blending components (excluding additives/oxygenates), e.g. alkylates, isomerate, reformate, cracked gasoline destined for use as finished motor gasoline.
editor note: The term gasoline was chosen as this term is more often used in energy modelling and energy statistics. This is a deliberate deviation from the convention of British English spelling in the OEO.
alternative label: Motorbenzin @de
definition source: REGULATION (EC) No 1099/2008 OF THE EUROPEAN PARLIAMENT AND OF THE COUNCIL of 22 October 2008 on energy statistics https://eur-lex.europa.eu/legal-content/EN/TXT/HTML/?uri=CELEX:32008R1099&from=EN
term tracker annotation: Add 'physical output of' axiom: issue: https://github.com/OpenEnergyPlatform/ontology/issues/1318 pull request: https://github.com/OpenEnergyPlatform/ontology/pull/1331

Axiom
annotated source: motor gasoline
annotated property: editor note
annotated target: The term gasoline was chosen as this term is more often used in energy modelling and energy statistics. This is a deliberate deviation from the convention of British English spelling in the OEO.
term tracker annotation: https://github.com/OpenEnergyPlatform/ontology/issues/1028 https://github.com/OpenEnergyPlatform/ontology/pull/1037

municipal waste fuel
type: Class
subclass of: waste fuel
definition: A municipal waste fuel is waste fuel produced by households or non-industrial commercial activities.
term tracker annotation: issue: https://github.com/OpenEnergyPlatform/ontology/issues/925 pull request: https://github.com/OpenEnergyPlatform/ontology/pull/961

natural gas
type: Class
subclass of: gas mixture
subclass of: Restriction
  on property: has part
  some values from: methane
subclass of: Restriction
  on property: has role
  some values from: fuel role
subclass of: Restriction
  on property: has disposition
  some values from: combustible energy carrier disposition
subclass of: Restriction
  on property: has origin
  some values from: fossil
subclass of: Restriction
  on property: has normal state of matter
  has value: OEO_00000182
definition: Natural gas is a gas mixture occurring in underground deposits, whether liquefied or gaseous, and consisting mainly of methane.
alternative label: Erdgas @de
alternative label: Naturgas @de
definition source: REGULATION (EC) No 1099/2008 OF THE EUROPEAN PARLIAMENT AND OF THE COUNCIL of 22 October 2008 on energy statistics https://eur-lex.europa.eu/legal-content/EN/TXT/HTML/?uri=CELEX:32008R1099&from=EN
comment: It includes both ‘non-associated’ gas originating from fields producing hydrocarbons only in gaseous form, and ‘associated’ gas produced in association with crude oil as well as methane recovered from coal mines (colliery gas) or from coal seams (coal seam gas). It does not include gases created by anaerobic digestion of biomass (e.g. municipal or sewage gas) nor gasworks gas.
term tracker annotation: issue: https://github.com/OpenEnergyPlatform/ontology/issues/430 pull request: https://github.com/OpenEnergyPlatform/ontology/pull/431 improve definition and make subclass of gas mixture and add disjoints: issue: https://github.com/OpenEnergyPlatform/ontology/issues/988 pull request: https://github.com/OpenEnergyPlatform/ontology/pull/1009

Axiom
annotated source: natural gas
annotated property: subClassOf
annotated target: Restriction
term tracker annotation: issue: https://github.com/OpenEnergyPlatform/ontology/issues/1032 pull request: https://github.com/OpenEnergyPlatform/ontology/pull/1033

Axiom
annotated source: natural gas
annotated property: closeMatch
annotated target: ENVO_01000552
term tracker annotation: issue: https://github.com/OpenEnergyPlatform/ontology/issues/636 pull request: https://github.com/OpenEnergyPlatform/ontology/pull/810 Convert to skos:closeMatch issue: https://github.com/OpenEnergyPlatform/ontology/issues/636 pull request: https://github.com/OpenEnergyPlatform/ontology/pull/1879

negative emission
type: Class
subclass of: process
definition: Negative emission is the process of absorbing a substance, usually a pollutant that was emitted before.
alternative label: negative Emission @de
oekg annotation: study descriptor
term tracker annotation: issue: https://github.com/OpenEnergyPlatform/ontology/issues/56 pull request: https://github.com/OpenEnergyPlatform/ontology/pull/234 add oekg annotation issue: https://github.com/OpenEnergyPlatform/ontology/issues/1529 pull request: https://github.com/OpenEnergyPlatform/ontology/pull/1897

grid node
type: Class
subclass of: grid component
definition: A grid node is a grid component of a supply grid where two or more links meet.
alternative label: Netzknoten @de
term tracker annotation: issue: https://github.com/OpenEnergyPlatform/ontology/issues/36 pull request: https://github.com/OpenEnergyPlatform/ontology/pull/385

non associated gas
type: Class
subclass of: natural gas
definition: Non associated gas is natural gas originating from fields producing hydrocarbons only in gaseous form.
alternative label: Erdgas @de
definition source: REGULATION (EC) No 1099/2008 OF THE EUROPEAN PARLIAMENT AND OF THE COUNCIL of 22 October 2008 on energy statistics https://eur-lex.europa.eu/legal-content/EN/TXT/HTML/?uri=CELEX:32008R1099&from=EN

non-methane volatile organic compound
type: Class
subclass of: volatile organic compound
definition: A non-methane volatile organic compound (NMVOC) is a volatile organic compound other than methane.
alternative label: NMVOC
alternative label: flüchtige organische Verbindungen außer Methan @de
definition source: This definition is partly based on Article 2 of the European Air Quality Directive (2008/50/EC): https://eur-lex.europa.eu/legal-content/EN/TXT/?uri=CELEX:32008L0050
term tracker annotation: issue: https://github.com/OpenEnergyPlatform/ontology/issues/263 pull request: https://github.com/OpenEnergyPlatform/ontology/pull/356

fossil municipal waste fuel
type: Class
equivalent class: Class
  intersection of: municipal waste fuel
  intersection of: Restriction
    on property: has origin
    some values from: fossil
subclass of: municipal waste fuel
definition: A fossil municipal waste fuel is an municipal waste fuel that has a fossil origin.
alternative label: non renewable municipal waste fuel
term tracker annotation: issue: https://github.com/OpenEnergyPlatform/ontology/issues/925 pull request: https://github.com/OpenEnergyPlatform/ontology/pull/961

Axiom
annotated source: fossil municipal waste fuel
annotated property: alternative label
annotated target: non renewable municipal waste fuel
editor note: Old class name kept as alternative term

nuclear binding energy
type: Class
subclass of: energy
subclass of: Restriction
  on property: has origin
  some values from: conventional
definition: Nuclear binding energy is the energy that is required to disassemble the nucleus of an atom into its component parts.
alternative label: kernphysikalische Bindungsenergie @de
definition source: Derived from https://en.wikipedia.org/w/index.php?title=Nuclear_binding_energy&oldid=1007327561
term tracker annotation: issue: https://github.com/OpenEnergyPlatform/ontology/issues/211 pull request: https://github.com/OpenEnergyPlatform/ontology/pull/225 conversion to nuclear binding energy issue: https://github.com/OpenEnergyPlatform/ontology/issues/522 pull request: https://github.com/OpenEnergyPlatform/ontology/pull/698

Axiom
annotated source: nuclear binding energy
annotated property: closeMatch
annotated target: ENVO_2000025
term tracker annotation: issue: https://github.com/OpenEnergyPlatform/ontology/issues/636 pull request: https://github.com/OpenEnergyPlatform/ontology/pull/810 Convert to skos:closeMatch issue: https://github.com/OpenEnergyPlatform/ontology/issues/636 pull request: https://github.com/OpenEnergyPlatform/ontology/pull/1879

nuclear fuel
type: Class
equivalent class: Class
  intersection of: fuel
  intersection of: Restriction
    on property: has disposition
    some values from: nuclear energy carrier disposition
subclass of: fuel
subclass of: Restriction
  on property: has quality
  some values from: nuclear binding energy
subclass of: Restriction
  on property: has disposition
  some values from: primary energy carrier disposition
definition: A nuclear fuel is a fuel that realises its fuel role in processes that release energy in the form of heat or work by undergoing nuclear fission.
alternative label: Kernbrennstoff @de
term tracker annotation: issue: https://github.com/OpenEnergyPlatform/ontology/issues/182 pull request: https://github.com/OpenEnergyPlatform/ontology/pull/237 added axiom 'has disposition' some 'primary energy carrier disposition' issue: https://github.com/OpenEnergyPlatform/ontology/issues/1032 pull request: https://github.com/OpenEnergyPlatform/ontology/pull/2095

nuclear power plant
type: Class
subclass of: power plant
subclass of: Restriction
  on property: has part
  some values from: nuclear power unit
definition: A nuclear power plant is a power plant that has nuclear power units as parts.
alternative label: Kernkraftwerk @de
term tracker annotation: issue: https://github.com/OpenEnergyPlatform/ontology/issues/750 pull request: https://github.com/OpenEnergyPlatform/ontology/pull/752

Axiom
annotated source: nuclear power plant
annotated property: closeMatch
annotated target: ENVO_00002271
term tracker annotation: issue: https://github.com/OpenEnergyPlatform/ontology/issues/636 pull request: https://github.com/OpenEnergyPlatform/ontology/pull/810

objective function
type: Class
subclass of: information content entity
definition: An objective function is an information content entity stating the function that should be maximised or minimised to solve a problem.
alternative label: Zielfunktion @de
term tracker annotation: issue: https://github.com/OpenEnergyPlatform/ontology/issues/725 pull request: https://github.com/OpenEnergyPlatform/ontology/pull/757

offshore wind farm
type: Class
subclass of: wind farm
disjoint with: onshore wind farm
definition: An offshore wind farm is a wind farm that is build in a body of water, usually the ocean.
alternative label: Offshore-Windpark @de

oil power plant
type: Class
subclass of: power plant
subclass of: Restriction
  on property: has part
  some values from: oil power unit
definition: A oil power plant is a power plant that has oil power units as parts.
alternative label: Ölkraftwerk @de
term tracker annotation: issue: https://github.com/OpenEnergyPlatform/ontology/issues/750 pull request: https://github.com/OpenEnergyPlatform/ontology/pull/752

onshore wind farm
type: Class
subclass of: wind farm
definition: An onshore wind farm is a wind farm that is build on land.
alternative label: Onshore-Windpark @de

open source
type: Class
subclass of: software descriptor
definition: open source is a software descriptor labelling software whose source code is available online for free and can be modified or redistributed.

optimisation
type: Class
subclass of: model calculation
subclass of: Restriction
  on property: has participant
  some values from: optimisation model
disjoint with: simulation
definition: An optimisation is a model calculation with the goal to find a best choice or result for at least one variable or function in the model.
alternative label: Optimierung @de
alternative label: optimization
term tracker annotation: Add 'has participant' axiom: pull request: https://github.com/OpenEnergyPlatform/ontology/pull/1410

optimisation model
type: Class
subclass of: numerical computer model
subclass of: Restriction
definition: An optimisation model is a model that optimises a target function.
alternative label: Optimierungsmodell @de
alternative label: optimization model

Axiom
annotated source: optimisation model
annotated property: subClassOf
annotated target: Restriction
term tracker annotation: issue: https://github.com/OpenEnergyPlatform/ontology/issues/415 pull request: https://github.com/OpenEnergyPlatform/ontology/pull/821

organisation role
type: Class
subclass of: role
definition: An organisation role is a role of an aggregate of people that has a collective goal and a set of organisation rules.
alternative label: organization role
term tracker annotation: issue: https://github.com/OpenEnergyPlatform/ontology/issues/314 pull request: https://github.com/OpenEnergyPlatform/ontology/pull/370 rework module structure issue: https://github.com/OpenEnergyPlatform/ontology/issues/1592 pull request: https://github.com/OpenEnergyPlatform/ontology/pull/1652 remove disjointness with person issue: https://github.com/OpenEnergyPlatform/ontology/issues/1702 pull request: https://github.com/OpenEnergyPlatform/ontology/pull/1716

origin
type: Class
subclass of: quality
subclass of: Restriction
  on property: characteristic of
  some values from: Class
    union of: energy
    union of: portion of matter
definition: Origin is a quality of a portion of matter or energy based on where it comes from. It is inherited from its primary sources.
alternative label: Ursprung @de
comment: * Biomass has a biogenic origin and if it is converted to biogas, the biogas inherits the the biogenic origin. * Hard coal has a fossil origin and if it is used in a coal power plant to generate electrical energy, the electrical energy inherits the fossil origin. * Wind energy has renewable origin and if it is converted to electrical energy using a wind turbine, the electrical energy inherits the renewable origin
term tracker annotation: issue: https://github.com/OpenEnergyPlatform/ontology/issues/108 pull request: https://github.com/OpenEnergyPlatform/ontology/pull/130 change def issue: https://github.com/OpenEnergyPlatform/ontology/issues/741 pull request: https://github.com/OpenEnergyPlatform/ontology/pull/861 change definition and add comment with examples: issue: https://github.com/OpenEnergyPlatform/ontology/issues/974 pull request: https://github.com/OpenEnergyPlatform/ontology/pull/976 Axiomatise relations between origin, energy and portion of matter: issue: https://github.com/OpenEnergyPlatform/ontology/issues/1183 pull request: https://github.com/OpenEnergyPlatform/ontology/pull/1192 Move to oeo-shared: issue: https://github.com/OpenEnergyPlatform/ontology/issues/1218 pull request: https://github.com/OpenEnergyPlatform/ontology/pull/1219 rework module structure issue: https://github.com/OpenEnergyPlatform/ontology/issues/1592 pull request: https://github.com/OpenEnergyPlatform/ontology/pull/1652 replaced 'has bearer' with 'characteristic of' issue: https://github.com/OpenEnergyPlatform/ontology/issues/1907 pull request: https://github.com/OpenEnergyPlatform/ontology/pull/1928

particulate matter
type: Class
subclass of: portion of matter
subclass of: Class
  union of: Restriction
    on property: has normal state of matter
    has value: OEO_00000256
  union of: Restriction
    on property: has normal state of matter
    has value: OEO_00000390
subclass of: Restriction
  on property: participates in
  some values from: air pollution
definition: Particulate matter is a portion of matter consisting of small particles. It can act as an air pollutant.
alternative label: Feinstaub @de
alternative label: PM
term tracker annotation: issue: https://github.com/OpenEnergyPlatform/ontology/issues/263 pull request: https://github.com/OpenEnergyPlatform/ontology/pull/356

Axiom
annotated source: particulate matter
annotated property: closeMatch
annotated target: ENVO_01000060
term tracker annotation: issue: https://github.com/OpenEnergyPlatform/ontology/issues/636 pull request: https://github.com/OpenEnergyPlatform/ontology/pull/810 Convert to skos:closeMatch issue: https://github.com/OpenEnergyPlatform/ontology/issues/636 pull request: https://github.com/OpenEnergyPlatform/ontology/pull/1879

peat
type: Class
subclass of: portion of matter
subclass of: Restriction
  on property: has part
  some values from: water
subclass of: Restriction
  on property: has role
  some values from: fuel role
subclass of: Restriction
  on property: has disposition
  some values from: combustible energy carrier disposition
subclass of: Restriction
  on property: has origin
  some values from: fossil
subclass of: Restriction
  on property: has normal state of matter
  has value: OEO_00000390
definition: Peat is a or portion of matter that is a soft, porous or compressed, sedimentary deposit of plant origin with high water content (up to 90 % in the raw state) and can be used as combustion fuel. As the natural formation of peat takes at least centuries, peat is usually considered having a fossil origin.
alternative label: Torf @de
definition source: REGULATION (EC) No 1099/2008 OF THE EUROPEAN PARLIAMENT AND OF THE COUNCIL of 22 October 2008 on energy statistics https://eur-lex.europa.eu/legal-content/EN/TXT/HTML/?uri=CELEX:32008R1099&from=EN
term tracker annotation: issue: https://github.com/OpenEnergyPlatform/ontology/issues/942 pull request: https://github.com/OpenEnergyPlatform/ontology/pull/1003

Axiom
annotated source: peat
annotated property: subClassOf
annotated target: Restriction
term tracker annotation: issue: https://github.com/OpenEnergyPlatform/ontology/issues/1032 pull request: https://github.com/OpenEnergyPlatform/ontology/pull/1033

Axiom
annotated source: peat
annotated property: closeMatch
annotated target: ENVO_00005774
term tracker annotation: issue: https://github.com/OpenEnergyPlatform/ontology/issues/636 pull request: https://github.com/OpenEnergyPlatform/ontology/pull/810 Convert to skos:closeMatch issue: https://github.com/OpenEnergyPlatform/ontology/issues/636 pull request: https://github.com/OpenEnergyPlatform/ontology/pull/1879

perfluorocarbon
type: Class
subclass of: portion of matter
subclass of: Restriction
  on property: has origin
  some values from: anthropogenic
definition: Perfluorocarbons (PFCs) are portions of matter consisting of organic compounds that contain fluorine atoms but no hydrogen atoms.
alternative label: PFC
alternative label: Perfluorcarbon @de
alternative label: perfluorierter Kohlenwasserstoff @de

person
type: Class
subclass of: object
disjoint with: organisation
definition: A person is a human being.
alternative label: Person @de
term tracker annotation: rework module structure issue: https://github.com/OpenEnergyPlatform/ontology/issues/1592 pull request: https://github.com/OpenEnergyPlatform/ontology/pull/1652 corrected disjointness issue: https://github.com/OpenEnergyPlatform/ontology/issues/1702 pull request: https://github.com/OpenEnergyPlatform/ontology/pull/1716

photovoltaic power plant
type: Class
subclass of: solar power plant
subclass of: Restriction
  on property: has part
  some values from: PV panel
definition: A photovoltaic power plant is a solar power plant that has PV panels as parts.
alternative label: Photovoltaikanlage @de
term tracker annotation: issue: https://github.com/OpenEnergyPlatform/ontology/issues/750 pull request: https://github.com/OpenEnergyPlatform/ontology/pull/752

plotting
type: Class
subclass of: data processing
definition: Plotting is data processing where data is visualised in form of a diagram.

political assumption
type: Class
subclass of: assumption
definition: A political assumption is an assumption about political measures taken.
alternative label: politische Annahme @de

political party
type: Class
subclass of: organisation
definition: A political party is an organisation of a group of people with common views or goals that wants to have influence in politics.
alternative label: politische Partei @de

pollution
type: Class
subclass of: emission
definition: Pollution is an emission with a negative effect on the environment or organisms.
alternative label: Verschmutzung @de
term tracker annotation: issue: https://github.com/OpenEnergyPlatform/ontology/issues/56 pull request: https://github.com/OpenEnergyPlatform/ontology/pull/234

Axiom
annotated source: pollution
annotated property: closeMatch
annotated target: ENVO_02500036
term tracker annotation: issue: https://github.com/OpenEnergyPlatform/ontology/issues/636 pull request: https://github.com/OpenEnergyPlatform/ontology/pull/810 Convert to skos:closeMatch issue: https://github.com/OpenEnergyPlatform/ontology/issues/636 pull request: https://github.com/OpenEnergyPlatform/ontology/pull/1879

portion of matter
type: Class
subclass of: object aggregate
subclass of: Restriction
  on property: has origin
  some values from: origin
definition: A portion of matter is an aggregate of material entities that have a state of matter.
editor note: Portions of matter describe mass nouns like e.g. water, air and fuel. Mass nouns are uncountable, but portions of these can be quantified, like 1 glass of water, 1 m³ of air or 1 barrel of fuel. For further explanation please refer to: https://github.com/OpenEnergyPlatform/ontology/wiki/Explanation-on-mass-nouns
comment: wiki page: https://github.com/OpenEnergyPlatform/ontology/wiki/Explanation-on-mass-nouns
term tracker annotation: issue: https://github.com/OpenEnergyPlatform/ontology/issues/227 pull request: https://github.com/OpenEnergyPlatform/ontology/pull/279 definition update and editor note: issue: https://github.com/OpenEnergyPlatform/ontology/issues/738 pull request: https://github.com/OpenEnergyPlatform/ontology/pull/759 Axiomatise relations between origin, energy and portion of matter: issue: https://github.com/OpenEnergyPlatform/ontology/issues/1183 pull request: https://github.com/OpenEnergyPlatform/ontology/pull/1192 Move to oeo-shared: issue: https://github.com/OpenEnergyPlatform/ontology/issues/1218 pull request: https://github.com/OpenEnergyPlatform/ontology/pull/1219 rework module structure issue: https://github.com/OpenEnergyPlatform/ontology/issues/1592 pull request: https://github.com/OpenEnergyPlatform/ontology/pull/1652

solid biofuel
type: Class
equivalent class: Class
  intersection of: biofuel
  intersection of: Restriction
    on property: has normal state of matter
    has value: OEO_00000390
subclass of: biofuel
subclass of: Restriction
  on property: has role
  some values from: fuel role
subclass of: Restriction
  on property: has disposition
  some values from: combustible energy carrier disposition
subclass of: Restriction
  on property: has origin
  some values from: biogenic
subclass of: Restriction
  on property: has normal state of matter
  has value: OEO_00000390
definition: Solid biomass is a portion of matter consisting of organic, non-fossil material of biological origin which may be used as fuel for heat production or electricity generation.
alternative label: biogener Festbrennstoff @de
alternative label: portion of solid biomass
alternative label: solid biomass
definition source: https://eur-lex.europa.eu/legal-content/EN/TXT/HTML/

Axiom
annotated source: solid biofuel
annotated property: subClassOf
annotated target: biofuel
term tracker annotation: Add `SubClass Of` axiom for `solid biofuel` issue: https://github.com/OpenEnergyPlatform/ontology/issues/1191 pull request: https://github.com/OpenEnergyPlatform/ontology/pull/1201

power
type: Class
subclass of: process attribute
subclass of: Restriction
  on property: process attribute of
  some values from: energy transformation
definition: Power is the process attribute that is the amount of energy transformed or transferred per time unit.
alternative label: Leistung @de
comment: Power is the derivative of energy transformation over time
term tracker annotation: classification: issue: https://github.com/OpenEnergyPlatform/ontology/issues/205 pull request: https://github.com/OpenEnergyPlatform/ontology/pull/386 definition: issue: https://github.com/OpenEnergyPlatform/ontology/issues/79 pull request: https://github.com/OpenEnergyPlatform/ontology/pull/369 moved to oeo-shared: issue: https://github.com/OpenEnergyPlatform/ontology/issues/1543 pull request: https://github.com/OpenEnergyPlatform/ontology/pull/1625 rework module structure issue: https://github.com/OpenEnergyPlatform/ontology/issues/1592 pull request: https://github.com/OpenEnergyPlatform/ontology/pull/1652

power generating unit
type: Class
equivalent class: Class
  intersection of: energy transformation unit
  intersection of: Restriction
    on property: has function
    some values from: electricity generation function
subclass of: energy transformation unit
subclass of: Restriction
  on property: has part
  some values from: generator
subclass of: Restriction
  on property: participates in
  some values from: energy transformation
subclass of: Restriction
  on property: participates in
  some values from: curtailment
definition: A power generating unit is an energy transformation unit that has the function to produce electrical energy.
alternative label: Kraftwerksblock @de
alternative label: block
term tracker annotation: issue: https://github.com/OpenEnergyPlatform/ontology/issues/173 pull request: https://github.com/OpenEnergyPlatform/ontology/pull/273 issue: https://github.com/OpenEnergyPlatform/ontology/issues/372 pull request: https://github.com/OpenEnergyPlatform/ontology/pull/646 subclass of energy transformation unit pull request: https://github.com/OpenEnergyPlatform/ontology/pull/895 change produces energy axiom to 'has energy output': issue: https://github.com/OpenEnergyPlatform/ontology/issues/994 pull request: https://github.com/OpenEnergyPlatform/ontology/pull/1006 remove "among other parts from definition" issue: https://github.com/OpenEnergyPlatform/ontology/issues/1258 pull request: https://github.com/OpenEnergyPlatform/ontology/issues/1259 New function-based definition: issue: https://github.com/OpenEnergyPlatform/ontology/issues/1254 https://github.com/OpenEnergyPlatform/ontology/pull/1360 rework module structure issue: https://github.com/OpenEnergyPlatform/ontology/issues/1592 pull request: https://github.com/OpenEnergyPlatform/ontology/pull/1652

Axiom
annotated source: power generating unit
annotated property: subClassOf
annotated target: Restriction
term tracker annotation: issue: https://github.com/OpenEnergyPlatform/ontology/issues/761 pull request: https://github.com/OpenEnergyPlatform/ontology/pull/782

power-to-gas system
type: Class
subclass of: OEO_00330009
subclass of: Restriction
  on property: has part
  some values from: water electrolyser
subclass of: Restriction
  on property: participates in
  some values from: power-to-gas process
definition: A power-to-gas system is a power-to-fuel system that implements a power-to-gas process. A water electrolyser is participating in the power-to-gas process.
alternative label: P2G
alternative label: PtG
alternative label: power to gas
alternative label: power-to-gas
term tracker annotation: issue: https://github.com/OpenEnergyPlatform/ontology/issues/940 pull request: https://github.com/OpenEnergyPlatform/ontology/pull/954 created new parent class 'power-to-fuel system' https://github.com/OpenEnergyPlatform/ontology/issues/1477 pull request: https://github.com/OpenEnergyPlatform/ontology/pull/1483

program parameter
type: Class
subclass of: variable
subclass of: Restriction
  on property: part of
  some values from: software
example of usage: Settings for a random number generator.
definition: A program parameter is a variable in a software.
alternative label: Programmparameter @de
term tracker annotation: Rework definition and change parent class: issue: https://github.com/OpenEnergyPlatform/ontology/issues/1199 pull request: https://github.com/OpenEnergyPlatform/ontology/pull/1274

project
type: Class
subclass of: process
definition: A project is a process to achieve a specified goal that is unique in the sum of its conditions like its goal, time and cost budget and its organisation.
alternative label: Projekt @de
term tracker annotation: issue: https://github.com/OpenEnergyPlatform/ontology/issues/247 pull request: https://github.com/OpenEnergyPlatform/ontology/pull/418 move to oeo-shared issue: https://github.com/OpenEnergyPlatform/ontology/issues/862 pull request: https://github.com/OpenEnergyPlatform/ontology/pull/869

prosumer
type: Class
subclass of: agent
definition: A prosumer is an agent who is producer and consumer at the same time.

pumped water
type: Class
subclass of: liquid water
subclass of: Restriction
  on property: has characteristic
  some values from: potential energy
subclass of: Restriction
  on property: has disposition
  some values from: secondary energy carrier disposition
subclass of: Restriction
  on property: is used by
  some values from: energy storage unit
definition: Pumped water is liquid water which was pumped into an upper reservoir and thus contains potential energy.
term tracker annotation: issue: https://github.com/OpenEnergyPlatform/ontology/issues/681 pull request: https://github.com/OpenEnergyPlatform/ontology/pull/755 add secondary energy carrier disposition issue: https://github.com/OpenEnergyPlatform/ontology/issues/1222 pull request: https://github.com/OpenEnergyPlatform/ontology/pull/1243 add potential energy axiom: issue: https://github.com/OpenEnergyPlatform/ontology/issues/1174 pull request: https://github.com/OpenEnergyPlatform/ontology/pull/1348

PV panel
type: Class
subclass of: solar power unit
subclass of: Restriction
  on property: has part
  some values from: photovoltaic cell
definition: A PV panel (photovoltaic panel) is a solar power unit absorbing sunlight as a source of energy to generate electricity.
alternative label: PV-Modul @de
alternative label: Photovoltaikmodul @de
comment: A photovoltaic (PV) module is a packaged, connected assembly of typically 6x10 photovoltaic solar cells. Photovoltaic modules constitute the photovoltaic array of a photovoltaic system that generates and supplies solar electricity in commercial and residential applications.
term tracker annotation: change produces energy axiom to 'has energy output': issue: https://github.com/OpenEnergyPlatform/ontology/issues/994 pull request: https://github.com/OpenEnergyPlatform/ontology/pull/1006

Axiom
annotated source: PV panel
annotated property: subClassOf
annotated target: Restriction
term tracker annotation: issue: https://github.com/OpenEnergyPlatform/ontology/issues/736 pull request: https://github.com/OpenEnergyPlatform/ontology/pull/766

quantity value
type: Class
subclass of: information content entity
subclass of: Restriction
  on property: has unit
  some values from: unit
definition: A quantity value is an information content entity defined by a numeral together with a unit of measurement to quantify an entity.
may be identical to: http://purl.obolibrary.org/obo/IAO_0000032
term tracker annotation: issue: https://github.com/OpenEnergyPlatform/ontology/issues/205 pull request: https://github.com/OpenEnergyPlatform/ontology/pull/386 issue: https://github.com/OpenEnergyPlatform/ontology/issues/495 pull request: https://github.com/OpenEnergyPlatform/ontology/pull/496 issue: https://github.com/OpenEnergyPlatform/ontology/issues/505 pull request: https://github.com/OpenEnergyPlatform/ontology/pull/518 issue: https://github.com/OpenEnergyPlatform/ontology/issues/1405 pull request: https://github.com/OpenEnergyPlatform/ontology/pull/1606 change axiom to oeo:unit issue: https://github.com/OpenEnergyPlatform/ontology/issues/2135 pull request: https://github.com/OpenEnergyPlatform/ontology/pull/2141

Axiom
annotated source: quantity value
annotated property: may be identical to
annotated target: http://purl.obolibrary.org/obo/IAO_0000032
term tracker annotation: issue: https://github.com/OpenEnergyPlatform/ontology/issues/636 pull request: https://github.com/OpenEnergyPlatform/ontology/pull/810

reference
type: Class
subclass of: information content entity
definition: A reference is an information content entity naming a relevant document, position in a document or address.
alternative label: Referenz @de

biogenic municipal waste fuel
type: Class
equivalent class: Class
  intersection of: municipal waste fuel
  intersection of: Restriction
    on property: has origin
    some values from: biogenic
subclass of: municipal waste fuel
subclass of: Restriction
  on property: has origin
  some values from: biogenic
definition: A biogenic municipal waste fuel is a municipal waste fuel that has a biogenic origin.
alternative label: renewable municipal waste fuel
term tracker annotation: remove origin pull request: https://github.com/OpenEnergyPlatform/ontology/pull/861 new definition: issue: https://github.com/OpenEnergyPlatform/ontology/issues/925 pull request: https://github.com/OpenEnergyPlatform/ontology/pull/961 rename class and change axiom: https://github.com/OpenEnergyPlatform/ontology/issues/872 https://github.com/OpenEnergyPlatform/ontology/pull/1048

rooftop photovoltaic power plant
type: Class
subclass of: photovoltaic power plant
definition: A rooftop photovoltaic power plant is a photovoltaic power plant that is installed on top of the roof of a building.
alternative label: Aufdach-PV-Anlage @de
alternative label: Aufdachphotovoltaikanlage @de

scenario
type: Class
subclass of: information content entity
subclass of: Restriction
  on property: is about
  some values from: analysis scope
definition: A scenario is an information content entity that contains statements about a possible future development based on a coherent and internally consistent set of assumptions and their motivation.
alternative label: Szenario @de
alternative label: narrative
alternative label: storyline
term tracker annotation: issue: https://github.com/OpenEnergyPlatform/ontology/issues/328 pull request: https://github.com/OpenEnergyPlatform/ontology/pull/344 add is about-relation pull request: https://github.com/OpenEnergyPlatform/ontology/pull/764 Add 'narrative' and 'storyline' as alternative label issue: https://github.com/OpenEnergyPlatform/ontology/issues/1232 pull request: https://github.com/OpenEnergyPlatform/ontology/pull/1296 rework module structure issue: https://github.com/OpenEnergyPlatform/ontology/issues/1592 pull request: https://github.com/OpenEnergyPlatform/ontology/pull/1652

scenario factsheet
type: Class
subclass of: factsheet
subclass of: Restriction
  on property: is about
  some values from: scenario
definition: A scenario factsheet is a factsheet that contains information about a scenario.
term tracker annotation: issue: https://github.com/OpenEnergyPlatform/ontology/issues/414 pull request: https://github.com/OpenEnergyPlatform/ontology/pull/440 pull request: https://github.com/OpenEnergyPlatform/ontology/pull/584

sector
type: Class
subclass of: generically dependent continuant
definition: A sector is generically dependent continuant that is a subdivision of a system.
alternative label: Sektor @de
term tracker annotation: issue: https://github.com/OpenEnergyPlatform/ontology/issues/30 pull request: https://github.com/OpenEnergyPlatform/ontology/pull/477 moved to oeo-shared pull request: https://github.com/OpenEnergyPlatform/ontology/pull/764 rework module structure issue: https://github.com/OpenEnergyPlatform/ontology/issues/1592 pull request: https://github.com/OpenEnergyPlatform/ontology/pull/1652 move to oeo-sector issue: https://github.com/OpenEnergyPlatform/ontology/issues/1399 pull request: https://github.com/OpenEnergyPlatform/ontology/pull/1724

sector division
type: Class
subclass of: generically dependent continuant
subclass of: Restriction
  on property: is defined by
  some values from: Class
    union of: person
    union of: organisation
definition: A sector division is a specific way to subdivide a system.
alternative label: Sektorunterteilung @de
term tracker annotation: issue: https://github.com/OpenEnergyPlatform/ontology/issues/30 Move to oeo-shared: issue: https://github.com/OpenEnergyPlatform/ontology/issues/1400 pull request: https://github.com/OpenEnergyPlatform/ontology/pull/1463 Add relation to organisation or person: issue: https://github.com/OpenEnergyPlatform/ontology/issues/1449 pull request: https://github.com/OpenEnergyPlatform/ontology/pull/1506 rework module structure issue: https://github.com/OpenEnergyPlatform/ontology/issues/1592 pull request: https://github.com/OpenEnergyPlatform/ontology/pull/1652 move to oeo-sector issue: https://github.com/OpenEnergyPlatform/ontology/issues/1399 pull request: https://github.com/OpenEnergyPlatform/ontology/pull/1724

simulation
type: Class
subclass of: model calculation
subclass of: Restriction
  on property: has participant
  some values from: simulation model
definition: A simulation is a model calculation that simulates a process or system behaviour from the real world.
alternative label: Simulation @de
term tracker annotation: Add 'has participant' axiom: pull request: https://github.com/OpenEnergyPlatform/ontology/pull/1410

simulation model
type: Class
subclass of: numerical computer model
subclass of: Class
definition: A simulation model is a model that simulates the behaviour of a system without a target function.
alternative label: Simulationsmodell @de

Axiom
annotated source: simulation model
annotated property: subClassOf
annotated target: Class
term tracker annotation: issue: https://github.com/OpenEnergyPlatform/ontology/issues/415 pull request: https://github.com/OpenEnergyPlatform/ontology/pull/821

single node model
type: Class
subclass of: numerical computer model
definition: A single node model is a model where a region is represented as a single node.
term tracker annotation: issue: https://github.com/OpenEnergyPlatform/ontology/issues/337 pull request: https://github.com/OpenEnergyPlatform/ontology/pull/358

superconducting magnetic energy storage
type: Class
subclass of: energy storage object
subclass of: Restriction
  on property: has function
  some values from: electrical energy storage function
definition: A superconducting magnetic energy storage (SMES) is an energy storage object that stores electrical energy in the magnetic field of a superconducting magnet.
alternative label: SMES
term tracker annotation: Shorten definition and new label: issue: https://github.com/OpenEnergyPlatform/ontology/issues/1349 pull request: https://github.com/OpenEnergyPlatform/ontology/pull/1396 add axiom issue: https://github.com/OpenEnergyPlatform/ontology/issues/1572 pull request: https://github.com/OpenEnergyPlatform/ontology/pull/1728

sodium-ion battery
type: Class
subclass of: battery
definition: A sodium-ion battery is a rechargeable metal-ion battery that uses sodium ions as charge carriers.
alternative label: Natrium-Ionen-Batterie @de
alternative label: SIB
definition source: https://en.wikipedia.org/w/index.php
term tracker annotation: issue: https://github.com/OpenEnergyPlatform/ontology/issues/773 pull request: https://github.com/OpenEnergyPlatform/ontology/pull/801

sodium-sulphur battery
type: Class
subclass of: molten-salt battery
definition: A sodium–sulphur battery is a type of molten-salt battery constructed from liquid sodium (Na) and sulphur (S). This type of battery has a high energy density, high efficiency of charge/discharge and long cycle life, and is fabricated from inexpensive materials. The operating temperatures of 300 to 350 °C and the highly corrosive nature of the sodium polysulphides, primarily make them suitable for stationary energy storage applications. The cell becomes more economical with increasing size.
alternative label: Natrium-Schwefel-Batterie @de
alternative label: sodium–sulfur battery
definition source: https://en.wikipedia.org/w/index.php
term tracker annotation: reclassification issue: https://github.com/OpenEnergyPlatform/ontology/issues/773 pull request: https://github.com/OpenEnergyPlatform/ontology/pull/801

software descriptor
type: Class
subclass of: information content entity
definition: A software descriptor is an information content entity that contains additional information about the software.

software developer
type: Class
subclass of: agent
definition: A software developer is an agent that creates computer software.
alternative label: Software-Entwickler @de
alternative label: Software-Entwicklerin @de

software documentation
type: Class
subclass of: document
subclass of: Restriction
  on property: has licence
  some values from: creative work licence
alternative label: Softwaredokumentation @de
comment: A software documentation is a document containing explanations and tutorials how to use a program and is delivered with that program.
term tracker annotation: issue: https://github.com/OpenEnergyPlatform/ontology/issues/251 pull request: https://github.com/OpenEnergyPlatform/ontology/pull/285 Add 'has licence' axiom: issue: https://github.com/OpenEnergyPlatform/ontology/issues/1275 pull request: https://github.com/OpenEnergyPlatform/ontology/pull/1547

software framework
type: Class
subclass of: software
definition: A software framework is a Software that is generic and can be adapted to a specific application.
term tracker annotation: issue: https://github.com/OpenEnergyPlatform/ontology/issues/262 pull request: https://github.com/OpenEnergyPlatform/ontology/pull/286

solar energy
type: Class
subclass of: radiative energy
subclass of: Restriction
  on property: characteristic of
  some values from: OEO_00230021
subclass of: Restriction
  on property: has origin
  some values from: renewable
definition: Solar energy is radiative energy of the sun.
alternative label: Solarenergie @de
term tracker annotation: issue: https://github.com/OpenEnergyPlatform/ontology/issues/211 pull request: https://github.com/OpenEnergyPlatform/ontology/pull/225 restructure solar energy issue: https://github.com/OpenEnergyPlatform/ontology/issues/663 pull request: https://github.com/OpenEnergyPlatform/ontology/pull/672 remove disposition renewable fuel issue: https://github.com/OpenEnergyPlatform/ontology/issues/726 pull request: https://github.com/OpenEnergyPlatform/ontology/pull/732 added axiom issue: https://github.com/OpenEnergyPlatform/ontology/issues/1600 pull request: https://github.com/OpenEnergyPlatform/ontology/pull/1620 replaced 'has bearer' with 'characteristic of' issue: https://github.com/OpenEnergyPlatform/ontology/issues/1907 pull request: https://github.com/OpenEnergyPlatform/ontology/pull/1928

solar power plant
type: Class
subclass of: power plant
subclass of: Restriction
  on property: has part
  some values from: solar power unit
definition: A solar power plant is a power plant that has solar power units as parts.
alternative label: Solarkraftwerk @de
term tracker annotation: issue: https://github.com/OpenEnergyPlatform/ontology/issues/750 pull request: https://github.com/OpenEnergyPlatform/ontology/pull/752

Axiom
annotated source: solar power plant
annotated property: closeMatch
annotated target: ENVO_2000041
term tracker annotation: issue: https://github.com/OpenEnergyPlatform/ontology/issues/636 pull request: https://github.com/OpenEnergyPlatform/ontology/pull/810 Convert to skos:closeMatch issue: https://github.com/OpenEnergyPlatform/ontology/issues/636 pull request: https://github.com/OpenEnergyPlatform/ontology/pull/1879

solar thermal collector
type: Class
subclass of: heater
subclass of: Restriction
  on property: has part
  some values from: solar radiation receiving surface
definition: A solar thermal collector is a heater that converts solar energy to solar thermal energy.
alternative label: Solarkollektor @de
definition source: https://en.wikipedia.org/w/index.php
term tracker annotation: change produces energy and uses energy axioms to 'has energy output' and 'has energy input': issue: https://github.com/OpenEnergyPlatform/ontology/issues/994 pull request: https://github.com/OpenEnergyPlatform/ontology/pull/1006 add axiom to 'has part some solar radiation receiving surface' issue: https://github.com/OpenEnergyPlatform/ontology/issues/1074 pull request: https://github.com/OpenEnergyPlatform/ontology/pull/1228 improve definition: issue: https://github.com/OpenEnergyPlatform/ontology/issues/1254 https://github.com/OpenEnergyPlatform/ontology/pull/1432

Axiom
annotated source: solar thermal collector
annotated property: subClassOf
annotated target: Restriction
term tracker annotation: issue: https://github.com/OpenEnergyPlatform/ontology/issues/761 pull request: https://github.com/OpenEnergyPlatform/ontology/pull/782

Axiom
annotated source: solar thermal collector
annotated property: subClassOf
annotated target: Restriction
term tracker annotation: issue: https://github.com/OpenEnergyPlatform/ontology/issues/761 pull request: https://github.com/OpenEnergyPlatform/ontology/pull/782

Axiom
annotated source: solar thermal collector
annotated property: subClassOf
annotated target: Restriction
term tracker annotation: issue: https://github.com/OpenEnergyPlatform/ontology/issues/761 pull request: https://github.com/OpenEnergyPlatform/ontology/pull/782

solar thermal energy
type: Class
subclass of: thermal energy
subclass of: Restriction
  on property: has origin
  some values from: renewable
definition: Solar thermal energy is thermal energy that is the physical output of a solar thermal energy transformation.
alternative label: Solarthermie @de
alternative label: solarthermische Energie @de
term tracker annotation: issue: https://github.com/OpenEnergyPlatform/ontology/issues/393 pull request: https://github.com/OpenEnergyPlatform/ontology/pull/770

solar thermal power plant
type: Class
subclass of: solar power plant
subclass of: Restriction
  on property: has part
  some values from: solar thermal power unit
subclass of: Restriction
  on property: has part
  some values from: steam turbine
definition: A solar thermal power plant is a solar power plant that has solar thermal power units as parts.
alternative label: solarthermisches Kraftwerk @de
term tracker annotation: issue: https://github.com/OpenEnergyPlatform/ontology/issues/750 pull request: https://github.com/OpenEnergyPlatform/ontology/pull/752

solid fossil fuel
type: Class
equivalent class: Class
  intersection of: fossil combustion fuel
  intersection of: Restriction
    on property: has normal state of matter
    has value: OEO_00000390
subclass of: fossil combustion fuel
subclass of: Restriction
  on property: has origin
  some values from: fossil
subclass of: Restriction
  on property: has normal state of matter
  has value: OEO_00000390
definition: A solid fossil fuel is a fossil fuel that has a solid state of matter under normal conditions.
alternative label: fossiler Festbrennstoff @de
term tracker annotation: issue: https://github.com/OpenEnergyPlatform/ontology/issues/106 pull request: https://github.com/OpenEnergyPlatform/ontology/pull/164 Update definition and axioms: pull request: https://github.com/OpenEnergyPlatform/ontology/pull/931

solver
type: Class
subclass of: software
definition: A solver is a software that solves a mathematical problem.
alternative label: Solver @de

state of matter
type: Class
subclass of: quality
subclass of: Restriction
  on property: characteristic of
  some values from: portion of matter
definition: A state of matter is a quality of a portion of matter that describes the distinct physical form in which the matter exists.
editor note: Four states of matter are observable in everyday life: solid, liquid, gas, and plasma. Many intermediate states are known to exist, such as liquid crystal, and some states only exist under extreme conditions.
alternative label: Aggregatzustand @de
definition source: https://en.wikipedia.org/w/index.php
term tracker annotation: issue: https://github.com/OpenEnergyPlatform/ontology/issues/38 pull request: https://github.com/OpenEnergyPlatform/ontology/pull/39 add 'has bearer' axiom issue: https://github.com/OpenEnergyPlatform/ontology/issues/1305 pull request: https://github.com/OpenEnergyPlatform/ontology/pull/1310 move to oeo-shared: issue: https://github.com/OpenEnergyPlatform/ontology/issues/1384 pull request: https://github.com/OpenEnergyPlatform/ontology/pull/1390 rework module structure issue: https://github.com/OpenEnergyPlatform/ontology/issues/1592 pull request: https://github.com/OpenEnergyPlatform/ontology/pull/1652 make definition aristotelian issue: https://github.com/OpenEnergyPlatform/ontology/issues/1672 pull request: https://github.com/OpenEnergyPlatform/ontology/pull/1720 replaced 'has bearer' with 'characteristic of' issue: https://github.com/OpenEnergyPlatform/ontology/issues/1907 pull request: https://github.com/OpenEnergyPlatform/ontology/pull/1928

steam turbine
type: Class
subclass of: turbine
subclass of: Restriction
definition: A steam turbine is a turbine that converts heat from pressurised steam into rotational energy.
alternative label: Dampfturbine @de
term tracker annotation: change produces energy and uses energy axioms to 'has energy output' and ' has energy input': issue: https://github.com/OpenEnergyPlatform/ontology/issues/994 pull request: https://github.com/OpenEnergyPlatform/ontology/pull/1006

Axiom
annotated source: steam turbine
annotated property: subClassOf
annotated target: Restriction
term tracker annotation: issue: https://github.com/OpenEnergyPlatform/ontology/issues/761 pull request: https://github.com/OpenEnergyPlatform/ontology/pull/782

Axiom
annotated source: steam turbine
annotated property: subClassOf
annotated target: Restriction
term tracker annotation: issue: https://github.com/OpenEnergyPlatform/ontology/issues/761 pull request: https://github.com/OpenEnergyPlatform/ontology/pull/782

Axiom
annotated source: steam turbine
annotated property: subClassOf
annotated target: Restriction
term tracker annotation: issue: https://github.com/OpenEnergyPlatform/ontology/issues/761 pull request: https://github.com/OpenEnergyPlatform/ontology/pull/782

Axiom
annotated source: steam turbine
annotated property: subClassOf
annotated target: Restriction
term tracker annotation: issue: https://github.com/OpenEnergyPlatform/ontology/issues/787 pull request: https://github.com/OpenEnergyPlatform/ontology/pull/817 issue: https://github.com/OpenEnergyPlatform/ontology/issues/736 pull request: https://github.com/OpenEnergyPlatform/ontology/pull/766 issue: https://github.com/OpenEnergyPlatform/ontology/issues/761 pull request: https://github.com/OpenEnergyPlatform/ontology/pull/782

energy storage unit
type: Class
equivalent class: Class
  intersection of: grid component
  intersection of: Restriction
    on property: has function
    some values from: energy storage function
subclass of: grid component
subclass of: Restriction
  on property: part of
  some values from: supply grid
definition: An energy storage unit is a grid component that stores energy.
term tracker annotation: Make equivalent class: issue: https://github.com/OpenEnergyPlatform/ontology/issues/1338 pull request: https://github.com/OpenEnergyPlatform/ontology/pull/1348 Changed 'storage unit' to 'energy storage unit' issue: https://github.com/OpenEnergyPlatform/ontology/issues/1466 pull request: https://github.com/OpenEnergyPlatform/ontology/pull/1486

sub bituminous coal
type: Class
subclass of: coal
definition: Sub bituminous coal is coal that is non-agglomerating with a gross calorific value between 17 435 kJ/kg (4 165 kcal/kg) and 23 865 kJ/kg (5 700 kcal/kg) containing more than 31 % volatile matter on a dry mineral matter free basis.
definition source: REGULATION (EC) No 1099/2008 OF THE EUROPEAN PARLIAMENT AND OF THE COUNCIL of 22 October 2008 on energy statistics https://eur-lex.europa.eu/legal-content/EN/TXT/HTML/?uri=CELEX:32008R1099&from=EN

Axiom
annotated source: sub bituminous coal
annotated property: closeMatch
annotated target: ENVO_2000009
term tracker annotation: issue: https://github.com/OpenEnergyPlatform/ontology/issues/636 pull request: https://github.com/OpenEnergyPlatform/ontology/pull/810 Convert to skos:closeMatch issue: https://github.com/OpenEnergyPlatform/ontology/issues/636 pull request: https://github.com/OpenEnergyPlatform/ontology/pull/1879

synthetic data set
type: Class
subclass of: data set
example of usage: The projected power usage during an idealised model year.
definition: A synthetic data set is a dataset that is obtained by artificially creating data items. It is constructed to be an estimation of a real-world dataset.
alternative label: synthetischer Datensatz @de
term tracker annotation: Harmonise label: https://github.com/OpenEnergyPlatform/ontology/pull/1463 rework module structure issue: https://github.com/OpenEnergyPlatform/ontology/issues/1592 pull request: https://github.com/OpenEnergyPlatform/ontology/pull/1652

commercial sector
type: Class
subclass of: energy demand sector
definition: A commercial sector is a sector that covers non-industrial commercial activities.
alternative label: TCS sector
alternative label: kommerzieller Sektor @de
alternative label: service sector
alternative label: trading, commerce and service sector
term tracker annotation: issue: https://github.com/OpenEnergyPlatform/ontology/issues/30 pull request: https://github.com/OpenEnergyPlatform/ontology/pull/484 move to oeo-sector issue: https://github.com/OpenEnergyPlatform/ontology/issues/1399 pull request: https://github.com/OpenEnergyPlatform/ontology/pull/1724

technology
type: Class
subclass of: plan specification
subclass of: Restriction
  on property: is about
  some values from: Class
    intersection of: artificial object
    intersection of: Restriction
      on property: participates in
      some values from: process
definition: A technology is a plan specification that describes how to combine artificial objects or other material entities and processes in a specific way.
alternative label: Technologie @de
term tracker annotation: issue: https://github.com/OpenEnergyPlatform/ontology/issues/136 pull request: https://github.com/OpenEnergyPlatform/ontology/pull/334 moved to oeo-shared, change definition, reclassify, add axiom issue: https://github.com/OpenEnergyPlatform/ontology/issues/1572 pull request: https://github.com/OpenEnergyPlatform/ontology/pull/1591 rework module structure issue: https://github.com/OpenEnergyPlatform/ontology/issues/1592 pull request: https://github.com/OpenEnergyPlatform/ontology/pull/1652

test data set
type: Class
subclass of: data set
definition: A test data set is a data set used for testing.
alternative label: Testdatensatz @de
term tracker annotation: Harmonise label: https://github.com/OpenEnergyPlatform/ontology/pull/1463

transformation
type: Class
subclass of: process
subclass of: Restriction
  on property: has input
  some values from: continuant
subclass of: Restriction
  on property: has output
  some values from: continuant
definition: A transformation is a process that transforms one or more inputs into at least one output.
alternative label: Umwandlung @de
term tracker annotation: issue: https://github.com/OpenEnergyPlatform/ontology/issues/435 pull request: https://github.com/OpenEnergyPlatform/ontology/pull/450 input and output axioms: issue: https://github.com/OpenEnergyPlatform/ontology/issues/1167 pull request: https://github.com/OpenEnergyPlatform/ontology/pull/1178 rework module structure issue: https://github.com/OpenEnergyPlatform/ontology/issues/1592 pull request: https://github.com/OpenEnergyPlatform/ontology/pull/1652

transformer
type: Class
subclass of: grid component
subclass of: Restriction
  on property: part of
  some values from: electricity grid
definition: A transformer is an electricity grid component that passively transfers electrical energy from one electrical circuit to another.
alternative label: Transformator @de
comment: Source: https://en.wikipedia.org/wiki/Transformer
term tracker annotation: issue: https://github.com/OpenEnergyPlatform/ontology/issues/231 pull request: https://github.com/OpenEnergyPlatform/ontology/pull/385

transport sector
type: Class
subclass of: energy demand sector
definition: A transport sector is a sector that covers transport of people and/or goods.
alternative label: Verkehrssektor @de
alternative label: traffic sector
term tracker annotation: issue: https://github.com/OpenEnergyPlatform/ontology/issues/30 pull request: https://github.com/OpenEnergyPlatform/ontology/pull/484 move to oeo-sector issue: https://github.com/OpenEnergyPlatform/ontology/issues/1399 pull request: https://github.com/OpenEnergyPlatform/ontology/pull/1724

electricity transshipment model
type: Class
subclass of: numerical computer model
subclass of: Restriction
definition: An electricity transshipment model is a model that applies the transshipment problem to the electricity grid.
term tracker annotation: issue: https://github.com/OpenEnergyPlatform/ontology/issues/337 pull request: https://github.com/OpenEnergyPlatform/ontology/pull/358 rework module structure issue: https://github.com/OpenEnergyPlatform/ontology/issues/1592 pull request: https://github.com/OpenEnergyPlatform/ontology/pull/1652

Axiom
annotated source: electricity transshipment model
annotated property: subClassOf
annotated target: Restriction
term tracker annotation: issue: https://github.com/OpenEnergyPlatform/ontology/issues/415 pull request: https://github.com/OpenEnergyPlatform/ontology/pull/821

turbine
type: Class
subclass of: energy converting component
subclass of: Restriction
definition: A turbine is an energy converting component that converts energy from a moving fluid flow into rotational energy.
alternative label: Turbine @de
term tracker annotation: use energy converting component in definition: https://github.com/OpenEnergyPlatform/ontology/pull/993 change produces energy axiom to 'has energy output': issue: https://github.com/OpenEnergyPlatform/ontology/issues/994 pull request: https://github.com/OpenEnergyPlatform/ontology/pull/1006

Axiom
annotated source: turbine
annotated property: subClassOf
annotated target: Restriction
term tracker annotation: issue: https://github.com/OpenEnergyPlatform/ontology/issues/763 pull request: https://github.com/OpenEnergyPlatform/ontology/pull/769

Axiom
annotated source: turbine
annotated property: subClassOf
annotated target: Restriction
term tracker annotation: issue: https://github.com/OpenEnergyPlatform/ontology/issues/787 pull request: https://github.com/OpenEnergyPlatform/ontology/pull/817 issue: https://github.com/OpenEnergyPlatform/ontology/issues/761 pull request: https://github.com/OpenEnergyPlatform/ontology/pull/782

underground hydrogen storage object
type: Class
subclass of: underground fuel storage object
subclass of: Restriction
  on property: uses
  some values from: hydrogen
definition: An underground hydrogen storage is an underground fuel storage object that stores hydrogen. Examples are underground caverns, salt domes and depleted oil/gas fields.
alternative label: unterirdischer Wasserstoffspeicher @de
definition source: https://en.wikipedia.org/w/index.php
term tracker annotation: Issue:https://github.com/OpenEnergyPlatform/ontology/issues/448 Pull request: https://github.com/OpenEnergyPlatform/ontology/pull/462 Improve definition and classification: issue: https://github.com/OpenEnergyPlatform/ontology/issues/1262 pull request: https://github.com/OpenEnergyPlatform/ontology/pull/1348

user
type: Class
subclass of: agent
definition: A user is an agent that employs an aid, tool or information system to achieve a goal/benefit.
alternative label: Benutzer @de
alternative label: Benutzerin @de

user documentation
type: Class
subclass of: software documentation
definition: A user documentation is a documentation intended to assist users in using the software.
alternative label: Benutzerdokumentation @de

variable
type: Class
subclass of: information content entity
definition: A variable is an information content entity that represents a changeable value, vector, matrix or function within a mathematical expression.
alternative label: Variable @de

volatile organic compound
type: Class
equivalent class: Class
  union of: methane
  union of: non-methane volatile organic compound
subclass of: portion of matter
subclass of: Class
  intersection of: portion of matter
  intersection of: Restriction
    on property: has disposition
    some values from: volatility
subclass of: Restriction
  on property: participates in
  some values from: air pollution
definition: A volatile organic compound (VOC) is a portion of matter consisting of organic compounds that is capable of producing photochemical oxidants by reactions with nitrogen oxides in the presence of sunlight. Hence it can act as an air pollutant.
alternative label: VOC
alternative label: flüchtige organische Verbindungen @de
definition source: This definition is partly based on Article 2 of the European Air Quality Directive (2008/50/EC): https://eur-lex.europa.eu/legal-content/EN/TXT/?uri=CELEX:32008L0050
may be identical to: http://purl.obolibrary.org/obo/CHEBI_134179
term tracker annotation: issue: https://github.com/OpenEnergyPlatform/ontology/issues/263 pull request: https://github.com/OpenEnergyPlatform/ontology/pull/356

Axiom
annotated source: volatile organic compound
annotated property: subClassOf
annotated target: portion of matter
term tracker annotation: Add `SubClass Of` axiom for `volatile organic compound` issue: https://github.com/OpenEnergyPlatform/ontology/issues/1191 pull request: https://github.com/OpenEnergyPlatform/ontology/pull/1201

Axiom
annotated source: volatile organic compound
annotated property: may be identical to
annotated target: http://purl.obolibrary.org/obo/CHEBI_134179
term tracker annotation: issue: https://github.com/OpenEnergyPlatform/ontology/issues/636 pull request: https://github.com/OpenEnergyPlatform/ontology/pull/810

waste fuel
type: Class
equivalent class: Class
  intersection of: fuel
  intersection of: Restriction
    on property: has role
    some values from: waste role
subclass of: fuel
subclass of: Restriction
  on property: has disposition
  some values from: combustible energy carrier disposition
definition: A waste fuel is a fuel in which the material entity is waste.
alternative label: Abfallbrennstoff @de
comment: The energy content of waste fuel is typically released by incineration or gasification. The energy content of nuclear waste is not considered as a waste fuel.
term tracker annotation: label and definition: issue: https://github.com/OpenEnergyPlatform/ontology/issues/132 pull request: https://github.com/OpenEnergyPlatform/ontology/pull/207 comment: issue: https://github.com/OpenEnergyPlatform/ontology/issues/629 pull request: https://github.com/OpenEnergyPlatform/ontology/pull/631

Axiom
annotated source: waste fuel
annotated property: subClassOf
annotated target: fuel
term tracker annotation: Add `SubClass Of` axiom for `waste fuel` issue: https://github.com/OpenEnergyPlatform/ontology/issues/1191 pull request: https://github.com/OpenEnergyPlatform/ontology/pull/1201

waste power plant
type: Class
subclass of: power plant
subclass of: Restriction
  on property: has part
  some values from: waste power unit
definition: A waste power plant is a power plant that has waste power units as parts.
alternative label: Müllkraftwerk @de
term tracker annotation: issue: https://github.com/OpenEnergyPlatform/ontology/issues/750 pull request: https://github.com/OpenEnergyPlatform/ontology/pull/752

water
type: Class
subclass of: portion of matter
subclass of: Restriction
  on property: has disposition
  some values from: primary energy carrier disposition
subclass of: Restriction
  on property: has normal state of matter
  has value: OEO_00000256
definition: Water is a portion of matter with the chemical formula H2O. It has a liquid normal state of matter.
editor note: We are aware that water is defined as pure H2O in the OEO and that naturally occurring water usually also contains impurities of other portions of matter (e.g. minerals). We purposely neglect this inconsistency for usability reasons.
alternative label: H2O
alternative label: Wasser @de
may be identical to: http://purl.obolibrary.org/obo/CHEBI_15377
term tracker annotation: definition: issue: https://github.com/OpenEnergyPlatform/ontology/issues/685 pull request: https://github.com/OpenEnergyPlatform/ontology/pull/689 add origin issue: https://github.com/OpenEnergyPlatform/ontology/issues/515 pull request: https://github.com/OpenEnergyPlatform/ontology/pull/684 remove origin pull request: https://github.com/OpenEnergyPlatform/ontology/pull/861 added axiom 'has disposition' some 'primary energy carrier disposition' issue: https://github.com/OpenEnergyPlatform/ontology/issues/1032 pull request: https://github.com/OpenEnergyPlatform/ontology/pull/2095

Axiom
annotated source: water
annotated property: editor note
annotated target: We are aware that water is defined as pure H2O in the OEO and that naturally occurring water usually also contains impurities of other portions of matter (e.g. minerals). We purposely neglect this inconsistency for usability reasons.
term tracker annotation: issue: https://github.com/OpenEnergyPlatform/ontology/issues/1081 pull request: https://github.com/OpenEnergyPlatform/ontology/pull/1099

Axiom
annotated source: water
annotated property: alternative label
annotated target: H2O
term tracker annotation: issue: https://github.com/OpenEnergyPlatform/ontology/issues/636 pull request: https://github.com/OpenEnergyPlatform/ontology/pull/810

Axiom
annotated source: water
annotated property: may be identical to
annotated target: http://purl.obolibrary.org/obo/CHEBI_15377
term tracker annotation: issue: https://github.com/OpenEnergyPlatform/ontology/issues/636 pull request: https://github.com/OpenEnergyPlatform/ontology/pull/810

water turbine
type: Class
subclass of: turbine
subclass of: Restriction
definition: A water turbine is a turbine converting potential energy and kinetic energy of water into rotational energy.
alternative label: Wasserkraftturbine @de
term tracker annotation: issue: https://github.com/OpenEnergyPlatform/ontology/issues/299 pull request: https://github.com/OpenEnergyPlatform/ontology/pull/300 issue: https://github.com/OpenEnergyPlatform/ontology/issues/78 pull request: https://github.com/OpenEnergyPlatform/ontology/pull/758 change produces energy and uses energy axioms to 'has energy output' and 'has energy input': issue: https://github.com/OpenEnergyPlatform/ontology/issues/994 pull request: https://github.com/OpenEnergyPlatform/ontology/pull/1006

Axiom
annotated source: water turbine
annotated property: subClassOf
annotated target: Restriction
term tracker annotation: issue: https://github.com/OpenEnergyPlatform/ontology/issues/761 pull request: https://github.com/OpenEnergyPlatform/ontology/pull/782

Axiom
annotated source: water turbine
annotated property: subClassOf
annotated target: Restriction
term tracker annotation: issue: https://github.com/OpenEnergyPlatform/ontology/issues/736 pull request: https://github.com/OpenEnergyPlatform/ontology/pull/766

Axiom
annotated source: water turbine
annotated property: subClassOf
annotated target: Restriction
term tracker annotation: issue: https://github.com/OpenEnergyPlatform/ontology/issues/787 pull request: https://github.com/OpenEnergyPlatform/ontology/pull/817 issue: https://github.com/OpenEnergyPlatform/ontology/issues/736 pull request: https://github.com/OpenEnergyPlatform/ontology/pull/766 issue: https://github.com/OpenEnergyPlatform/ontology/issues/761 pull request: https://github.com/OpenEnergyPlatform/ontology/pull/782

wind energy
type: Class
subclass of: OEO_00230020
subclass of: Restriction
  on property: characteristic of
  some values from: air
subclass of: Restriction
  on property: has origin
  some values from: renewable
subclass of: Restriction
  on property: is energy input to
  some values from: wind energy transformation
definition: Wind energy is the kinetic energy of moving air.
alternative label: Windenergie @de
term tracker annotation: issue: https://github.com/OpenEnergyPlatform/ontology/issues/211 pull request: https://github.com/OpenEnergyPlatform/ontology/pull/225 reclassify and change def issue: https://github.com/OpenEnergyPlatform/ontology/issues/662 pull request: https://github.com/OpenEnergyPlatform/ontology/pull/666 remove disposition renewable fuel issue: https://github.com/OpenEnergyPlatform/ontology/issues/726 pull request: https://github.com/OpenEnergyPlatform/ontology/pull/732 add and change axioms pull request: https://github.com/OpenEnergyPlatform/ontology/pull/1065 added axiom issue: https://github.com/OpenEnergyPlatform/ontology/issues/1600 pull request: https://github.com/OpenEnergyPlatform/ontology/pull/1620 replaced 'has bearer' with 'characteristic of' issue: https://github.com/OpenEnergyPlatform/ontology/issues/1907 pull request: https://github.com/OpenEnergyPlatform/ontology/pull/1928

Axiom
annotated source: wind energy
annotated property: subClassOf
annotated target: Restriction
term tracker annotation: change axiom to 'participates in' issue: https://github.com/OpenEnergyPlatform/ontology/issues/850 pull request: https://github.com/OpenEnergyPlatform/ontology/pull/871/

wind farm
type: Class
subclass of: power plant
subclass of: Restriction
  on property: has part
  some values from: wind energy converting unit
definition: A wind farm is a power plant that has wind energy converting units as parts.
alternative label: Windpark @de
term tracker annotation: issue: https://github.com/OpenEnergyPlatform/ontology/issues/750 pull request: https://github.com/OpenEnergyPlatform/ontology/pull/752

wind rotor
type: Class
subclass of: turbine
subclass of: Restriction
subclass of: Restriction
  on property: has quality
  some values from: rotor diameter
definition: A wind rotor (or wind turbine) is a turbine that converts the wind's kinetic energy into rotational energy.
alternative label: Windrotor @de
alternative label: wind turbine
term tracker annotation: issue: https://github.com/OpenEnergyPlatform/ontology/issues/299 pull request: https://github.com/OpenEnergyPlatform/ontology/pull/300 change produces energy and uses energy axioms to 'has energy output' and 'has energy input': issue: https://github.com/OpenEnergyPlatform/ontology/issues/994 pull request: https://github.com/OpenEnergyPlatform/ontology/pull/1006

Axiom
annotated source: wind rotor
annotated property: subClassOf
annotated target: Restriction
term tracker annotation: issue: https://github.com/OpenEnergyPlatform/ontology/issues/761 pull request: https://github.com/OpenEnergyPlatform/ontology/pull/782

Axiom
annotated source: wind rotor
annotated property: subClassOf
annotated target: Restriction
term tracker annotation: issue: https://github.com/OpenEnergyPlatform/ontology/issues/761 pull request: https://github.com/OpenEnergyPlatform/ontology/pull/782

Axiom
annotated source: wind rotor
annotated property: subClassOf
annotated target: Restriction
term tracker annotation: issue: https://github.com/OpenEnergyPlatform/ontology/issues/787 pull request: https://github.com/OpenEnergyPlatform/ontology/pull/817 issue: https://github.com/OpenEnergyPlatform/ontology/issues/736 pull request: https://github.com/OpenEnergyPlatform/ontology/pull/766 issue: https://github.com/OpenEnergyPlatform/ontology/issues/761 pull request: https://github.com/OpenEnergyPlatform/ontology/pull/782

wood
type: Class
subclass of: biomass
subclass of: Restriction
  on property: has role
  some values from: fuel role
subclass of: Restriction
  on property: has disposition
  some values from: combustible energy carrier disposition
subclass of: Restriction
  on property: has disposition
  some values from: primary energy carrier disposition
subclass of: Restriction
  on property: has normal state of matter
  has value: OEO_00000390
definition: Wood is a biomass from trees. It has a solid state of matter an can be used as fuel.
alternative label: Holz @de
term tracker annotation: issue:https://github.com/OpenEnergyPlatform/ontology/issues/872 pull request: https://github.com/OpenEnergyPlatform/ontology/pull/952 add dispositions: issue: https://github.com/OpenEnergyPlatform/ontology/issues/1032 pull request: https://github.com/OpenEnergyPlatform/ontology/pull/1033

ammonia
type: Class
subclass of: portion of matter
subclass of: Restriction
  on property: participates in
  some values from: air pollution
subclass of: Restriction
  on property: has role
  some values from: fuel role
subclass of: Restriction
  on property: has disposition
  some values from: combustible energy carrier disposition
subclass of: Restriction
  on property: has normal state of matter
  has value: OEO_00000182
definition: Ammonia is a portion of matter with the chemical formula NH3. It has a gaseous normal state of matter and can act as an air pollutant. As it can be oxidised it can be used as a fuel.
alternative label: Ammoniak @de
alternative label: NH3
alternative label: nitrogen trihydride
alternative label: trihydridonitrogen
may be identical to: http://purl.obolibrary.org/obo/CHEBI_16134
term tracker annotation: issue: https://github.com/OpenEnergyPlatform/ontology/issues/263 pull request: https://github.com/OpenEnergyPlatform/ontology/pull/356 Adapt definition and axioms, add alternative terms: issue: https://github.com/OpenEnergyPlatform/ontology/issues/939 pull request: https://github.com/OpenEnergyPlatform/ontology/pull/959

Axiom
annotated source: ammonia
annotated property: may be identical to
annotated target: http://purl.obolibrary.org/obo/CHEBI_16134
term tracker annotation: issue: https://github.com/OpenEnergyPlatform/ontology/issues/636 pull request: https://github.com/OpenEnergyPlatform/ontology/pull/810

carbon monoxide
type: Class
subclass of: portion of matter
subclass of: Restriction
  on property: participates in
  some values from: air pollution
subclass of: Restriction
  on property: has normal state of matter
  has value: OEO_00000182
definition: Carbon monoxide is a portion of matter with the chemical formula CO. It has a gaseous normal state of matter and can act as an air pollutant.
alternative label: CO
alternative label: Kohlenmonoxid @de
may be identical to: http://purl.obolibrary.org/obo/CHEBI_17245
term tracker annotation: issue: https://github.com/OpenEnergyPlatform/ontology/issues/263 pull request: https://github.com/OpenEnergyPlatform/ontology/pull/356

Axiom
annotated source: carbon monoxide
annotated property: may be identical to
annotated target: http://purl.obolibrary.org/obo/CHEBI_17245
term tracker annotation: issue: https://github.com/OpenEnergyPlatform/ontology/issues/636 pull request: https://github.com/OpenEnergyPlatform/ontology/pull/810

nitrogen oxides
type: Class
subclass of: portion of matter
subclass of: Restriction
  on property: participates in
  some values from: air pollution
subclass of: Restriction
  on property: has normal state of matter
  has value: OEO_00000182
definition: Nitrogen oxides are a portion of matter consisting of compounds of nitrogen and oxygen. It is a collective term for numerous oxides of nitrogen with a gaseous normal state of matter. They can act as air pollutants.
alternative label: NOx
alternative label: Stickoxide @de
may be identical to: http://purl.obolibrary.org/obo/CHEBI_35196
term tracker annotation: issue: https://github.com/OpenEnergyPlatform/ontology/issues/263 pull request: https://github.com/OpenEnergyPlatform/ontology/pull/356

Axiom
annotated source: nitrogen oxides
annotated property: may be identical to
annotated target: http://purl.obolibrary.org/obo/CHEBI_35196
term tracker annotation: issue: https://github.com/OpenEnergyPlatform/ontology/issues/636 pull request: https://github.com/OpenEnergyPlatform/ontology/pull/810

nitric oxide
type: Class
subclass of: nitrogen oxides
definition: Nitric oxide is a portion of matter with the chemical formula NO. It is a gas and can act as an air pollutant. Synonyms are nitrogen oxide or nitrogen monoxide.
alternative label: NO
alternative label: Stickstoffmonoxid @de
alternative label: nitrogen monoxide
alternative label: nitrogen oxide
term tracker annotation: issue: https://github.com/OpenEnergyPlatform/ontology/issues/263 pull request: https://github.com/OpenEnergyPlatform/ontology/pull/356

nitrogen dioxide
type: Class
subclass of: nitrogen oxides
definition: Nitrogen dioxide is a portion of matter with the chemical formula NO2. It is a gas and can act as an air pollutant.
alternative label: NO2
alternative label: Stickstoffdioxid @de
term tracker annotation: issue: https://github.com/OpenEnergyPlatform/ontology/issues/263 pull request: https://github.com/OpenEnergyPlatform/ontology/pull/356

sulphur dioxide
type: Class
subclass of: portion of matter
subclass of: Restriction
  on property: participates in
  some values from: air pollution
subclass of: Restriction
  on property: has normal state of matter
  has value: OEO_00000182
definition: Sulphur dioxide is a portion of matter with the chemical formula SO2. It has a gaseous normal state of matter and can act as an air pollutant.
alternative label: SO2
alternative label: Schwefeldioxid @de
alternative label: sulfur dioxide
term tracker annotation: issue: https://github.com/OpenEnergyPlatform/ontology/issues/263 pull request: https://github.com/OpenEnergyPlatform/ontology/pull/356

PM10
type: Class
subclass of: particulate matter
definition: PM10 is particulate matter which passes through a size-selective inlet as defined in the reference method for the sampling and measurement of PM10, EN 12341, with a 50 % efficiency cut-off at 10 µm aerodynamic diameter.
definition source: This definition is partly based on Article 2 of the European Air Quality Directive (2008/50/EC): https://eur-lex.europa.eu/legal-content/EN/TXT/?uri=CELEX:32008L0050
term tracker annotation: issue: https://github.com/OpenEnergyPlatform/ontology/issues/263 pull request: https://github.com/OpenEnergyPlatform/ontology/pull/356

Axiom
annotated source: PM10
annotated property: closeMatch
annotated target: ENVO_01000405
term tracker annotation: issue: https://github.com/OpenEnergyPlatform/ontology/issues/636 pull request: https://github.com/OpenEnergyPlatform/ontology/pull/810 Convert to skos:closeMatch issue: https://github.com/OpenEnergyPlatform/ontology/issues/636 pull request: https://github.com/OpenEnergyPlatform/ontology/pull/1879

PM2.5
type: Class
subclass of: particulate matter
definition: PM2.5 is particulate matter which passes through a size-selective inlet as defined in the reference method for the sampling and measurement of PM2,5, EN 14907, with a 50 % efficiency cut-off at 2,5 µm aerodynamic diameter.
definition source: This definition is partly based on Article 2 of the European Air Quality Directive (2008/50/EC): https://eur-lex.europa.eu/legal-content/EN/TXT/?uri=CELEX:32008L0050
term tracker annotation: issue: https://github.com/OpenEnergyPlatform/ontology/issues/263 pull request: https://github.com/OpenEnergyPlatform/ontology/pull/356

Axiom
annotated source: PM2.5
annotated property: closeMatch
annotated target: ENVO_01000415
term tracker annotation: issue: https://github.com/OpenEnergyPlatform/ontology/issues/636 pull request: https://github.com/OpenEnergyPlatform/ontology/pull/810 Convert to skos:closeMatch issue: https://github.com/OpenEnergyPlatform/ontology/issues/636 pull request: https://github.com/OpenEnergyPlatform/ontology/pull/1879

volatility
type: Class
subclass of: disposition
subclass of: Restriction
  on property: characteristic of
  some values from: portion of matter
definition: The volatility disposition is the disposition of a portion of matter to sublimate or evaporate from the solid or liquid form and enter the surrounding air.
alternative label: Flüchtigkeit @de
term tracker annotation: issue: https://github.com/OpenEnergyPlatform/ontology/issues/263 pull request: https://github.com/OpenEnergyPlatform/ontology/pull/356 add 'has bearer' axiom issue: https://github.com/OpenEnergyPlatform/ontology/issues/1305 pull request: https://github.com/OpenEnergyPlatform/ontology/pull/1310 replaced 'has bearer' with 'characteristic of' issue: https://github.com/OpenEnergyPlatform/ontology/issues/1907 pull request: https://github.com/OpenEnergyPlatform/ontology/pull/1928

air pollutant
type: Class
equivalent class: Class
  intersection of: portion of matter
  intersection of: Restriction
    on property: participates in
    some values from: air pollution
subclass of: portion of matter
definition: An air pollutant is a portion of matter that participates in some air pollution.
alternative label: Luftschadstoff @de
term tracker annotation: issue: https://github.com/OpenEnergyPlatform/ontology/issues/263 pull request: https://github.com/OpenEnergyPlatform/ontology/pull/356 issue: https://github.com/OpenEnergyPlatform/ontology/issues/815 pull request: https://github.com/OpenEnergyPlatform/ontology/pull/816

fossil hydrogen
type: Class
equivalent class: Class
subclass of: hydrogen
definition: Fossil hydrogen is hydrogen with fossil origin.
alternative label: fossiler Wasserstoff @de
term tracker annotation: issue: https://github.com/OpenEnergyPlatform/ontology/issues/134 pull request: https://github.com/OpenEnergyPlatform/ontology/pull/411

Axiom
annotated source: fossil hydrogen
annotated property: equivalentClass
annotated target: Class
term tracker annotation: issue: https://github.com/OpenEnergyPlatform/ontology/issues/940 pull request: https://github.com/OpenEnergyPlatform/ontology/pull/954

synthetic hydrogen
type: Class
equivalent class: Class
subclass of: hydrogen
definition: Synthetic hydrogen is hydrogen with synthetic origin.
alternative label: synthetischer Wasserstoff @de
term tracker annotation: issue: https://github.com/OpenEnergyPlatform/ontology/issues/134 pull request: https://github.com/OpenEnergyPlatform/ontology/pull/411 shorten definition: issue: https://github.com/OpenEnergyPlatform/ontology/issues/1013 pull request: https://github.com/OpenEnergyPlatform/ontology/pull/1442

Axiom
annotated source: synthetic hydrogen
annotated property: equivalentClass
annotated target: Class
term tracker annotation: issue: https://github.com/OpenEnergyPlatform/ontology/issues/940 pull request: https://github.com/OpenEnergyPlatform/ontology/pull/954

synthetic fuel
type: Class
equivalent class: Class
  intersection of: fuel
  intersection of: Restriction
    on property: has origin
    some values from: synthetic
subclass of: fuel
subclass of: Restriction
  on property: has disposition
  some values from: combustible energy carrier disposition
subclass of: Restriction
  on property: has disposition
  some values from: secondary energy carrier disposition
definition: A synthetic fuel is a fuel produced from one or more portion(s) of matter using electric energy.
alternative label: e-fuel
alternative label: electric fuel
alternative label: synthetischer Brennstoff @de
term tracker annotation: issue: https://github.com/OpenEnergyPlatform/ontology/issues/134 pull request: https://github.com/OpenEnergyPlatform/ontology/pull/411 add axiom to secondary energy carrier disposition issue:https://github.com/OpenEnergyPlatform/ontology/issues/1222 pull request: https://github.com/OpenEnergyPlatform/ontology/pull/1243

Axiom
annotated source: synthetic fuel
annotated property: subClassOf
annotated target: fuel
term tracker annotation: Add `SubClass Of` axiom for `synthetic fuel` issue: https://github.com/OpenEnergyPlatform/ontology/issues/1191 pull request: https://github.com/OpenEnergyPlatform/ontology/pull/1201

synthetic methane
type: Class
equivalent class: Class
  intersection of: methane
  intersection of: Restriction
    on property: has origin
    some values from: synthetic
subclass of: methane
definition: Synthetic methane is methane that has a synthetic origin.
alternative label: P2G
alternative label: PtG
alternative label: power to gas
alternative label: power-to-gas
alternative label: synthetisches Methan @de
term tracker annotation: issue: https://github.com/OpenEnergyPlatform/ontology/issues/134 pull request: https://github.com/OpenEnergyPlatform/ontology/pull/411 Re-definition: issue: https://github.com/OpenEnergyPlatform/ontology/issues/940 pull request: https://github.com/OpenEnergyPlatform/ontology/pull/954

PtL fuel
type: Class
subclass of: liquid synthetic fuel
subclass of: Restriction
  on property: produced by
  some values from: power-to-liquid system
subclass of: Restriction
  on property: has normal state of matter
  has value: OEO_00000256
definition: PtL fuel is a liquid synthetic fuel produced in a power-to-liquid system from water and carbon dioxide using electrical energy.
alternative label: P2L fuel
alternative label: liquid synthetic fuel
alternative label: synthetic liquid fuel
term tracker annotation: issue: https://github.com/OpenEnergyPlatform/ontology/issues/134 pull request: https://github.com/OpenEnergyPlatform/ontology/pull/411 new label and axioms: https://github.com/OpenEnergyPlatform/ontology/issues/934 pull request: https://github.com/OpenEnergyPlatform/ontology/pulls/957

power-to-liquid system
type: Class
subclass of: OEO_00330009
subclass of: Restriction
  on property: has part
  some values from: water electrolyser
definition: A power-to-liquid system is a power-to-fuel system that implements a power-to-liquid process. A water electrolyser is participating in the power-to-liquid process.
alternative label: P2L
alternative label: PtL
term tracker annotation: issue: https://github.com/OpenEnergyPlatform/ontology/issues/134 pull request: https://github.com/OpenEnergyPlatform/ontology/pull/411 Align with 'power-to-gas system': issue: https://github.com/OpenEnergyPlatform/ontology/issues/1262 pull request: https://github.com/OpenEnergyPlatform/ontology/pull/1348 created new parent class 'power-to-fuel system' https://github.com/OpenEnergyPlatform/ontology/issues/1477 https://github.com/OpenEnergyPlatform/ontology/pull/1483

water electrolyser
type: Class
subclass of: energy converting component
subclass of: Restriction
definition: A water electrolyser is an energy converting component that uses an electric current to decompose water into hydrogen and oxygen gas. Electrical energy is converted into chemical energy (and waste heat).
alternative label: Wasserelektrolyseur @de
term tracker annotation: issue: https://github.com/OpenEnergyPlatform/ontology/issues/134 pull request: https://github.com/OpenEnergyPlatform/ontology/pull/411 use energy converting component in definition: https://github.com/OpenEnergyPlatform/ontology/pull/993 change produces energy and uses energy axioms to 'has energy output' and 'has energy input': issue: https://github.com/OpenEnergyPlatform/ontology/issues/994 pull request: https://github.com/OpenEnergyPlatform/ontology/pull/1006

Axiom
annotated source: water electrolyser
annotated property: subClassOf
annotated target: Restriction
term tracker annotation: issue: https://github.com/OpenEnergyPlatform/ontology/issues/761 pull request: https://github.com/OpenEnergyPlatform/ontology/pull/782

Axiom
annotated source: water electrolyser
annotated property: subClassOf
annotated target: Restriction
term tracker annotation: issue: https://github.com/OpenEnergyPlatform/ontology/issues/761 pull request: https://github.com/OpenEnergyPlatform/ontology/pull/782

Axiom
annotated source: water electrolyser
annotated property: subClassOf
annotated target: Restriction
term tracker annotation: issue: https://github.com/OpenEnergyPlatform/ontology/issues/761 pull request: https://github.com/OpenEnergyPlatform/ontology/pull/782

Axiom
annotated source: water electrolyser
annotated property: subClassOf
annotated target: Restriction
term tracker annotation: issue: https://github.com/OpenEnergyPlatform/ontology/issues/761 pull request: https://github.com/OpenEnergyPlatform/ontology/pull/782

steam reformer
type: Class
subclass of: energy converting component
subclass of: Restriction
definition: A steam reformer is an energy converting component that produces syngas from hydrocarbons such as natural gas.
alternative label: Dampfreformer @de
term tracker annotation: issue: https://github.com/OpenEnergyPlatform/ontology/issues/134 pull request: https://github.com/OpenEnergyPlatform/ontology/pull/411 use energy converting component in definition: https://github.com/OpenEnergyPlatform/ontology/pull/993

Axiom
annotated source: steam reformer
annotated property: subClassOf
annotated target: Restriction
term tracker annotation: issue: https://github.com/OpenEnergyPlatform/ontology/issues/786 pull request: https://github.com/OpenEnergyPlatform/ontology/pull/805

Axiom
annotated source: steam reformer
annotated property: subClassOf
annotated target: Restriction
term tracker annotation: issue: https://github.com/OpenEnergyPlatform/ontology/issues/786 pull request: https://github.com/OpenEnergyPlatform/ontology/pull/805

vehicle
type: Class
subclass of: artificial object
subclass of: Restriction
  on property: has characteristic
  some values from: OEO_00320041
subclass of: Restriction
  on property: has energy output
  some values from: waste thermal energy
definition: A vehicle is an artificial object that is used for transporting people or goods.
alternative label: Fahrzeug @de
term tracker annotation: issue: https://github.com/OpenEnergyPlatform/ontology/issues/425 pull request: https://github.com/OpenEnergyPlatform/ontology/pull/431 Add vehicle operational mode axiom: issue: https://github.com/OpenEnergyPlatform/ontology/issues/1304 pull request: https://github.com/OpenEnergyPlatform/ontology/pull/1314 issue: https://github.com/OpenEnergyPlatform/ontology/issues/1265 pull request: https://github.com/OpenEnergyPlatform/ontology/pull/1359 rework module structure issue: https://github.com/OpenEnergyPlatform/ontology/issues/1592 pull request: https://github.com/OpenEnergyPlatform/ontology/pull/1652

Axiom
annotated source: vehicle
annotated property: closeMatch
annotated target: ENVO_01000604
term tracker annotation: issue: https://github.com/OpenEnergyPlatform/ontology/issues/636 pull request: https://github.com/OpenEnergyPlatform/ontology/pull/810 Convert to skos:closeMatch issue: https://github.com/OpenEnergyPlatform/ontology/issues/636 pull request: https://github.com/OpenEnergyPlatform/ontology/pull/1879

battery electric vehicle
type: Class
equivalent class: Class
  intersection of: electric vehicle
  intersection of: Restriction
    on property: has part
    some values from: traction battery
subclass of: electric vehicle
definition: A battery electric vehicle (BEV) is an electric vehicle that stores energy in a traction battery.
alternative label: BEV
alternative label: batterieelektrisches Fahrzeug @de
term tracker annotation: issue: https://github.com/OpenEnergyPlatform/ontology/issues/425 pull request: https://github.com/OpenEnergyPlatform/ontology/pull/453 issue: https://github.com/OpenEnergyPlatform/ontology/issues/637 pull request: https://github.com/OpenEnergyPlatform/ontology/pull/655 Adapt definition and convert to equivalent class: issue: https://github.com/OpenEnergyPlatform/ontology/issues/1311 pull request: https://github.com/OpenEnergyPlatform/ontology/pull/1315

fuel cell electric vehicle
type: Class
equivalent class: Class
  intersection of: electric vehicle
  intersection of: Restriction
    on property: has part
    some values from: fuel cell
subclass of: electric vehicle
subclass of: Restriction
  on property: has part
  some values from: OEO_00320056
subclass of: Restriction
  on property: uses
  some values from: hydrogen
definition: A fuel cell electric vehicle (FCEV) is an electric vehicle that uses electrical energy from a fuel cell.
alternative label: Brennstoffzellenfahrzeug @de
alternative label: FCEV
term tracker annotation: issue: https://github.com/OpenEnergyPlatform/ontology/issues/425 pull request: https://github.com/OpenEnergyPlatform/ontology/pull/453 issue: https://github.com/OpenEnergyPlatform/ontology/issues/637 pull request: https://github.com/OpenEnergyPlatform/ontology/pull/655 Convert to equivalent class: issue: https://github.com/OpenEnergyPlatform/ontology/issues/1311 pull request: https://github.com/OpenEnergyPlatform/ontology/pull/1315 Add fuel tank axiom: issue: https://github.com/OpenEnergyPlatform/ontology/issues/1301 pull request: https://github.com/OpenEnergyPlatform/ontology/pull/1356

traction battery
type: Class
subclass of: battery
definition: A traction battery is a battery that is used in vehicles for propulsion.
alternative label: Antriebsbatterie @de
alternative label: Traktionsbatterie @de
term tracker annotation: issue: https://github.com/OpenEnergyPlatform/ontology/issues/425 pull request: https://github.com/OpenEnergyPlatform/ontology/pull/453

electric motor
type: Class
subclass of: motor
subclass of: Restriction
  on property: has energy input
  some values from: electrical energy
definition: An electric motor is a motor that converts electrical energy into kinetic energy.
alternative label: Elektromotor @de
alternative label: elektrischer Motor @de
term tracker annotation: issue: https://github.com/OpenEnergyPlatform/ontology/issues/787 pull request: https://github.com/OpenEnergyPlatform/ontology/pull/817 issue: https://github.com/OpenEnergyPlatform/ontology/issues/425 pull request: https://github.com/OpenEnergyPlatform/ontology/pull/453 change uses energy axiom to 'has energy input': issue: https://github.com/OpenEnergyPlatform/ontology/issues/994 pull request: https://github.com/OpenEnergyPlatform/ontology/pull/1006

electric traction motor
type: Class
subclass of: electric motor
subclass of: Restriction
  on property: participates in
  some values from: traction
definition: An electric traction motor is an electric motor used for propulsion.
alternative label: elektrischer Antriebsmotor @de
term tracker annotation: issue: https://github.com/OpenEnergyPlatform/ontology/issues/425 pull request: https://github.com/OpenEnergyPlatform/ontology/pull/453 relabel and add axiom: issue: https://github.com/OpenEnergyPlatform/ontology/issues/1029 pull request: https://github.com/OpenEnergyPlatform/ontology/pull/1135

internal combustion engine
type: Class
subclass of: motor
subclass of: Restriction
subclass of: Restriction
  on property: uses
  some values from: combustion fuel
subclass of: Restriction
  on property: has energy input
  some values from: chemical energy
definition: An internal combustion engine is a motor that converts chemical energy into kinetic energy using a cyclic combustion process.
alternative label: ICE
alternative label: Verbrennungsmotor @de
term tracker annotation: issue: https://github.com/OpenEnergyPlatform/ontology/issues/787 pull request: https://github.com/OpenEnergyPlatform/ontology/pull/817 issue: https://github.com/OpenEnergyPlatform/ontology/issues/425 pull request: https://github.com/OpenEnergyPlatform/ontology/pull/453 add energy input axiom: issue: https://github.com/OpenEnergyPlatform/ontology/issues/1280 pull request: https://github.com/OpenEnergyPlatform/ontology/pull/1285 add ICE as alternative term issue: https://github.com/OpenEnergyPlatform/ontology/issues/2153 pull request: https://github.com/OpenEnergyPlatform/ontology/pull/2157

Axiom
annotated source: internal combustion engine
annotated property: subClassOf
annotated target: Restriction
term tracker annotation: issue: https://github.com/OpenEnergyPlatform/ontology/issues/787 pull request: https://github.com/OpenEnergyPlatform/ontology/pull/817

plug-in hybrid electric vehicle
type: Class
equivalent class: Class
  intersection of: vehicle
  intersection of: Restriction
    on property: has part
    some values from: electric traction motor
  intersection of: Restriction
    on property: has part
    some values from: Class
      intersection of: internal combustion engine
      intersection of: Restriction
        on property: participates in
        some values from: traction
subclass of: vehicle
subclass of: Restriction
  on property: has part
  some values from: traction battery
subclass of: Restriction
  on property: has part
  some values from: OEO_00320056
subclass of: Restriction
  on property: uses
  some values from: combustion fuel
subclass of: Restriction
  on property: uses
  some values from: electrical energy
definition: A plug-in hybrid electric vehicle (PHEV) is a vehicle that contains both an electric traction motor and an internal combustion engine and can switch between their usage for propulsion. It contains a traction battery that can be charged with electrical energy from an external supply.
alternative label: PHEV
alternative label: Plug-in-Hybrid-Fahrzeug @de
term tracker annotation: issue: https://github.com/OpenEnergyPlatform/ontology/issues/425 pull request: https://github.com/OpenEnergyPlatform/ontology/pull/453 Convert to equivalent class: issue: https://github.com/OpenEnergyPlatform/ontology/issues/1311 pull request: https://github.com/OpenEnergyPlatform/ontology/pull/1315 Add fuel tank axiom: issue: https://github.com/OpenEnergyPlatform/ontology/issues/1301 pull request: https://github.com/OpenEnergyPlatform/ontology/pull/1356

grid supplied electric vehicle
type: Class
equivalent class: Class
  intersection of: electric vehicle
  intersection of: Restriction
    on property: has part
    some values from: current collector
subclass of: electric vehicle
definition: A grid supplied electric vehicle is an electric vehicle that has a current collector to use electrical energy.
term tracker annotation: issue: https://github.com/OpenEnergyPlatform/ontology/issues/425 pull request: https://github.com/OpenEnergyPlatform/ontology/pull/453 Adapt definition and convert to equivalent class: issue: https://github.com/OpenEnergyPlatform/ontology/issues/1311 pull request: https://github.com/OpenEnergyPlatform/ontology/pull/1315

motor
type: Class
subclass of: energy converting component
subclass of: Restriction
definition: A motor is an energy converting component that converts other forms of energy into kinetic energy.
alternative label: Motor @de
term tracker annotation: issue: https://github.com/OpenEnergyPlatform/ontology/issues/787 pull request: https://github.com/OpenEnergyPlatform/ontology/pull/817 issue: https://github.com/OpenEnergyPlatform/ontology/issues/425 pull request: https://github.com/OpenEnergyPlatform/ontology/pull/453 use energy converting component in definition: https://github.com/OpenEnergyPlatform/ontology/pull/993 change produces energy axiom to 'has energy output': issue: https://github.com/OpenEnergyPlatform/ontology/issues/994 pull request: https://github.com/OpenEnergyPlatform/ontology/pull/1006

Axiom
annotated source: motor
annotated property: subClassOf
annotated target: Restriction
term tracker annotation: issue: https://github.com/OpenEnergyPlatform/ontology/issues/761 pull request: https://github.com/OpenEnergyPlatform/ontology/pull/782

Axiom
annotated source: motor
annotated property: closeMatch
annotated target: ENVO_01000610
term tracker annotation: issue: https://github.com/OpenEnergyPlatform/ontology/issues/636 pull request: https://github.com/OpenEnergyPlatform/ontology/pull/810 Convert to skos:closeMatch issue: https://github.com/OpenEnergyPlatform/ontology/issues/636 pull request: https://github.com/OpenEnergyPlatform/ontology/pull/1879

building sector
type: Class
subclass of: energy demand sector
definition: A building sector is a sector that covers buildings.
alternative label: Gebäudesektor @de
term tracker annotation: issue: https://github.com/OpenEnergyPlatform/ontology/issues/30 pull request: https://github.com/OpenEnergyPlatform/ontology/pull/484 move to oeo-sector issue: https://github.com/OpenEnergyPlatform/ontology/issues/1399 pull request: https://github.com/OpenEnergyPlatform/ontology/pull/1724

agriculture, forestry and land use sector
type: Class
subclass of: sector
definition: A agriculture, forestry and land use (AFOLU) sector is a sector that covers activities and natural processes from agriculture, forestry, land use and land use change.
alternative label: AFOLU sector
alternative label: Landwirtschaft, Forstwirtschaft und Landnutzungssektor @de
term tracker annotation: issue: https://github.com/OpenEnergyPlatform/ontology/issues/30 pull request: https://github.com/OpenEnergyPlatform/ontology/pull/484 move to oeo-sector issue: https://github.com/OpenEnergyPlatform/ontology/issues/1399 pull request: https://github.com/OpenEnergyPlatform/ontology/pull/1724

waste and wastewater sector
type: Class
subclass of: sector
definition: A waste and wastewater sector is a sector that covers activities related the collection and treatment of waste and wastewater.
alternative label: Abfall- und Abwassersektor @de
alternative label: Entsorgungssektor @de
term tracker annotation: issue: https://github.com/OpenEnergyPlatform/ontology/issues/30 pull request: https://github.com/OpenEnergyPlatform/ontology/pull/484 move to oeo-sector issue: https://github.com/OpenEnergyPlatform/ontology/issues/1399 pull request: https://github.com/OpenEnergyPlatform/ontology/pull/1724

sensitivity analysis
type: Class
subclass of: process
definition: A sensitivity analysis is the process of comparing different model calculations based on a variation of input parameters (exogenous data items).
alternative label: Sensitivitätsanalyse @de
term tracker annotation: issue: https://github.com/OpenEnergyPlatform/ontology/issues/483 pull request: https://github.com/OpenEnergyPlatform/ontology/pull/550

common reporting format
type: Class
subclass of: sector division
definition: The common reporting format (CRF) is a sector division used for compiling national inventory reports on greenhouse gas emissions and providing emission relevant data in so called CRF tables.
alternative label: CRF
alternative label: NIR sector division
alternative label: national inventory report sector division
term tracker annotation: issue: https://github.com/OpenEnergyPlatform/ontology/issues/461 pull request: https://github.com/OpenEnergyPlatform/ontology/pull/578 add alternative labels: issue: https://github.com/OpenEnergyPlatform/ontology/issues/1535 pull request: https://github.com/OpenEnergyPlatform/ontology/pull/1558 move to oeo-sector issue: https://github.com/OpenEnergyPlatform/ontology/issues/1399 pull request: https://github.com/OpenEnergyPlatform/ontology/pull/1724

areal power density unit
type: Class
subclass of: physical unit
definition: An areal power density unit is a unit which is a measure for the power per surface area.
alternative label: Flächenleistungsdichte Einheit @de
term tracker annotation: issue: https://github.com/OpenEnergyPlatform/ontology/issues/597 pull request: https://github.com/OpenEnergyPlatform/ontology/pull/615 make subclass of physical unit issue: https://github.com/OpenEnergyPlatform/ontology/issues/2135 pull request: https://github.com/OpenEnergyPlatform/ontology/pull/2141

areal energy density unit
type: Class
subclass of: physical unit
definition: An areal energy density unit is a unit which is a measure for the energy per surface area.
alternative label: Flächenenergiedichte Einheit @de
term tracker annotation: issue: https://github.com/OpenEnergyPlatform/ontology/issues/597 pull request: https://github.com/OpenEnergyPlatform/ontology/pull/615 make subclass of physical unit issue: https://github.com/OpenEnergyPlatform/ontology/issues/2135 pull request: https://github.com/OpenEnergyPlatform/ontology/pull/2141

areal power density
type: Class
subclass of: quantity value
subclass of: Restriction
  on property: has unit
  some values from: areal power density unit
definition: An areal power density is a quantity value that indicates a certain power per area.
alternative label: Flächenleistungsdichte @de
alternative label: specific power
term tracker annotation: issue: https://github.com/OpenEnergyPlatform/ontology/issues/597 pull request: https://github.com/OpenEnergyPlatform/ontology/pull/615

areal energy density
type: Class
subclass of: quantity value
subclass of: Restriction
  on property: has unit
  some values from: areal energy density unit
definition: An areal energy density is a quantity value that states a certain energy amount per area.
alternative label: Flächenenergiedichte @de
term tracker annotation: issue: https://github.com/OpenEnergyPlatform/ontology/issues/597 pull request: https://github.com/OpenEnergyPlatform/ontology/pull/615

areal solar power density
type: Class
subclass of: areal power density
definition: An areal solar power density is an areal power density that indicates the arriving solar power per area. A synonym for areal solar power density is irradiance.
alternative label: irradiance
term tracker annotation: issue: https://github.com/OpenEnergyPlatform/ontology/issues/597 pull request: https://github.com/OpenEnergyPlatform/ontology/pull/615

areal solar energy density
type: Class
subclass of: areal energy density
definition: An areal solar energy density is an areal energy density that gives the arriving solar energy per area. A synonym for areal solar energy density is irradiation.
alternative label: irradiation
term tracker annotation: issue: https://github.com/OpenEnergyPlatform/ontology/issues/597 pull request: https://github.com/OpenEnergyPlatform/ontology/pull/615 correct definition to state 'energy' instead of 'power' issue: https://github.com/OpenEnergyPlatform/ontology/issues/1981 pull request: https://github.com/OpenEnergyPlatform/ontology/pull/1983

global warming potential
type: Class
subclass of: quantity value
subclass of: Restriction
  on property: has unit
  some values from: ratio
definition: Global warming potential (GWP) is a quantity value that measures the the time-integrated radiative forcing due to a pulse emission of a given component, relative to a pulse emission of an equal mass of carbon dioxide (CO2).
alternative label: GWP
alternative label: Treibhauspotenzial @de
term tracker annotation: issue: https://github.com/OpenEnergyPlatform/ontology/issues/420 pull request: https://github.com/OpenEnergyPlatform/ontology/pull/683 move to oeo-shared: https://github.com/OpenEnergyPlatform/ontology/pull/1410 rework module structure issue: https://github.com/OpenEnergyPlatform/ontology/issues/1592 pull request: https://github.com/OpenEnergyPlatform/ontology/pull/1652

emission value
type: Class
subclass of: quantity value
subclass of: Restriction
  on property: quantity value of
  some values from: emission certificate
subclass of: Restriction
  on property: quantity value of
  some values from: emission rate
subclass of: Restriction
  on property: has unit
  some values from: mass unit
definition: An emission value is a quantity value that quantifies an emission rate and has a mass unit.
alternative label: Emissionswert @de
alternative label: emission quantity value
elucidation: It can be calculated using the an emission factor.
term tracker annotation: issue: https://github.com/OpenEnergyPlatform/ontology/issues/695 pull request: https://github.com/OpenEnergyPlatform/ontology/pull/697 rework module structure issue: https://github.com/OpenEnergyPlatform/ontology/issues/1592 pull request: https://github.com/OpenEnergyPlatform/ontology/pull/1652 restructuring emission rate and emission value issue: https://github.com/OpenEnergyPlatform/ontology/issues/1759 pull request: https://github.com/OpenEnergyPlatform/ontology/pull/1846 Correction of implementing mistake concerning emission value issue: https://github.com/OpenEnergyPlatform/ontology/issues/1759 pull request: https://github.com/OpenEnergyPlatform/ontology/pull/1880

solar-steam-electric process
type: Class
subclass of: energy transformation
subclass of: Class
  intersection of: Restriction
    on property: has occurrent part
    some values from: solar thermal energy transformation
  intersection of: Restriction
    on property: has occurrent part
    some values from: steam-electric process
subclass of: Class
  intersection of: Restriction
    on property: has occurrent part
    some values from: Class
      intersection of: MENO_01013
      intersection of: Restriction
        on property: negatively regulates characteristic
        some values from: solar energy
  intersection of: Restriction
    on property: has occurrent part
    some values from: Class
      intersection of: MENO_01014
      intersection of: Restriction
        on property: positively regulates characteristic
        some values from: electrical energy
subclass of: Restriction
  on property: has participant
  some values from: electromotive generator
subclass of: Restriction
  on property: has participant
  some values from: steam turbine
definition: A solar-steam-electric process is a solar energy transformation that converts solar energy into electrical energy. It has two partial processes: a solar thermal energy transformation and a steam-electric process.
term tracker annotation: add two has participant and redefine issue: https://github.com/OpenEnergyPlatform/ontology/issues/938 issue: https://github.com/OpenEnergyPlatform/ontology/issues/980 pull request: https://github.com/OpenEnergyPlatform/ontology/pull/1010 add 'has physical output' some 'electrical energy' pull request: https://github.com/OpenEnergyPlatform/ontology/pull/932 issue: https://github.com/OpenEnergyPlatform/ontology/issues/668 pull request: https://github.com/OpenEnergyPlatform/ontology/pull/701 change 'has physical input / output' axioms to 'has energy input / output': https://github.com/OpenEnergyPlatform/ontology/issues/994 https://github.com/OpenEnergyPlatform/ontology/pull/1041 replace energy-participant axioms issue: https://github.com/OpenEnergyPlatform/ontology/issues/2053 pull request: https://github.com/OpenEnergyPlatform/ontology/pull/2120

solar chemical energy transformation
type: Class
subclass of: energy transformation
subclass of: Class
  intersection of: Restriction
    on property: has occurrent part
    some values from: Class
      intersection of: MENO_01013
      intersection of: Restriction
        on property: negatively regulates characteristic
        some values from: solar energy
  intersection of: Restriction
    on property: has occurrent part
    some values from: Class
      intersection of: MENO_01014
      intersection of: Restriction
        on property: positively regulates characteristic
        some values from: chemical energy
definition: A solar chemical energy transformation is a solar energy transformation that converts solar energy into chemical energy.
alternative label: solarchemische Energieumwandlung @de
term tracker annotation: issue: https://github.com/OpenEnergyPlatform/ontology/issues/673 pull request: https://github.com/OpenEnergyPlatform/ontology/pull/735 change 'has physical input / output' axioms to 'has energy input / output': https://github.com/OpenEnergyPlatform/ontology/issues/994 https://github.com/OpenEnergyPlatform/ontology/pull/1041 replace energy-participant axioms issue: https://github.com/OpenEnergyPlatform/ontology/issues/2053 pull request: https://github.com/OpenEnergyPlatform/ontology/pull/2120

trade
type: Class
subclass of: process
subclass of: Restriction
  on property: has participant
  some values from: good
definition: A trade is a process in which one good or service is exchanged for another good or service or money.
alternative label: Handel @de
term tracker annotation: issue: https://github.com/OpenEnergyPlatform/ontology/issues/307 pull request: https://github.com/OpenEnergyPlatform/ontology/pull/745 Move to oeo-shared: issue: https://github.com/OpenEnergyPlatform/ontology/issues/1458 pull request: https://github.com/OpenEnergyPlatform/ontology/pull/1478 issue: https://github.com/OpenEnergyPlatform/ontology/issues/1565 pull request: https://github.com/OpenEnergyPlatform/ontology/pull/1613 rework module structure issue: https://github.com/OpenEnergyPlatform/ontology/issues/1592 pull request: https://github.com/OpenEnergyPlatform/ontology/pull/1652

market participant
type: Class
subclass of: agent
subclass of: Restriction
  on property: participates in
  some values from: trade
definition: A market participant is an agent who participates in trading in a market exchange.
alternative label: Marktteilnehmer @de
alternative label: Marktteilnehmerin @de
term tracker annotation: issue: https://github.com/OpenEnergyPlatform/ontology/issues/330 pull request: https://github.com/OpenEnergyPlatform/ontology/pull/745 update definition and improve axiom: https://github.com/OpenEnergyPlatform/ontology/issues/617 https://github.com/OpenEnergyPlatform/ontology/pull/1019 Move to oeo-shared: issue: https://github.com/OpenEnergyPlatform/ontology/issues/1458 pull request: https://github.com/OpenEnergyPlatform/ontology/pull/1478 rework module structure issue: https://github.com/OpenEnergyPlatform/ontology/issues/1592 pull request: https://github.com/OpenEnergyPlatform/ontology/pull/1652

reservoir
type: Class
subclass of: artificial object
subclass of: Restriction
  on property: has part
  some values from: dam
subclass of: Restriction
  on property: uses
  some values from: liquid water
definition: A reservoir is an artificial object that stores liquid water and has a dam as part.
editor note: Reservoirs created by dams provide water for activities such as hydro energy transformation, irrigation, human consumption, industrial use, aquaculture, and navigability. They are also used to regulate floods.
term tracker annotation: issue: https://github.com/OpenEnergyPlatform/ontology/issues/681 pull request: https://github.com/OpenEnergyPlatform/ontology/pull/755

hydro power unit
type: Class
subclass of: power generating unit
subclass of: Restriction
  on property: has part
  some values from: water turbine
subclass of: Restriction
  on property: uses
  some values from: water
definition: A hydro power unit is a power generating unit that uses hydro energy.
term tracker annotation: issue: https://github.com/OpenEnergyPlatform/ontology/issues/78 pull request: https://github.com/OpenEnergyPlatform/ontology/pull/758

Axiom
annotated source: hydro power unit
annotated property: subClassOf
annotated target: Restriction
term tracker annotation: issue: https://github.com/OpenEnergyPlatform/ontology/issues/761 pull request: https://github.com/OpenEnergyPlatform/ontology/pull/782

hydro power plant
type: Class
subclass of: power plant
subclass of: Restriction
  on property: has part
  some values from: hydro power unit
subclass of: Restriction
  on property: participates in
  some values from: hydroelectric energy transformation
subclass of: Restriction
  on property: uses
  some values from: water
definition: A hydro power plant is a power plant having an aggregate of hydro power generating units as its power generating unit parts.
alternative label: Wasserkraftwerk @de
term tracker annotation: issue: https://github.com/OpenEnergyPlatform/ontology/issues/78 pull request: https://github.com/OpenEnergyPlatform/ontology/pull/758

run of river power plant
type: Class
subclass of: hydro power plant
subclass of: Restriction
  on property: has part
  some values from: dam
subclass of: Restriction
  on property: uses
  some values from: river
definition: A run of river power plant is a hydro power plant that uses the momentarily available hydro energy of a river. It has either no reservoir or just has a small one with a maximum of 24 hours of storage.
editor note: The distinction between a run of river power plant and a hydro storage power plant is important for modelling, but in reality not so easy. The chosen distinction follows the document: European Network of Transmission System Operators for Electricity (ENTSO-E): Hydropower modelling – New database complementing PECD, V.1.0, 12 December 2019, https://www.entsoe.eu/Documents/SDC%20documents/MAF/2019/Hydropower_Modelling_New_database_and_methodology.pdf
alternative label: Laufwasserkraftwerk @de
term tracker annotation: issue: https://github.com/OpenEnergyPlatform/ontology/issues/78 pull request: https://github.com/OpenEnergyPlatform/ontology/pull/758

hydro storage power plant
type: Class
subclass of: hydro power plant
subclass of: Class
  intersection of: Restriction
    on property: has part
    some values from: dam
  intersection of: Restriction
    on property: has part
    some values from: reservoir
subclass of: Restriction
  on property: uses
  some values from: liquid water
definition: A hydro storage power plant is a hydro power plant that uses the available hydro energy of a stationary water storage.
editor note: The distinction between a run of river power plant and a hydro storage power plant is important for modelling, but in reality not so easy. The chosen distinction follows the document: European Network of Transmission System Operators for Electricity (ENTSO-E): Hydropower modelling – New database complementing PECD, V.1.0, 12 December 2019, https://www.entsoe.eu/Documents/SDC%20documents/MAF/2019/Hydropower_Modelling_New_database_and_methodology.pdf
alternative label: Speicherwasserkraftwerk @de
alternative label: storage power plant
term tracker annotation: issue: https://github.com/OpenEnergyPlatform/ontology/issues/78 pull request: https://github.com/OpenEnergyPlatform/ontology/pull/758

pumped hydro storage power plant
type: Class
subclass of: hydro storage power plant
subclass of: Restriction
  on property: has part
  some values from: pump
subclass of: Restriction
  on property: has function
  some values from: electrical energy storage function
definition: A pumped hydro storage power plant is a hydro storage power plant which has some pumps as parts.
alternative label: Pumpspeicherkraftwerk @de
term tracker annotation: issue: https://github.com/OpenEnergyPlatform/ontology/issues/78 pull request: https://github.com/OpenEnergyPlatform/ontology/pull/758 Add energy storage function axiom: issue: https://github.com/OpenEnergyPlatform/ontology/issues/1174 pull request: https://github.com/OpenEnergyPlatform/ontology/pull/1348

pump
type: Class
subclass of: energy converting component
subclass of: Restriction
definition: A pump is an energy converting component that converts energy into kinetic or potential energy of a fluid.
alternative label: Pumpe @de
term tracker annotation: issue: https://github.com/OpenEnergyPlatform/ontology/issues/78 pull request: https://github.com/OpenEnergyPlatform/ontology/pull/758 use energy converting component in definition: https://github.com/OpenEnergyPlatform/ontology/pull/993 change produces energy axiom to 'has energy output': issue: https://github.com/OpenEnergyPlatform/ontology/issues/994 pull request: https://github.com/OpenEnergyPlatform/ontology/pull/1006

Axiom
annotated source: pump
annotated property: subClassOf
annotated target: Restriction
term tracker annotation: issue: https://github.com/OpenEnergyPlatform/ontology/issues/763 pull request: https://github.com/OpenEnergyPlatform/ontology/pull/769

Axiom
annotated source: pump
annotated property: subClassOf
annotated target: Restriction
term tracker annotation: issue: https://github.com/OpenEnergyPlatform/ontology/issues/761 pull request: https://github.com/OpenEnergyPlatform/ontology/pull/782

open-loop pumped hydro storage power plant
type: Class
subclass of: pumped hydro storage power plant
subclass of: Restriction
  on property: uses
  some values from: pumped water
definition: An open-loop pumped hydro storage power plant is a pumped hydro storage power plant that has natural inflows.
term tracker annotation: issue: https://github.com/OpenEnergyPlatform/ontology/issues/78 pull request: https://github.com/OpenEnergyPlatform/ontology/pull/758

closed-loop pumped hydro storage power plant
type: Class
subclass of: pumped hydro storage power plant
subclass of: Restriction
  on property: uses
  all values from: pumped water
definition: A closed-loop pumped hydro storage power plant is a pumped hydro storage power plant that has no natural inflows.
term tracker annotation: issue: https://github.com/OpenEnergyPlatform/ontology/issues/78 pull request: https://github.com/OpenEnergyPlatform/ontology/pull/758

river
type: Class
subclass of: water body
subclass of: Restriction
  on property: participates in
  some values from: water flow
definition: A river is a water body that moves through permanent or seasonal flow process from elevated land towards lower elevations through a definite channel and empties either into a sea, lake, or another river or ends on land as bed seepage and evapotranspiration exceed water supply.
alternative label: Fluss @de
term tracker annotation: issue: https://github.com/OpenEnergyPlatform/ontology/issues/760 pull request: https://github.com/OpenEnergyPlatform/ontology/pull/765 Make river a subclass of water body: issue: https://github.com/OpenEnergyPlatform/ontology/issues/762 pull request: https://github.com/OpenEnergyPlatform/ontology/pull/806 Convert to skos:closeMatch issue: https://github.com/OpenEnergyPlatform/ontology/issues/636 pull request: https://github.com/OpenEnergyPlatform/ontology/pull/1879

reservoir hydro storage power plant
type: Class
subclass of: hydro storage power plant
subclass of: Class
  complement of: Restriction
    on property: has part
    some values from: pump
definition: A reservoir hydro storage power plant is a hydro storage power plant that has no pump.
term tracker annotation: issue: https://github.com/OpenEnergyPlatform/ontology/issue/767 pull request: https://github.com/OpenEnergyPlatform/ontology/pull/768

marine thermal energy
type: Class
subclass of: natural ambient thermal energy
definition: Marine thermal energy is a kind of natural ambient thermal energy that is present in marine water bodies.
term tracker annotation: issue: https://github.com/OpenEnergyPlatform/ontology/issues/762 pull request: https://github.com/OpenEnergyPlatform/ontology/pull/806

marine thermal energy transfer
type: Class
subclass of: heat transfer
subclass of: Class
  intersection of: Restriction
    on property: has occurrent part
    some values from: Class
      intersection of: MENO_01013
      intersection of: Restriction
        on property: negatively regulates characteristic
        some values from: marine thermal energy
  intersection of: Restriction
    on property: has occurrent part
    some values from: Class
      intersection of: MENO_01014
      intersection of: Restriction
        on property: positively regulates characteristic
        some values from: thermal energy
subclass of: Restriction
  on property: has participant
  some values from: ocean
definition: Marine thermal energy transfer is a heat transfer from the marine water body to a transportable material entity.
term tracker annotation: issue: https://github.com/OpenEnergyPlatform/ontology/issues/762 pull request: https://github.com/OpenEnergyPlatform/ontology/pull/806

marine current energy
type: Class
subclass of: natural hydro energy
subclass of: Restriction
subclass of: Restriction
  on property: is energy input to
  some values from: marine current energy transformation
definition: Marine current energy is the natural hydro energy of an ocean current.
term tracker annotation: issue: https://github.com/OpenEnergyPlatform/ontology/issues/762 pull request: https://github.com/OpenEnergyPlatform/ontology/pull/806 fix classification: issue: https://github.com/OpenEnergyPlatform/ontology/issues/896 pull request: https://github.com/OpenEnergyPlatform/ontology/pull/921 add and change axioms pull request: https://github.com/OpenEnergyPlatform/ontology/pull/1065

Axiom
annotated source: marine current energy
annotated property: subClassOf
annotated target: Restriction
term tracker annotation: change axiom to 'participates in' issue: https://github.com/OpenEnergyPlatform/ontology/issues/850 pull request: https://github.com/OpenEnergyPlatform/ontology/pull/871/

marine current energy transformation
type: Class
subclass of: hydroelectric energy transformation
subclass of: Class
  intersection of: Restriction
    on property: has occurrent part
    some values from: Class
      intersection of: MENO_01013
      intersection of: Restriction
        on property: negatively regulates characteristic
        some values from: marine current energy
  intersection of: Restriction
    on property: has occurrent part
    some values from: Class
      intersection of: MENO_01014
      intersection of: Restriction
        on property: positively regulates characteristic
        some values from: electrical energy
subclass of: Restriction
definition: Marine current energy transformation is a hydroelectric energy transformation that converts marine current energy to electrical energy.
term tracker annotation: issue: https://github.com/OpenEnergyPlatform/ontology/issues/762 pull request: https://github.com/OpenEnergyPlatform/ontology/pull/806 change 'has physical input / output' axioms to 'has energy input / output': https://github.com/OpenEnergyPlatform/ontology/issues/994 https://github.com/OpenEnergyPlatform/ontology/pull/1041 remove wrong axiom https://github.com/OpenEnergyPlatform/ontology/pull/1044 replace energy-participant axioms issue: https://github.com/OpenEnergyPlatform/ontology/issues/2053 pull request: https://github.com/OpenEnergyPlatform/ontology/pull/2120

Axiom
annotated source: marine current energy transformation
annotated property: subClassOf
annotated target: Restriction
comment: reintroduce axiom issue: https://github.com/OpenEnergyPlatform/ontology/issues/1023 pull-request: https://github.com/OpenEnergyPlatform/ontology/pull/1137

Axiom
annotated source: marine current energy transformation
annotated property: subClassOf
annotated target: Restriction
term tracker annotation: replace 'has input' with 'causally downstream of or within' issue: https://github.com/OpenEnergyPlatform/ontology/issues/1023 pull-request: https://github.com/OpenEnergyPlatform/ontology/pull/1137

marine tidal energy transformation
type: Class
subclass of: hydroelectric energy transformation
subclass of: Class
  intersection of: Restriction
    on property: has occurrent part
    some values from: Class
      intersection of: MENO_01013
      intersection of: Restriction
        on property: negatively regulates characteristic
        some values from: marine tidal energy
  intersection of: Restriction
    on property: has occurrent part
    some values from: Class
      intersection of: MENO_01014
      intersection of: Restriction
        on property: positively regulates characteristic
        some values from: electrical energy
subclass of: Restriction
  on property: has participant
  some values from: ocean
definition: Marine tidal energy transformation is a hydroelectric energy transformation that converts kinetic energy from tidal flow to electrical energy.
term tracker annotation: issue: https://github.com/OpenEnergyPlatform/ontology/issues/762 pull request: https://github.com/OpenEnergyPlatform/ontology/pull/806 change 'has physical input / output' axioms to 'has energy input / output': https://github.com/OpenEnergyPlatform/ontology/issues/994 https://github.com/OpenEnergyPlatform/ontology/pull/1041 replace energy-participant axioms issue: https://github.com/OpenEnergyPlatform/ontology/issues/2053 pull request: https://github.com/OpenEnergyPlatform/ontology/pull/2120

Axiom
annotated source: marine tidal energy transformation
annotated property: subClassOf
annotated target: Restriction
term tracker annotation: replace 'has input' with 'causally downstream of or within' issue: https://github.com/OpenEnergyPlatform/ontology/issues/1023 pull-request: https://github.com/OpenEnergyPlatform/ontology/pull/1137

marine tidal energy
type: Class
subclass of: natural hydro energy
subclass of: Restriction
  on property: is energy participant of
  some values from: tidal flow
definition: Marine tidal energy is the natural hydro energy of a tidal flow.
term tracker annotation: issue: https://github.com/OpenEnergyPlatform/ontology/issues/762 pull request: https://github.com/OpenEnergyPlatform/ontology/pull/806 fix classification: issue: https://github.com/OpenEnergyPlatform/ontology/issues/896 pull request: https://github.com/OpenEnergyPlatform/ontology/pull/921 change axiom from participates in to is energy participant of pull request: https://github.com/OpenEnergyPlatform/ontology/pull/1065

tidal flow
type: Class
subclass of: water flow
definition: Tidal flow is a water flow during which movements of water masses caused by varying gravitational and rotational forces from sun and moon, combined with the rotation of the earth, cause waters to undergo periodic depth oscillations (tides).
alternative label: Gezeitenströmung @de
term tracker annotation: issue: https://github.com/OpenEnergyPlatform/ontology/issues/762 pull request: https://github.com/OpenEnergyPlatform/ontology/pull/806 Convert to skos:closeMatch issue: https://github.com/OpenEnergyPlatform/ontology/issues/636 pull request: https://github.com/OpenEnergyPlatform/ontology/pull/1879

marine wave energy
type: Class
subclass of: natural hydro energy
subclass of: Restriction
definition: Marine wave energy is the natural hydro energy of a wave.
term tracker annotation: issue: https://github.com/OpenEnergyPlatform/ontology/issues/762 pull request: https://github.com/OpenEnergyPlatform/ontology/pull/806 fix classification: issue: https://github.com/OpenEnergyPlatform/ontology/issues/896 pull request: https://github.com/OpenEnergyPlatform/ontology/pull/921 change axiom from participates in to is energy participant of pull request: https://github.com/OpenEnergyPlatform/ontology/pull/1065

Axiom
annotated source: marine wave energy
annotated property: subClassOf
annotated target: Restriction
term tracker annotation: change axiom to 'participates in' issue: https://github.com/OpenEnergyPlatform/ontology/issues/850 pull request: https://github.com/OpenEnergyPlatform/ontology/pull/871/

marine wave energy transformation
type: Class
subclass of: hydroelectric energy transformation
subclass of: Class
  intersection of: Restriction
    on property: has occurrent part
    some values from: Class
      intersection of: MENO_01013
      intersection of: Restriction
        on property: negatively regulates characteristic
        some values from: marine wave energy
  intersection of: Restriction
    on property: has occurrent part
    some values from: Class
      intersection of: MENO_01014
      intersection of: Restriction
        on property: positively regulates characteristic
        some values from: electrical energy
subclass of: Restriction
  on property: has participant
  some values from: ocean
definition: Marine wave energy transformation is a hydroelectric energy transformation that converts marine wave energy to electrical energy.
term tracker annotation: issue: https://github.com/OpenEnergyPlatform/ontology/issues/762 pull request: https://github.com/OpenEnergyPlatform/ontology/pull/806 change 'has physical input / output' axioms to 'has energy input / output': https://github.com/OpenEnergyPlatform/ontology/issues/994 https://github.com/OpenEnergyPlatform/ontology/pull/1041 replace energy-participant axioms issue: https://github.com/OpenEnergyPlatform/ontology/issues/2053 pull request: https://github.com/OpenEnergyPlatform/ontology/pull/2120

Axiom
annotated source: marine wave energy transformation
annotated property: subClassOf
annotated target: Restriction
term tracker annotation: replace 'has input' with 'causally downstream of or within' issue: https://github.com/OpenEnergyPlatform/ontology/issues/1023 pull-request: https://github.com/OpenEnergyPlatform/ontology/pull/1137

water body
type: Class
subclass of: liquid water
definition: A water body is an accumulation of liquid water of varying size on the surface of the Earth.
alternative label: Gewässer @de
term tracker annotation: issue: https://github.com/OpenEnergyPlatform/ontology/issues/762 pull request: https://github.com/OpenEnergyPlatform/ontology/pull/806

ocean
type: Class
subclass of: water body
definition: The ocean is a water body that consists of salt water and is covering approximately 71% of Earth's surface.
alternative label: Ozean @de
alternative label: marine water body
alternative label: sea
term tracker annotation: issue: https://github.com/OpenEnergyPlatform/ontology/issues/762 pull request: https://github.com/OpenEnergyPlatform/ontology/pull/806

wave
type: Class
subclass of: water flow
definition: A wave is a water flow that is at the surface of a water body/marine water body/ocean and that is mainly vertically orientated.
alternative label: Welle @de
term tracker annotation: issue: https://github.com/OpenEnergyPlatform/ontology/issues/762 pull request: https://github.com/OpenEnergyPlatform/ontology/pull/806

ocean current
type: Class
subclass of: water flow
definition: An ocean current is a a water flow within a water body/marine water body/ocean that is mainly horizontally orientated.
alternative label: Ozeanströmung @de
term tracker annotation: issue: https://github.com/OpenEnergyPlatform/ontology/issues/762 pull request: https://github.com/OpenEnergyPlatform/ontology/pull/806

marine current energy converting unit
type: Class
subclass of: hydro power unit
subclass of: Restriction
  on property: participates in
  some values from: marine current energy transformation
subclass of: Restriction
  on property: has function
  some values from: renewable energy transformation function
subclass of: Restriction
  on property: has energy input
  some values from: marine current energy
definition: A marine current energy converting unit is a hydro power unit that uses marine current energy.
term tracker annotation: issue: https://github.com/OpenEnergyPlatform/ontology/issues/762 pull request: https://github.com/OpenEnergyPlatform/ontology/pull/806 Add 'has energy input' axiom: issue:https://github.com/OpenEnergyPlatform/ontology/issues/1423 pull request: https://github.com/OpenEnergyPlatform/ontology/pull/1437 Add function: issue: https://github.com/OpenEnergyPlatform/ontology/issues/1423 pull request: https://github.com/OpenEnergyPlatform/ontology/pull/1437

marine tidal energy converting unit
type: Class
subclass of: hydro power unit
subclass of: Restriction
  on property: participates in
  some values from: marine tidal energy transformation
subclass of: Restriction
  on property: has function
  some values from: renewable energy transformation function
subclass of: Restriction
  on property: has energy input
  some values from: marine tidal energy
definition: A marine tidal energy converting unit is a hydro power unit that uses marine tidal energy.
term tracker annotation: issue: https://github.com/OpenEnergyPlatform/ontology/issues/762 pull request: https://github.com/OpenEnergyPlatform/ontology/pull/806 Add 'has energy input' axiom: issue:https://github.com/OpenEnergyPlatform/ontology/issues/1423 pull request: https://github.com/OpenEnergyPlatform/ontology/pull/1437 Add function: issue: https://github.com/OpenEnergyPlatform/ontology/issues/1423 pull request: https://github.com/OpenEnergyPlatform/ontology/pull/1437

marine wave energy converting unit
type: Class
subclass of: hydro power unit
subclass of: Restriction
  on property: participates in
  some values from: marine wave energy transformation
subclass of: Restriction
  on property: has function
  some values from: renewable energy transformation function
subclass of: Restriction
  on property: has energy input
  some values from: marine wave energy
term tracker annotation: A marine wave energy converting unit is a hydro power unit that uses marine wave energy.
term tracker annotation: issue: https://github.com/OpenEnergyPlatform/ontology/issues/762 pull request: https://github.com/OpenEnergyPlatform/ontology/pull/806 Add 'has energy input' axiom: issue:https://github.com/OpenEnergyPlatform/ontology/issues/1423 pull request: https://github.com/OpenEnergyPlatform/ontology/pull/1437 Add function: issue: https://github.com/OpenEnergyPlatform/ontology/issues/1423 pull request: https://github.com/OpenEnergyPlatform/ontology/pull/1437

marine current energy power plant
type: Class
subclass of: hydro power plant
subclass of: Restriction
  on property: has part
  some values from: marine current energy converting unit
subclass of: Restriction
  on property: participates in
  some values from: marine current energy transformation
definition: A marine current energy power plant is a power plant that has marine current energy units as parts.
alternative label: Meeresströmungskraftwerk @de
term tracker annotation: issue: https://github.com/OpenEnergyPlatform/ontology/issues/762 pull request: https://github.com/OpenEnergyPlatform/ontology/pull/806

marine tidal energy power plant
type: Class
subclass of: hydro power plant
subclass of: Restriction
  on property: has part
  some values from: marine tidal energy converting unit
subclass of: Restriction
  on property: participates in
  some values from: marine tidal energy transformation
definition: A marine tidal energy power plant is a power plant that has marine tidal energy units as parts.
term tracker annotation: issue: https://github.com/OpenEnergyPlatform/ontology/issues/762 pull request: https://github.com/OpenEnergyPlatform/ontology/pull/806

marine wave energy power plant
type: Class
subclass of: hydro power plant
subclass of: Restriction
  on property: has part
  some values from: marine wave energy converting unit
subclass of: Restriction
  on property: participates in
  some values from: marine wave energy transformation
definition: A marine wave energy power plant is a power plant that has marine wave energy units as parts.
alternative label: Wellenkraftwerk @de
term tracker annotation: issue: https://github.com/OpenEnergyPlatform/ontology/issues/762 pull request: https://github.com/OpenEnergyPlatform/ontology/pull/806

waste thermal energy
type: Class
subclass of: thermal energy
definition: Waste thermal energy is thermal energy that is the physical output of an energy transformation process and that is released into the environment unused.
alternative label: Abwärme @de
alternative label: waste heat
term tracker annotation: issue: https://github.com/OpenEnergyPlatform/ontology/issues/775 pull request: https://github.com/OpenEnergyPlatform/ontology/pull/813 change label and definition language pull request: https://github.com/OpenEnergyPlatform/ontology/pull/1359 move to oeo-shared: issue: https://github.com/OpenEnergyPlatform/ontology/issues/1384 pull request: https://github.com/OpenEnergyPlatform/ontology/pull/1390 rework module structure issue: https://github.com/OpenEnergyPlatform/ontology/issues/1592 pull request: https://github.com/OpenEnergyPlatform/ontology/pull/1652

economy
type: Class
subclass of: system
definition: An economy is a system of production, distribution, trade and consumption of goods and services.
alternative label: Wirtschaft @de
alternative label: economic system
term tracker annotation: issue: https://github.com/OpenEnergyPlatform/ontology/issues/832 pull request: https://github.com/OpenEnergyPlatform/ontology/pull/843 move to oeo-shared, add alternative lable issue: https://github.com/OpenEnergyPlatform/ontology/issues/1329 pull request: https://github.com/OpenEnergyPlatform/ontology/pull/1642

good
type: Class
equivalent class: Class
  intersection of: continuant
  intersection of: Restriction
    on property: has role
    some values from: good role
subclass of: continuant
definition: A good is a continuant that has the good role.
alternative label: Gut @de
alternative label: Ware @de
term tracker annotation: issue: https://github.com/OpenEnergyPlatform/ontology/issues/832 pull request: https://github.com/OpenEnergyPlatform/ontology/pull/843 move to oeo-shared pull request: https://github.com/OpenEnergyPlatform/ontology/pull/869 make good a continuant: pull request: https://github.com/OpenEnergyPlatform/ontology/pull/1127 rework module structure issue: https://github.com/OpenEnergyPlatform/ontology/issues/1592 pull request: https://github.com/OpenEnergyPlatform/ontology/pull/1652

good role
type: Class
subclass of: role
subclass of: Restriction
  on property: characteristic of
  some values from: Class
    union of: independent continuant
    union of: electrical energy
definition: The role of an independent continuant or energy over which ownership rights can be established, whose ownership can be passed from one party to another by engaging in transactions, and that is not money.
definition source: https://spec.edmcouncil.org/fibo/ontology/FND/ProductsAndServices/ProductsAndServices/Good
term tracker annotation: issue: https://github.com/OpenEnergyPlatform/ontology/issues/832 pull request: https://github.com/OpenEnergyPlatform/ontology/pull/843 add relation to monetary price pull request: https://github.com/OpenEnergyPlatform/ontology/pull/1034 update definition: pull request: https://github.com/OpenEnergyPlatform/ontology/pull/1127 add 'has bearer' axiom issue: https://github.com/OpenEnergyPlatform/ontology/issues/1305 pull request: https://github.com/OpenEnergyPlatform/ontology/pull/1310 pull request: https://github.com/OpenEnergyPlatform/ontology/pull/1485 rework module structure issue: https://github.com/OpenEnergyPlatform/ontology/issues/1592 pull request: https://github.com/OpenEnergyPlatform/ontology/pull/1652 replaced 'has bearer' with 'characteristic of' in oeo-shared-axioms issue: https://github.com/OpenEnergyPlatform/ontology/issues/1907 pull request: https://github.com/OpenEnergyPlatform/ontology/pull/1928 remove axiom to monetary value issue: https://github.com/OpenEnergyPlatform/ontology/issues/2144 pull request: https://github.com/OpenEnergyPlatform/ontology/pull/2161

effort sharing
type: Class
subclass of: regulatory instrument
subclass of: Restriction
  on property: uses
  some values from: emission certificate
definition: Effort sharing is a regulatory instrument that sets a common emission reduction goal for a number of countries. Each country has a national reduction goal. Under- or overachievement of that goal can be compensated by various flexibilities given in the regulation.
alternative label: Lastenteilung @de
term tracker annotation: issue: https://github.com/OpenEnergyPlatform/ontology/issues/834 pull request: https://github.com/OpenEnergyPlatform/ontology/pull/857 Make subclass of 'regulatory instrument' and improve definition: issue: https://github.com/OpenEnergyPlatform/ontology/issues/1545 pull request: https://github.com/OpenEnergyPlatform/ontology/pull/1786

Annual Emission Allocation
type: Class
subclass of: emission certificate
definition: An Annual Emission Allocation (AEA) is an emission certificate used in the Effort Sharing Decision (ESD) and the Effort Sharing Regulation (ESR). It permits the emission of a CO2 equivalent quantity of 1 tonne.
alternative label: AEA
alternative label: jährliche Emissionszuweisung @de
term tracker annotation: issue: https://github.com/OpenEnergyPlatform/ontology/issues/834 pull request: https://github.com/OpenEnergyPlatform/ontology/pull/857

secondary energy production
type: Class
equivalent class: Class
  intersection of: OEO_00240003
  intersection of: Restriction
    on property: has physical output
    some values from: secondary energy carrier
subclass of: OEO_00240003
subclass of: Restriction
  on property: has part
  some values from: energy transformation
subclass of: Restriction
  on property: has physical output
  some values from: secondary energy carrier
subclass of: Restriction
  on property: has quantity value
  some values from: energy value
definition: Secondary energy production is the production of secondary energy carriers.
alternative label: secondary production of energy
term tracker annotation: add alternative term: issue: https://github.com/OpenEnergyPlatform/ontology/issues/920 pull: https://github.com/OpenEnergyPlatform/ontology/pull/924 issue: https://github.com/OpenEnergyPlatform/ontology/issues/860 pull: https://github.com/OpenEnergyPlatform/ontology/pull/865 Move to oeo-shared: issue: https://github.com/OpenEnergyPlatform/ontology/issues/1522 pull request: https://github.com/OpenEnergyPlatform/ontology/pull/1531 make equivalent and add axiom: issue: https://github.com/OpenEnergyPlatform/ontology/issues/1523 pull request: https://github.com/OpenEnergyPlatform/ontology/pull/1619 rework module structure issue: https://github.com/OpenEnergyPlatform/ontology/issues/1592 pull request: https://github.com/OpenEnergyPlatform/ontology/pull/1652

EU emission sector division
type: Class
subclass of: EU legislation sector division
subclass of: Restriction
  on property: is used by
  has value: OEO_00010129
definition: An EU emission sector division is an EU legislation sector division used in the EU climate policy.
term tracker annotation: issue: https://github.com/OpenEnergyPlatform/ontology/issues/834 pull request: https://github.com/OpenEnergyPlatform/ontology/pull/857 Convert to class: issue: https://github.com/OpenEnergyPlatform/ontology/issues/1449 pull request: https://github.com/OpenEnergyPlatform/ontology/pull/1462 move to oeo-sector issue: https://github.com/OpenEnergyPlatform/ontology/issues/1399 pull request: https://github.com/OpenEnergyPlatform/ontology/pull/1724 Update hierarchy: issue: https://github.com/OpenEnergyPlatform/ontology/issues/1796 pull request: https://github.com/OpenEnergyPlatform/ontology/pull/1797

distribution
type: Class
subclass of: process
subclass of: Class
  union of: Restriction
    on property: has participant
    some values from: good
  union of: Restriction
    on property: causally upstream of or within
    some values from: service
definition: Distribution is the process of delivering goods and services to agents. ETst
alternative label: Verteilung @de
term tracker annotation: issue: https://github.com/OpenEnergyPlatform/ontology/issues/836 pull request: https://github.com/OpenEnergyPlatform/ontology/pull/876 add 'has participant axiom': issue: https://github.com/OpenEnergyPlatform/ontology/issues/1327 pull request: https://github.com/OpenEnergyPlatform/ontology/pull/1395

metric ton
type: Class
subclass of: mass unit
definition: Metric ton (t) is a a mass unit which is equal to thousand of a kilogram or 10^3 kg.
alternative label: metrische Tonne @de
alternative label: tonne
has exact synonym: t
term tracker annotation: issue: https://github.com/OpenEnergyPlatform/ontology/issues/856 pull request: https://github.com/OpenEnergyPlatform/ontology/pull/879

carbon capture
type: Class
subclass of: process
subclass of: Restriction
  on property: has physical input
  some values from: carbon dioxide
definition: Carbon capture is a process that captures carbon dioxide from a gas.
alternative label: CO2-Abscheidung @de
term tracker annotation: issue: https://github.com/OpenEnergyPlatform/ontology/issues/863 pull request: https://github.com/OpenEnergyPlatform/ontology/pull/911

direct air capture
type: Class
subclass of: carbon capture
subclass of: Restriction
  on property: has participant
  some values from: air
definition: Direct air capture (DAC) is carbon dioxide capture from air.
alternative label: DAC
term tracker annotation: issue: https://github.com/OpenEnergyPlatform/ontology/issues/863 pull request: https://github.com/OpenEnergyPlatform/ontology/pull/911

carbon storage
type: Class
subclass of: process
subclass of: Restriction
  on property: has physical input
  some values from: carbon dioxide
definition: Carbon storage is a process that stores CO2 in a geological formation.
alternative label: CO2-Speicherung @de
alternative label: carbon sequestration
term tracker annotation: issue: https://github.com/OpenEnergyPlatform/ontology/issues/863 pull request: https://github.com/OpenEnergyPlatform/ontology/pull/911

carbon capture and storage
type: Class
equivalent class: Class
  intersection of: Restriction
    on property: has part
    some values from: carbon capture
  intersection of: Restriction
    on property: has part
    some values from: carbon storage
subclass of: process
subclass of: Restriction
  on property: has physical input
  some values from: carbon dioxide
definition: Carbon capture and storage (CCS) is a process that combines carbon capture and carbon sequestration.
alternative label: CCS @de
alternative label: carbon capture and sequestration
term tracker annotation: issue: https://github.com/OpenEnergyPlatform/ontology/issues/863 pull request: https://github.com/OpenEnergyPlatform/ontology/pull/911

solid combustion fuel
type: Class
equivalent class: Class
  intersection of: combustion fuel
  intersection of: Restriction
    on property: has normal state of matter
    has value: OEO_00000390
subclass of: combustion fuel
definition: A solid combustion fuel is a combustion fuel that has a solid state of matter under normal conditions.
term tracker annotation: issue: https://github.com/OpenEnergyPlatform/ontology/issues/811 pull request: https://github.com/OpenEnergyPlatform/ontology/pull/931

liquid combustion fuel
type: Class
equivalent class: Class
  intersection of: combustion fuel
  intersection of: Restriction
    on property: has normal state of matter
    has value: OEO_00000256
subclass of: combustion fuel
definition: A liquid combustion fuel is a combustion fuel that has a liquid state of matter under normal conditions.
alternative label: biogener Brennstoff @de
term tracker annotation: issue: https://github.com/OpenEnergyPlatform/ontology/issues/811 pull request: https://github.com/OpenEnergyPlatform/ontology/pull/931

gaseous combustion fuel
type: Class
equivalent class: Class
  intersection of: combustion fuel
  intersection of: Restriction
    on property: has normal state of matter
    has value: OEO_00000182
subclass of: combustion fuel
definition: A gaseous combustion fuel is a combustion fuel that has a gaseous state of matter under normal conditions.
alternative label: gasförmiger Brennstoff @de
term tracker annotation: issue: https://github.com/OpenEnergyPlatform/ontology/issues/811 pull request: https://github.com/OpenEnergyPlatform/ontology/pull/931

liquid fossil fuel
type: Class
equivalent class: Class
  intersection of: fossil combustion fuel
  intersection of: Restriction
    on property: has normal state of matter
    has value: OEO_00000256
subclass of: fossil combustion fuel
definition: A liquid fossil fuel is a fossil combustion fuel that has a liquid state of matter under normal conditions.
alternative label: fossiler Flüssigkraftstoff @de
term tracker annotation: issue: https://github.com/OpenEnergyPlatform/ontology/issues/811 pull request: https://github.com/OpenEnergyPlatform/ontology/pull/931

gaseous fossil fuel
type: Class
equivalent class: Class
  intersection of: fossil combustion fuel
  intersection of: Restriction
    on property: has normal state of matter
    has value: OEO_00000182
subclass of: fossil combustion fuel
definition: A gaseous fossil fuel is a fossil combustion fuel that has a gaseous state of matter under normal conditions.
alternative label: gasförmiger fossiler Brennstoff @de
term tracker annotation: issue: https://github.com/OpenEnergyPlatform/ontology/issues/811 pull request: https://github.com/OpenEnergyPlatform/ontology/pull/931

solid renewable fuel
type: Class
equivalent class: Class
  intersection of: renewable fuel
  intersection of: Restriction
    on property: has normal state of matter
    has value: OEO_00000390
subclass of: renewable fuel
definition: A solid renewable fuel is a renewable fuel that has a solid state of matter under normal conditions.
term tracker annotation: issue: https://github.com/OpenEnergyPlatform/ontology/issues/811 pull request: https://github.com/OpenEnergyPlatform/ontology/pull/931

liquid renewable fuel
type: Class
equivalent class: Class
  intersection of: renewable fuel
  intersection of: Restriction
    on property: has normal state of matter
    has value: OEO_00000256
subclass of: renewable fuel
definition: A liquid renewable fuel is a renewable fuel that has a liquid state of matter under normal conditions.
alternative label: erneuerbarer Flüssigkraftstoff @de
term tracker annotation: issue: https://github.com/OpenEnergyPlatform/ontology/issues/811 pull request: https://github.com/OpenEnergyPlatform/ontology/pull/931

gaseous renewable fuel
type: Class
equivalent class: Class
  intersection of: renewable fuel
  intersection of: Restriction
    on property: has normal state of matter
    has value: OEO_00000182
subclass of: renewable fuel
definition: A gaseous renewable fuel is a renewable fuel that has a gaseous state of matter under normal conditions.
alternative label: gasförmiger erneuerbarer Brennstoff @de
term tracker annotation: issue: https://github.com/OpenEnergyPlatform/ontology/issues/811 pull request: https://github.com/OpenEnergyPlatform/ontology/pull/931

gaseous biofuel
type: Class
equivalent class: Class
  intersection of: biofuel
  intersection of: Restriction
    on property: has normal state of matter
    has value: OEO_00000182
subclass of: biofuel
alternative label: gasförmiger biogener Brennstoff @de
term tracker annotation: A gaseous biofuel is a biofuel that has a gaseous state of matter under normal conditions.
term tracker annotation: issue: https://github.com/OpenEnergyPlatform/ontology/issues/811 pull request: https://github.com/OpenEnergyPlatform/ontology/pull/931

solid synthetic fuel
type: Class
equivalent class: Class
  intersection of: synthetic fuel
  intersection of: Restriction
    on property: has normal state of matter
    has value: OEO_00000390
subclass of: synthetic fuel
term tracker annotation: A solid synthetic fuel is a synthetic fuel that has a solid state of matter under normal conditions.
term tracker annotation: issue: https://github.com/OpenEnergyPlatform/ontology/issues/811 pull request: https://github.com/OpenEnergyPlatform/ontology/pull/931

gaseous synthetic fuel
type: Class
equivalent class: Class
  intersection of: synthetic fuel
  intersection of: Restriction
    on property: has normal state of matter
    has value: OEO_00000182
subclass of: synthetic fuel
alternative label: gasförmiger synthetischer Brennstoff @de
term tracker annotation: A gaseous synthetic fuel is a synthetic fuel that has a gaseous state of matter under normal conditions.
term tracker annotation: issue: https://github.com/OpenEnergyPlatform/ontology/issues/811 pull request: https://github.com/OpenEnergyPlatform/ontology/pull/931

liquid synthetic fuel
type: Class
equivalent class: Class
  intersection of: synthetic fuel
  intersection of: Restriction
    on property: has normal state of matter
    has value: OEO_00000256
subclass of: synthetic fuel
definition: A liquid synthetic fuel is a synthetic fuel that has a liquid state of matter under normal conditions.
alternative label: synthetischer Flüssigkraftstoff @de
term tracker annotation: issue: https://github.com/OpenEnergyPlatform/ontology/issues/811 pull request: https://github.com/OpenEnergyPlatform/ontology/pull/931

power value
type: Class
equivalent class: Class
  intersection of: quantity value
  intersection of: Restriction
    on property: has unit
    some values from: power unit
subclass of: quantity value
definition: A power value is a quantity value that has a power unit as unit.
term tracker annotation: issue: https://github.com/OpenEnergyPlatform/ontology/issues/918 pull request: https://github.com/OpenEnergyPlatform/ontology/pull/935 Make equivalent class: issue: https://github.com/OpenEnergyPlatform/ontology/issues/1092 pull request: https://github.com/OpenEnergyPlatform/ontology/pull/1155

energy use
type: Class
subclass of: consumption
subclass of: Restriction
  on property: has participant
  some values from: energy carrier
disjoint with: non-energy use
definition: Energy use is the consumption of an energy carrier making use of the energy it carries.
alternative label: Energieverbrauch @de
alternative label: energy consumption
term tracker annotation: issue: https://github.com/OpenEnergyPlatform/ontology/issues/718 pull request: https://github.com/OpenEnergyPlatform/ontology/pull/950 Add alternative label: https://github.com/OpenEnergyPlatform/ontology/pull/1321 Move to oeo-shared: https://github.com/OpenEnergyPlatform/ontology/pull/1463 rework module structure issue: https://github.com/OpenEnergyPlatform/ontology/issues/1592 pull request: https://github.com/OpenEnergyPlatform/ontology/pull/1652

non-energy use
type: Class
subclass of: consumption
subclass of: Restriction
  on property: has participant
  some values from: energy carrier
definition: Non-energy use is the consumption of an energy carrier without making use the energy it carries.
alternative label: nichtenergetischer Verbrauch @de
alternative label: non-energy consumption
term tracker annotation: issue: https://github.com/OpenEnergyPlatform/ontology/issues/718 pull request: https://github.com/OpenEnergyPlatform/ontology/pull/950 add 'has participant axiom': issue: https://github.com/OpenEnergyPlatform/ontology/issues/1327 pull request: https://github.com/OpenEnergyPlatform/ontology/pull/1395 Move to oeo-shared: https://github.com/OpenEnergyPlatform/ontology/pull/1463 rework module structure issue: https://github.com/OpenEnergyPlatform/ontology/issues/1592 pull request: https://github.com/OpenEnergyPlatform/ontology/pull/1652 Add alternative label: issue: https://github.com/OpenEnergyPlatform/ontology/issues/1773 pull request: https://github.com/OpenEnergyPlatform/ontology/pull/1803

decarbonisation pathway
type: Class
subclass of: policy
definition: A decarbonisation pathway is a policy that aims at long-term emissions reductions.
alternative label: Dekarbonisierungspfad @de
oekg annotation: study descriptor
term tracker annotation: issue: https://github.com/OpenEnergyPlatform/ontology/issues/831 pull request: https://github.com/OpenEnergyPlatform/ontology/pull/951 add oekg annotation issue: https://github.com/OpenEnergyPlatform/ontology/issues/1529 pull request: https://github.com/OpenEnergyPlatform/ontology/pull/1897

emission constraint
type: Class
subclass of: constraint
definition: An emission constraint is a constraint that determines the emissions a model calculation describes.
alternative label: decarbonisation pathway
term tracker annotation: issue: https://github.com/OpenEnergyPlatform/ontology/issues/831 pull request: https://github.com/OpenEnergyPlatform/ontology/pull/951

biomass
type: Class
subclass of: portion of matter
subclass of: Restriction
  on property: has disposition
  some values from: primary energy carrier disposition
subclass of: Restriction
  on property: has origin
  some values from: biogenic
definition: Biomass is a portion of matter from plants or animals and has thus has a biogenic origin.
alternative label: Biomasse @de
term tracker annotation: issue:https://github.com/OpenEnergyPlatform/ontology/issues/872 pull request: https://github.com/OpenEnergyPlatform/ontology/pull/952 added axiom 'has disposition' some 'primary energy carrier disposition' issue: https://github.com/OpenEnergyPlatform/ontology/issues/1032 pull request: https://github.com/OpenEnergyPlatform/ontology/pull/2095

biomethane
type: Class
subclass of: gas mixture
subclass of: Restriction
  on property: has part
  some values from: methane
subclass of: Restriction
  on property: has role
  some values from: fuel role
subclass of: Restriction
  on property: has disposition
  some values from: combustible energy carrier disposition
subclass of: Restriction
  on property: has origin
  some values from: biogenic
subclass of: Restriction
  on property: has normal state of matter
  has value: OEO_00000182
definition: Biomethane is a gas mixture produced from biogas by removing carbon dioxide. It consists mainly of methane and can be used as fuel.
alternative label: Biomethan @de
term tracker annotation: issue:https://github.com/OpenEnergyPlatform/ontology/issues/872 pull request: https://github.com/OpenEnergyPlatform/ontology/pull/952 improve definition and make subclass of gas mixture: issue: https://github.com/OpenEnergyPlatform/ontology/issues/988 pull request: https://github.com/OpenEnergyPlatform/ontology/pull/1009

power-to-gas process
type: Class
equivalent class: Class
  intersection of: OEO_00330007
  intersection of: Restriction
    on property: has physical output
    some values from: gaseous synthetic fuel
subclass of: OEO_00330007
definition: A power-to-gas process is a power-to-fuel process that converts electrical energy to chemical energy by synthesising portions of matter into a gaseous synthetic fuel.
alternative label: P2G
alternative label: Power-to-Gas-Prozess @de
alternative label: PtG
alternative label: power to gas
alternative label: power-to-gas
term tracker annotation: issue: https://github.com/OpenEnergyPlatform/ontology/issues/940 pull request: https://github.com/OpenEnergyPlatform/ontology/pull/954 change 'has physical input / output' axioms to 'has energy input / output': https://github.com/OpenEnergyPlatform/ontology/issues/994 https://github.com/OpenEnergyPlatform/ontology/pull/1041 changed to subclass of newly added 'power-to-fuel process' https://github.com/OpenEnergyPlatform/ontology/issues/1477 https://github.com/OpenEnergyPlatform/ontology/pull/1483 replace energy-participant axioms issue: https://github.com/OpenEnergyPlatform/ontology/issues/2053 pull request: https://github.com/OpenEnergyPlatform/ontology/pull/2120

power-to-methane process
type: Class
subclass of: energy transformation
subclass of: Class
  intersection of: Restriction
    on property: has occurrent part
    some values from: Class
      intersection of: MENO_01013
      intersection of: Restriction
        on property: negatively regulates characteristic
        some values from: electrical energy
  intersection of: Restriction
    on property: has occurrent part
    some values from: Class
      intersection of: MENO_01014
      intersection of: Restriction
        on property: positively regulates characteristic
        some values from: chemical energy
subclass of: Restriction
  on property: has occurrent part
  some values from: water electrolysis process
subclass of: Restriction
  on property: has occurrent part
  some values from: methanation
subclass of: Restriction
  on property: has physical input
  some values from: Class
    intersection of: carbon dioxide
    intersection of: water
subclass of: Restriction
  on property: has physical output
  some values from: synthetic methane
definition: A power-to-methane process is a power-to-gas process that has electrical energy as energy input, water and carbon dioxide as physical input and synthetic methane carrying chemical energy as physical output. It consists of two sub processes: an electrolysis process and a methanation.
alternative label: Power-to-Methane-Prozess @de
alternative label: power to methane
term tracker annotation: issue: https://github.com/OpenEnergyPlatform/ontology/issues/940 pull request: https://github.com/OpenEnergyPlatform/ontology/pull/954 change 'has physical input / output' axioms to 'has energy input / output': https://github.com/OpenEnergyPlatform/ontology/issues/994 https://github.com/OpenEnergyPlatform/ontology/pull/1041 added new parent class `power-to-fuel proces' upstream https://github.com/OpenEnergyPlatform/ontology/issues/1477 https://github.com/OpenEnergyPlatform/ontology/pull/1483 replace energy-participant axioms issue: https://github.com/OpenEnergyPlatform/ontology/issues/2053 pull request: https://github.com/OpenEnergyPlatform/ontology/pull/2120

oxygen
type: Class
subclass of: portion of matter
subclass of: Restriction
  on property: has normal state of matter
  has value: OEO_00000182
definition: Oxygen is a portion of matter with the chemical formula O2. It has a gaseous normal state of matter.
alternative label: O2
alternative label: Sauerstoff @de
term tracker annotation: issue: https://github.com/OpenEnergyPlatform/ontology/issues/940 pull request: https://github.com/OpenEnergyPlatform/ontology/pull/954

water electrolysis process
type: Class
subclass of: energy transformation
subclass of: Class
  intersection of: Restriction
    on property: has occurrent part
    some values from: Class
      intersection of: MENO_01013
      intersection of: Restriction
        on property: negatively regulates characteristic
        some values from: electrical energy
  intersection of: Restriction
    on property: has occurrent part
    some values from: Class
      intersection of: MENO_01014
      intersection of: Restriction
        on property: positively regulates characteristic
        some values from: chemical energy
subclass of: Restriction
  on property: has participant
  some values from: water electrolyser
subclass of: Restriction
  on property: has physical input
  some values from: water
subclass of: Restriction
  on property: has physical output
  some values from: Class
    intersection of: hydrogen
    intersection of: oxygen
definition: A water electrolysis process is an energy transformation that uses an electric current to decompose water into hydrogen and oxygen gas. Electrical energy is converted into chemical energy (and waste heat).
alternative label: Wasserelektrolyse @de
term tracker annotation: issue: https://github.com/OpenEnergyPlatform/ontology/issues/940 pull request: https://github.com/OpenEnergyPlatform/ontology/pull/954 change 'has physical input / output' axioms to 'has energy input / output': https://github.com/OpenEnergyPlatform/ontology/issues/994 https://github.com/OpenEnergyPlatform/ontology/pull/1041 replace energy-participant axioms issue: https://github.com/OpenEnergyPlatform/ontology/issues/2053 pull request: https://github.com/OpenEnergyPlatform/ontology/pull/2120

methanation
type: Class
subclass of: redox reaction
subclass of: Class
  intersection of: Restriction
    on property: has physical input
    some values from: carbon dioxide
  intersection of: Restriction
    on property: has physical input
    some values from: hydrogen
subclass of: Class
  intersection of: Restriction
    on property: has physical output
    some values from: carbon dioxide
  intersection of: Restriction
    on property: has physical output
    some values from: water
definition: A methanation is a redox reaction that converts carbon dioxide and hydrogen to synthetic methane and water.
alternative label: Methanisierung @de
term tracker annotation: issue: https://github.com/OpenEnergyPlatform/ontology/issues/940 pull request: https://github.com/OpenEnergyPlatform/ontology/pull/954

synthetic ammonia
type: Class
equivalent class: Class
  intersection of: ammonia
  intersection of: Restriction
    on property: has origin
    some values from: synthetic
subclass of: ammonia
definition: Synthetic ammonia is ammonia that has a synthetic origin.
alternative label: synthetisches Ammoniak @de
term tracker annotation: issue: https://github.com/OpenEnergyPlatform/ontology/issues/939 pull request: https://github.com/OpenEnergyPlatform/ontology/pull/959

power-to-ammonia process
type: Class
subclass of: energy transformation
subclass of: Class
  intersection of: Restriction
    on property: has occurrent part
    some values from: Class
      intersection of: MENO_01013
      intersection of: Restriction
        on property: negatively regulates characteristic
        some values from: electrical energy
  intersection of: Restriction
    on property: has occurrent part
    some values from: Class
      intersection of: MENO_01014
      intersection of: Restriction
        on property: positively regulates characteristic
        some values from: chemical energy
subclass of: Restriction
  on property: has physical output
  some values from: synthetic ammonia
definition: A power-to-ammonia process is a power-to-gas process that has ammonia as output.
alternative label: power to ammonia
term tracker annotation: issue: https://github.com/OpenEnergyPlatform/ontology/issues/939 pull request: https://github.com/OpenEnergyPlatform/ontology/pull/959 added new parent class `power-to-fuel proces' upstream https://github.com/OpenEnergyPlatform/ontology/issues/1477 https://github.com/OpenEnergyPlatform/ontology/pull/1483 replace energy-participant axioms issue: https://github.com/OpenEnergyPlatform/ontology/issues/2053 pull request: https://github.com/OpenEnergyPlatform/ontology/pull/2120

biogenic waste fuel
type: Class
equivalent class: Class
  intersection of: waste fuel
  intersection of: Restriction
    on property: has origin
    some values from: biogenic
subclass of: waste fuel
definition: A biogenic waste fuel is a waste fuel that has a biogenic origin.
alternative label: renewable waste fuel
term tracker annotation: issue: https://github.com/OpenEnergyPlatform/ontology/issues/925 pull request: https://github.com/OpenEnergyPlatform/ontology/pull/961 rename class and change axiom: https://github.com/OpenEnergyPlatform/ontology/issues/872 https://github.com/OpenEnergyPlatform/ontology/pull/1048

fossil waste fuel
type: Class
equivalent class: Class
  intersection of: waste fuel
  intersection of: Restriction
    on property: has origin
    some values from: fossil
subclass of: waste fuel
definition: A fossil waste fuel is a waste fuel that has a fossil origin.
term tracker annotation: issue: https://github.com/OpenEnergyPlatform/ontology/issues/925 pull request: https://github.com/OpenEnergyPlatform/ontology/pull/961

biogenic industrial waste fuel
type: Class
equivalent class: Class
  intersection of: industrial waste fuel
  intersection of: Restriction
    on property: has origin
    some values from: biogenic
subclass of: industrial waste fuel
definition: A biogenic industrial waste fuel is an industrial waste fuel that has a biogenic origin.
alternative label: renewable industrial waste fuel
term tracker annotation: issue: https://github.com/OpenEnergyPlatform/ontology/issues/925 pull request: https://github.com/OpenEnergyPlatform/ontology/pull/961 rename class and change axiom: https://github.com/OpenEnergyPlatform/ontology/issues/872 https://github.com/OpenEnergyPlatform/ontology/pull/1048

fossil industrial waste fuel
type: Class
equivalent class: Class
  intersection of: industrial waste fuel
  intersection of: Restriction
    on property: has origin
    some values from: fossil
subclass of: industrial waste fuel
definition: A fossil industrial waste fuel is an industrial waste fuel that has a fossil origin.
term tracker annotation: issue: https://github.com/OpenEnergyPlatform/ontology/issues/925 pull request: https://github.com/OpenEnergyPlatform/ontology/pull/961

memo item
type: Class
subclass of: information content entity
subclass of: Restriction
  on property: is about
  some values from: sector
definition: A memo item is an information content entity about a sector that describes that the sector is excluded from some kind of total and only reported to provide further information (memo).
term tracker annotation: issue: https://github.com/OpenEnergyPlatform/ontology/issues/858 pull request: https://github.com/OpenEnergyPlatform/ontology/pull/967 move to oeo-sector issue: https://github.com/OpenEnergyPlatform/ontology/issues/1399 pull request: https://github.com/OpenEnergyPlatform/ontology/pull/1724

forecast error
type: Class
subclass of: quantity value
definition: A forecast error is a quantity value that quantifies the difference between a measured and a forecasted value.
alternative label: Vorhersagefehler @de
term tracker annotation: issue: https://github.com/OpenEnergyPlatform/ontology/issues/907 pull request: https://github.com/OpenEnergyPlatform/ontology/pull/1002

gas mixture
type: Class
subclass of: portion of matter
subclass of: Restriction
  on property: has normal state of matter
  has value: OEO_00000182
definition: A gas mixture is a portion of matter that is a composition of different kinds of portions of matter and that has a gaseous normal state of matter.
alternative label: Gasgemisch @de
term tracker annotation: issue: https://github.com/OpenEnergyPlatform/ontology/issues/988 pull request: https://github.com/OpenEnergyPlatform/ontology/pull/1009

liquefied natural gas
type: Class
equivalent class: Class
  intersection of: natural gas
  intersection of: Restriction
    on property: has state of matter
    has value: OEO_00000256
subclass of: natural gas
definition: Liquefied natural gas (LNG) is natural gas that has a liquid state of matter.
alternative label: Flüssiggas @de
alternative label: LNG
term tracker annotation: issue: https://github.com/OpenEnergyPlatform/ontology/issues/1005 pull request: https://github.com/OpenEnergyPlatform/ontology/pull/1016 change spelling from liquified to liquefied: issue: https://github.com/OpenEnergyPlatform/ontology/issues/1279 pull request: https://github.com/OpenEnergyPlatform/ontology/pull/1290

gasoline fuel role
type: Class
subclass of: fuel role
disjoint with: diesel fuel role
definition: A gasoline fuel role is a fuel role that expresses that a portion of matter can be used in a gasoline engine.
editor note: The term gasoline was chosen as this term is more often used in energy modelling and energy statistics. This is a deliberate deviation from the convention of British English spelling in the OEO.
term tracker annotation: issue: https://github.com/OpenEnergyPlatform/ontology/issues/960 pull request: https://github.com/OpenEnergyPlatform/ontology/pull/1027

Axiom
annotated source: gasoline fuel role
annotated property: editor note
annotated target: The term gasoline was chosen as this term is more often used in energy modelling and energy statistics. This is a deliberate deviation from the convention of British English spelling in the OEO.
term tracker annotation: https://github.com/OpenEnergyPlatform/ontology/issues/1028 https://github.com/OpenEnergyPlatform/ontology/pull/1037

diesel fuel role
type: Class
subclass of: fuel role
definition: A diesel fuel role is a fuel role that expresses that a portion of matter can be used in a diesel engine.
term tracker annotation: issue: https://github.com/OpenEnergyPlatform/ontology/issues/960 pull request: https://github.com/OpenEnergyPlatform/ontology/pull/1027 add disjoint axiom: issue: https://github.com/OpenEnergyPlatform/ontology/issues/1286 pull request: https://github.com/OpenEnergyPlatform/ontology/pull/1288

gasoline fuel
type: Class
equivalent class: Class
  intersection of: combustion fuel
  intersection of: Restriction
    on property: has role
    some values from: gasoline fuel role
subclass of: combustion fuel
disjoint with: diesel fuel
definition: A gasoline fuel is a combustion fuel that has a gasoline fuel role.
editor note: The term gasoline was chosen as this term is more often used in energy modelling and energy statistics. This is a deliberate deviation from the convention of British English spelling in the OEO.
term tracker annotation: issue: https://github.com/OpenEnergyPlatform/ontology/issues/960 pull request: https://github.com/OpenEnergyPlatform/ontology/pull/1027

Axiom
annotated source: gasoline fuel
annotated property: editor note
annotated target: The term gasoline was chosen as this term is more often used in energy modelling and energy statistics. This is a deliberate deviation from the convention of British English spelling in the OEO.
term tracker annotation: https://github.com/OpenEnergyPlatform/ontology/issues/1028 https://github.com/OpenEnergyPlatform/ontology/pull/1037

diesel fuel
type: Class
equivalent class: Class
  intersection of: combustion fuel
  intersection of: Restriction
    on property: has role
    some values from: diesel fuel role
subclass of: combustion fuel
definition: A diesel fuel is a combustion fuel that has a diesel fuel role.
alternative label: Dieselkraftstoff @de
term tracker annotation: issue: https://github.com/OpenEnergyPlatform/ontology/issues/960 pull request: https://github.com/OpenEnergyPlatform/ontology/pull/1027 add disjoint axiom: issue: https://github.com/OpenEnergyPlatform/ontology/issues/1286 pull request: https://github.com/OpenEnergyPlatform/ontology/pull/1288

gasoline engine
type: Class
subclass of: internal combustion engine
subclass of: Restriction
  on property: uses
  some values from: gasoline fuel
definition: A gasoline engine is an internal combustion engine that uses a gasoline fuel.
editor note: The term gasoline was chosen as this term is more often used in energy modelling and energy statistics. This is a deliberate deviation from the convention of British English spelling in the OEO.
alternative label: Benzinmotor @de
alternative label: Ottomotor @de
alternative label: gasoline motor
term tracker annotation: issue: https://github.com/OpenEnergyPlatform/ontology/issues/960 pull request: https://github.com/OpenEnergyPlatform/ontology/pull/1027

Axiom
annotated source: gasoline engine
annotated property: editor note
annotated target: The term gasoline was chosen as this term is more often used in energy modelling and energy statistics. This is a deliberate deviation from the convention of British English spelling in the OEO.
term tracker annotation: https://github.com/OpenEnergyPlatform/ontology/issues/1028 https://github.com/OpenEnergyPlatform/ontology/pull/1037

diesel engine
type: Class
subclass of: internal combustion engine
subclass of: Restriction
  on property: uses
  some values from: diesel fuel
definition: A diesel engine is an internal combustion engine that uses a diesel fuel.
alternative label: Dieselmotor @de
alternative label: diesel motor
term tracker annotation: issue: https://github.com/OpenEnergyPlatform/ontology/issues/960 pull request: https://github.com/OpenEnergyPlatform/ontology/pull/1027 update axiom: issue: https://github.com/OpenEnergyPlatform/ontology/issues/1286 pull request: https://github.com/OpenEnergyPlatform/ontology/pull/1288

gasoline vehicle
type: Class
equivalent class: Class
  intersection of: internal combustion vehicle
  intersection of: Restriction
    on property: has part
    some values from: gasoline engine
  intersection of: Restriction
    on property: has part
    all values from: Class
      union of: gasoline engine
      union of: Class
        complement of: motor
subclass of: internal combustion vehicle
subclass of: Restriction
  on property: uses
  some values from: gasoline fuel
definition: A gasoline vehicle is an internal combustion vehicle that has only a gasoline engine as motor for propulsion.
editor note: The term gasoline was chosen as this term is more often used in energy modelling and energy statistics. This is a deliberate deviation from the convention of British English spelling in the OEO.
alternative label: Benzinfahrzeug @de
term tracker annotation: issue: https://github.com/OpenEnergyPlatform/ontology/issues/960 pull request: https://github.com/OpenEnergyPlatform/ontology/pull/1027 Convert to equivalent class: issue: https://github.com/OpenEnergyPlatform/ontology/issues/1311 pull request: https://github.com/OpenEnergyPlatform/ontology/pull/1315

Axiom
annotated source: gasoline vehicle
annotated property: editor note
annotated target: The term gasoline was chosen as this term is more often used in energy modelling and energy statistics. This is a deliberate deviation from the convention of British English spelling in the OEO.
term tracker annotation: https://github.com/OpenEnergyPlatform/ontology/issues/1028 https://github.com/OpenEnergyPlatform/ontology/pull/1037

diesel vehicle
type: Class
equivalent class: Class
  intersection of: internal combustion vehicle
  intersection of: Restriction
    on property: has part
    some values from: diesel engine
  intersection of: Restriction
    on property: has part
    all values from: Class
      union of: diesel engine
      union of: Class
        complement of: motor
subclass of: internal combustion vehicle
subclass of: Restriction
  on property: uses
  some values from: diesel fuel
definition: A diesel vehicle is an internal combustion vehicle that has only a diesel engine as motor for propulsion.
alternative label: Dieselfahrzeug @de
term tracker annotation: issue: https://github.com/OpenEnergyPlatform/ontology/issues/960 pull request: https://github.com/OpenEnergyPlatform/ontology/pull/1027 update axiom: issue: https://github.com/OpenEnergyPlatform/ontology/issues/1286 pull request: https://github.com/OpenEnergyPlatform/ontology/pull/1288 Convert to equivalent class: issue: https://github.com/OpenEnergyPlatform/ontology/issues/1311 pull request: https://github.com/OpenEnergyPlatform/ontology/pull/1315

abbreviation
type: Class
subclass of: symbol
subclass of: Restriction
  on property: is about
  some values from: textual entity
definition: An abbreviation is a symbol of a textual entity.
alternative label: Abkürzung @de
term tracker annotation: issue: https://github.com/OpenEnergyPlatform/ontology/issues/1039 pull request: https://github.com/OpenEnergyPlatform/ontology/pull/1075

heat gain process
type: Class
equivalent class: Class
  intersection of: Restriction
    on property: has occurrent part
    some values from: Class
      intersection of: MENO_01013
      intersection of: Restriction
        on property: negatively regulates characteristic
        some values from: energy
  intersection of: Restriction
    on property: has occurrent part
    some values from: Class
      intersection of: MENO_01014
      intersection of: Restriction
        on property: positively regulates characteristic
        some values from: thermal energy
subclass of: energy transformation
definition: A heat gain process is an energy transformation that has thermal energy as energy output.
alternative label: heat generation
alternative label: heat generation process
comment: With the logical definition of heat gain process, heat transfer is inferred as subclass which is intended but depends on the perspective and the system boundaries. To avoid confusion, the main label was changed from heat generation to heat gain process.
term tracker annotation: issue: https://github.com/OpenEnergyPlatform/ontology/issues/1045 pull request: https://github.com/OpenEnergyPlatform/ontology/pull/1130 Add alternative term: issue: https://github.com/OpenEnergyPlatform/ontology/issues/1455 pull request: https://github.com/OpenEnergyPlatform/ontology/pull/1562 replace energy-participant axioms issue: https://github.com/OpenEnergyPlatform/ontology/issues/2053 pull request: https://github.com/OpenEnergyPlatform/ontology/pull/2120 relabel issue: https://github.com/OpenEnergyPlatform/ontology/issues/2053 pull request: https://github.com/OpenEnergyPlatform/ontology/pull/2120

combustion thermal energy transformation
type: Class
subclass of: energy transformation
subclass of: Class
  intersection of: Restriction
    on property: has occurrent part
    some values from: Class
      intersection of: MENO_01013
      intersection of: Restriction
        on property: negatively regulates characteristic
        some values from: chemical energy
  intersection of: Restriction
    on property: has occurrent part
    some values from: Class
      intersection of: MENO_01014
      intersection of: Restriction
        on property: positively regulates characteristic
        some values from: thermal energy
subclass of: Restriction
  on property: has occurrent part
  some values from: combustion
subclass of: Restriction
  on property: causally upstream of or within
  some values from: emission
subclass of: Restriction
  on property: has physical input
  some values from: combustion fuel
definition: A combustion thermal energy transformation is an energy transformation that converts chemical energy of a combustion fuel into thermal energy.
term tracker annotation: issue: https://github.com/OpenEnergyPlatform/ontology/issues/1045 pull request: https://github.com/OpenEnergyPlatform/ontology/pull/1130 Add relation to emission issue: https://github.com/OpenEnergyPlatform/ontology/issues/1045 pull request: https://github.com/OpenEnergyPlatform/ontology/pull/1210 replace energy-participant axioms issue: https://github.com/OpenEnergyPlatform/ontology/issues/2053 pull request: https://github.com/OpenEnergyPlatform/ontology/pull/2120

study factsheet
type: Class
subclass of: factsheet
subclass of: Restriction
  on property: is about
  some values from: study
definition: A study factsheet is a factsheet that contains information about a scenario study.
term tracker annotation: issue: https://github.com/OpenEnergyPlatform/ontology/issues/1069 pull request: https://github.com/OpenEnergyPlatform/ontology/pull/1131

OEP study factsheet
type: Class
subclass of: study factsheet
subclass of: Restriction
  on property: is about
  some values from: scenario study
definition: An OEP study factsheet is an study factsheet hosted on the Open Energy Platform. It is used to access the Open Energy Knowledge Graph (OEKG).
term tracker annotation: issue: https://github.com/OpenEnergyPlatform/ontology/issues/1069 pull request: https://github.com/OpenEnergyPlatform/ontology/pull/1131

scenario study
type: Class
subclass of: study
subclass of: Restriction
  on property: is based on
  some values from: scenario
definition: A scenario study is a study that investigates one or more scenarios.
alternative label: Szenariostudie @de
term tracker annotation: issue: https://github.com/OpenEnergyPlatform/ontology/issues/1058 pull request: https://github.com/OpenEnergyPlatform/ontology/pull/1131 add based on axiom issue: https://github.com/OpenEnergyPlatform/ontology/issues/1346 pull request: https://github.com/OpenEnergyPlatform/ontology/pull/1391

traction
type: Class
subclass of: process
subclass of: Restriction
  on property: has participant
  some values from: object
definition: Traction is a process of pushing or pulling to drive an object.
alternative label: propulsion
term tracker annotation: issue: https://github.com/OpenEnergyPlatform/ontology/issues/1029 pull request: https://github.com/OpenEnergyPlatform/ontology/pull/1135 relabel issue: https://github.com/OpenEnergyPlatform/ontology/issues/1528 pull request: https://github.com/OpenEnergyPlatform/ontology/pull/1541

traction motor
type: Class
equivalent class: Class
  intersection of: motor
  intersection of: Restriction
    on property: participates in
    some values from: traction
subclass of: motor
definition: A traction motor is a motor that is used for propulsion.
alternative label: Antriebsmotor @de
alternative label: Traktionsmotor @de
term tracker annotation: issue: https://github.com/OpenEnergyPlatform/ontology/issues/1029 pull request: https://github.com/OpenEnergyPlatform/ontology/pull/1135

nationally determined contribution
type: Class
subclass of: legal target description
subclass of: Restriction
  on property: is about
  some values from: greenhouse gas emission
definition: A nationally determined contribution (NDC) is a target description of future greenhouse gas emission reductions prepared, communicated and maintained by a party to the Paris Agreement.
alternative label: NDC
term tracker annotation: issue: https://github.com/OpenEnergyPlatform/ontology/issues/947 pull request: https://github.com/OpenEnergyPlatform/ontology/pull/1151 move axiom to shared-axioms issue: https://github.com/OpenEnergyPlatform/ontology/issues/1703 pull request: https://github.com/OpenEnergyPlatform/ontology/pull/1706

maximum value
type: Class
subclass of: quantity value
definition: A maximum value is a quantity value that represents the upper limit of an artificial object or process to contain or transform another entity.
alternative label: Maximalwert @de
term tracker annotation: issue: https://github.com/OpenEnergyPlatform/ontology/issues/1092 pull request: https://github.com/OpenEnergyPlatform/ontology/pull/1155 Made 'energy storage capacity' subclass of "maximum value' issue: https://github.com/OpenEnergyPlatform/ontology/issues/1466 pull request: https://github.com/OpenEnergyPlatform/ontology/pull/1486

power capacity
type: Class
subclass of: OEO_00230001
subclass of: Restriction
  on property: quantity value of
  some values from: Class
    union of: generator
    union of: power generating unit
subclass of: Restriction
  on property: has unit
  some values from: power unit
definition: A power capacity is a power rating of a generator or power generating unit to generate power.
term tracker annotation: issue: https://github.com/OpenEnergyPlatform/ontology/issues/1092 pull request: https://github.com/OpenEnergyPlatform/ontology/pull/1155 Fix 'quantity value of' axiom: issue: https://github.com/OpenEnergyPlatform/ontology/issues/1223 pull request: https://github.com/OpenEnergyPlatform/ontology/pull/1235 Restructure 'power rating' and 'power capacity': issue: https://github.com/OpenEnergyPlatform/ontology/issues/1492 pull request: https://github.com/OpenEnergyPlatform/ontology/pull/1770

bioenergy
type: Class
equivalent class: Class
  intersection of: chemical energy
  intersection of: Restriction
    on property: has origin
    some values from: biogenic
subclass of: chemical energy
definition: Bioenergy is chemical energy that is stored in biofuels.
term editor: issue: https://github.com/OpenEnergyPlatform/ontology/issues/1168 pull request: https://github.com/OpenEnergyPlatform/ontology/pull/1188
alternative label: Bioenergie @de

measurement device
type: Class
subclass of: artificial object
definition: A measurement device is an artificial object that is used in some measurement process.
alternative label: Messgerät @de
term tracker annotation: issue: https://github.com/OpenEnergyPlatform/ontology/issues/1214 pull request: https://github.com/OpenEnergyPlatform/ontology/pull/1215

parameterisation
type: Class
subclass of: process
subclass of: Restriction
  on property: has input
  some values from: assumption
subclass of: Restriction
  on property: has output
  some values from: exogenous data
definition: Parameterisation is the process of translating assumptions into exogenous data the model can use.
alternative label: Parametrisierung @de
alternative label: parametrise
term tracker annotation: issue: https://github.com/OpenEnergyPlatform/ontology/issues/1040 pull request: https://github.com/OpenEnergyPlatform/ontology/pull/1216

model calibration
type: Class
subclass of: process
subclass of: Restriction
  on property: part of
  some values from: validation
subclass of: Restriction
  on property: has participant
  some values from: numerical computer model
subclass of: Restriction
  on property: has participant
  some values from: exogenous data
definition: Model calibration is a process of varying exogenous data, so that the model reproduces the known data (e.g. historical) as far as possible, and thus a part of validation.
alternative label: Modellkalibration @de
term tracker annotation: issue: https://github.com/OpenEnergyPlatform/ontology/issues/1040 pull request: https://github.com/OpenEnergyPlatform/ontology/pull/1216

scenario projection
type: Class
subclass of: process
subclass of: Restriction
  on property: has part
  some values from: model calculation
subclass of: Restriction
  on property: has output
  some values from: output data
subclass of: Restriction
  on property: is based on
  some values from: scenario
definition: A scenario projection is an intentional process in which output (endogenous) data of interest are quantified for future points in time using one or more model calculation based on a scenario.
editor note: A scenario projection is an intentional process (with human participation): A scenario is either created or selected, its assumptions are translated into data sets. These datasets are quantified and serve as inputs to a model calculation which is applied to quantitatively project one or more variables of interest into the future. (Intentional: a research question is basis for the projection to be done)
alternative label: Szenarioprojektion @de
term tracker annotation: issue: https://github.com/OpenEnergyPlatform/ontology/issues/970 pull request: https://github.com/OpenEnergyPlatform/ontology/pull/1217 add based on axiom issue: https://github.com/OpenEnergyPlatform/ontology/issues/1346 pull request: https://github.com/OpenEnergyPlatform/ontology/pull/1391

passenger transport
type: Class
subclass of: transport
subclass of: Restriction
  on property: has participant
  some values from: vehicle
subclass of: Restriction
  on property: has participant
  some values from: Class
    intersection of: person
    intersection of: Restriction
      on property: has role
      some values from: passenger
definition: A passenger transport is a transport process in which people are moved in a vehicle from one place to another.
alternative label: Personentransport @de
term tracker annotation: issue: https://github.com/OpenEnergyPlatform/ontology/issues/1055 pull request: https://github.com/OpenEnergyPlatform/ontology/pull/1234 rework module structure issue: https://github.com/OpenEnergyPlatform/ontology/issues/1592 pull request: https://github.com/OpenEnergyPlatform/ontology/pull/1652

passenger
type: Class
subclass of: agent
subclass of: Restriction
  on property: characteristic of
  some values from: person
definition: A passenger is an agent who travels in a vehicle.
alternative label: Passagier @de
alternative label: Passagierin @de
term tracker annotation: issue: https://github.com/OpenEnergyPlatform/ontology/issues/1055 pull request: https://github.com/OpenEnergyPlatform/ontology/pull/1234 rework module structure issue: https://github.com/OpenEnergyPlatform/ontology/issues/1592 pull request: https://github.com/OpenEnergyPlatform/ontology/pull/1652 replaced 'has bearer' with 'characteristic of' issue: https://github.com/OpenEnergyPlatform/ontology/issues/1907 pull request: https://github.com/OpenEnergyPlatform/ontology/pull/1928

energy service demand for passenger-kilometre
type: Class
subclass of: OEO_00240024
subclass of: Restriction
  on property: realized in
  some values from: passenger transport
definition: Energy service demand for passenger-kilometre is the energy service demand that is consumed to transport one person over a distance of one kilometre.
term tracker annotation: issue: https://github.com/OpenEnergyPlatform/ontology/issues/1055 pull request: https://github.com/OpenEnergyPlatform/ontology/pull/1234 rework module structure issue: https://github.com/OpenEnergyPlatform/ontology/issues/1592 pull request: https://github.com/OpenEnergyPlatform/ontology/pull/1652

energy service demand for ton-kilometre
type: Class
subclass of: OEO_00240024
subclass of: Restriction
  on property: realized in
  some values from: freight transport
definition: Energy service demand for ton-kilometre is the energy service demand that is consumed to transport one metric ton over a distance of one kilometre.
term tracker annotation: issue: https://github.com/OpenEnergyPlatform/ontology/issues/1055 pull request: https://github.com/OpenEnergyPlatform/ontology/pull/1234 rework module structure issue: https://github.com/OpenEnergyPlatform/ontology/issues/1592 pull request: https://github.com/OpenEnergyPlatform/ontology/pull/1652

steam reforming
type: Class
subclass of: chemical reaction
subclass of: Class
  intersection of: Restriction
    on property: has occurrent part
    some values from: Class
      intersection of: MENO_01013
      intersection of: Restriction
        on property: negatively regulates characteristic
        some values from: Class
  intersection of: Restriction
    on property: has occurrent part
    some values from: Class
      intersection of: MENO_01014
      intersection of: Restriction
        on property: positively regulates characteristic
        some values from: chemical energy
subclass of: Restriction
  on property: has physical input
  some values from: steam
subclass of: Restriction
  on property: has physical input
  some values from: hydrocarbon
subclass of: Restriction
  on property: has physical output
  some values from: syngas
definition: A steam reforming process is a chemical reaction that converts hydrocarbons and steam to syngas. As it converts chemical energy and thermal energy to a different type of chemical energy (and waste heat), it is also an energy transformation process.
alternative label: Dampfreformierung @de
term tracker annotation: issue: https://github.com/OpenEnergyPlatform/ontology/issues/1211 pull request: https://github.com/OpenEnergyPlatform/ontology/pull/1251

emission price
type: Class
subclass of: monetary value
subclass of: Restriction
  on property: quantity value of
  some values from: Class
    intersection of: emission
    intersection of: Restriction
      on property: has characteristic
      some values from: monetary price
definition: An emission price is a monetary price of emitting a certain emission value.
alternative label: Emissionspreis @de
term tracker annotation: issue: https://github.com/OpenEnergyPlatform/ontology/issues/866 pull request: https://github.com/OpenEnergyPlatform/ontology/pull/1253 rework module structure issue: https://github.com/OpenEnergyPlatform/ontology/issues/1592 pull request: https://github.com/OpenEnergyPlatform/ontology/pull/1652 add axiom to oeo-shared-axioms issue: https://github.com/OpenEnergyPlatform/ontology/issues/1902 pull request: https://github.com/OpenEnergyPlatform/ontology/pull/1915

CO2 price
type: Class
subclass of: emission price
definition: A CO2 price is an emission price of emitting a certain CO2 emission value.
alternative label: CO2-Preis @de
alternative label: carbon price
term tracker annotation: issue: https://github.com/OpenEnergyPlatform/ontology/issues/866 pull request: https://github.com/OpenEnergyPlatform/ontology/pull/1253 rework module structure issue: https://github.com/OpenEnergyPlatform/ontology/issues/1592 pull request: https://github.com/OpenEnergyPlatform/ontology/pull/1652

carbon tax value
type: Class
subclass of: CO2 price
definition: A carbon tax value is a CO2 price that is set by a carbon tax.
alternative label: CO2-Steuer-Höhe @de
term tracker annotation: issue: https://github.com/OpenEnergyPlatform/ontology/issues/866 pull request: https://github.com/OpenEnergyPlatform/ontology/pull/1253 rework module structure issue: https://github.com/OpenEnergyPlatform/ontology/issues/1592 pull request: https://github.com/OpenEnergyPlatform/ontology/pull/1652

CO2 emission certificate price
type: Class
subclass of: emission certificate price
definition: A CO2 emission certificate price is an emission price of an CO2 emission certificate that allows the emission of certain CO2 emission value.
alternative label: CO2-Zertifikatspreis @de
term tracker annotation: issue: https://github.com/OpenEnergyPlatform/ontology/issues/866 pull request: https://github.com/OpenEnergyPlatform/ontology/pull/1253 rework module structure issue: https://github.com/OpenEnergyPlatform/ontology/issues/1592 pull request: https://github.com/OpenEnergyPlatform/ontology/pull/1652 make equivalent axiom a subclass of axiom and split it issue: https://github.com/OpenEnergyPlatform/ontology/issues/2138 pull request: https://github.com/OpenEnergyPlatform/ontology/pull/2143

land vehicle
type: Class
subclass of: vehicle
definition: A land vehicle is a vehicle that is moved by applying forces against the ground.
alternative label: Landfahrzeug @de
term tracker annotation: issue: https://github.com/OpenEnergyPlatform/ontology/issues/1277 pull request: https://github.com/OpenEnergyPlatform/ontology/pull/1293 fixing bugs issue: https://github.com/OpenEnergyPlatform/ontology/issues/1898 pull request: https://github.com/OpenEnergyPlatform/ontology/pull/1899

road vehicle
type: Class
subclass of: land vehicle
definition: A road vehicle is a vehicle that uses roads.
alternative label: Straßenfahrzeug @de
term tracker annotation: issue: https://github.com/OpenEnergyPlatform/ontology/issues/1277 pull request: https://github.com/OpenEnergyPlatform/ontology/pull/1293

motorised road vehicle
type: Class
subclass of: road vehicle
subclass of: Restriction
  on property: has part
  some values from: traction motor
definition: A motorised road vehicle is a road vehicle that has a traction motor.
term tracker annotation: issue: https://github.com/OpenEnergyPlatform/ontology/issues/1277 pull request: https://github.com/OpenEnergyPlatform/ontology/pull/1293

car
type: Class
subclass of: motorised road vehicle
subclass of: Restriction
  on property: participates in
  some values from: passenger transport
definition: A car is a motorised road vehicle that is used for passenger transport and has a maximum of eight seats.
alternative label: Auto @de
alternative label: automobile
term tracker annotation: issue: https://github.com/OpenEnergyPlatform/ontology/issues/1277 pull request: https://github.com/OpenEnergyPlatform/ontology/pull/1293

bus
type: Class
subclass of: motorised road vehicle
subclass of: Restriction
  on property: participates in
  some values from: passenger transport
definition: A bus is a motorised road vehicle that is used for passenger transport and has more than eight seats.
alternative label: Bus @de
alternative label: autobus
term tracker annotation: issue: https://github.com/OpenEnergyPlatform/ontology/issues/1277 pull request: https://github.com/OpenEnergyPlatform/ontology/pull/1293

truck
type: Class
subclass of: motorised road vehicle
subclass of: Restriction
  on property: participates in
  some values from: freight transport
definition: A truck is a motorised road vehicle that is used for freight transport.
alternative label: LKW @de
alternative label: Lastkraftwagen @de
alternative label: Lastwagen @de
alternative label: lorry
term tracker annotation: issue: https://github.com/OpenEnergyPlatform/ontology/issues/1277 pull request: https://github.com/OpenEnergyPlatform/ontology/pull/1293

bicycle
type: Class
subclass of: road vehicle
subclass of: Restriction
  on property: participates in
  some values from: passenger transport
definition: A bicycle is a road vehicle that has two wheels and is propelled by a person.
alternative label: Fahrrad @de
term tracker annotation: issue: https://github.com/OpenEnergyPlatform/ontology/issues/1277 pull request: https://github.com/OpenEnergyPlatform/ontology/pull/1293

train
type: Class
subclass of: land vehicle
definition: A train is a vehicle that uses railway tracks.
alternative label: Zug @de
term tracker annotation: issue: https://github.com/OpenEnergyPlatform/ontology/issues/1277 pull request: https://github.com/OpenEnergyPlatform/ontology/pull/1293

freight train
type: Class
subclass of: train
subclass of: Restriction
  on property: participates in
  some values from: freight transport
definition: A freight train is a train that is used for freight transport.
alternative label: Güterzug @de
term tracker annotation: issue: https://github.com/OpenEnergyPlatform/ontology/issues/1277 pull request: https://github.com/OpenEnergyPlatform/ontology/pull/1293

passenger train
type: Class
subclass of: train
subclass of: Restriction
  on property: participates in
  some values from: passenger transport
definition: A passenger train is a train that is used for passenger transport.
alternative label: Personenzug @de
term tracker annotation: issue: https://github.com/OpenEnergyPlatform/ontology/issues/1277 pull request: https://github.com/OpenEnergyPlatform/ontology/pull/1293

e-bike
type: Class
subclass of: bicycle
subclass of: Restriction
  on property: has part
  some values from: traction battery
subclass of: Restriction
  on property: has part
  some values from: electric traction motor
definition: An e-bike is a bicycle that is propelled by a person and an electric traction motor.
alternative label: E-Bike @de
alternative label: Elektrofahrrad @de
term tracker annotation: issue: https://github.com/OpenEnergyPlatform/ontology/issues/1277 pull request: https://github.com/OpenEnergyPlatform/ontology/pull/1293 Add 'traction battery' axiom: issue: https://github.com/OpenEnergyPlatform/ontology/issues/1311 pull request: https://github.com/OpenEnergyPlatform/ontology/pull/1315

motorcycle
type: Class
subclass of: motorised road vehicle
subclass of: Restriction
  on property: participates in
  some values from: passenger transport
definition: A motorcycle is a motorised road vehicle that has two wheels.
alternative label: Motorrad @de
alternative label: motorbike
term tracker annotation: issue: https://github.com/OpenEnergyPlatform/ontology/issues/1277 pull request: https://github.com/OpenEnergyPlatform/ontology/pull/1293

watercraft
type: Class
subclass of: vehicle
definition: A watercraft is a vehicle that is driving through water.
alternative label: Wasserfahrzeug @de
term tracker annotation: issue: https://github.com/OpenEnergyPlatform/ontology/issues/1277 pull request: https://github.com/OpenEnergyPlatform/ontology/pull/1293

ship
type: Class
subclass of: watercraft
definition: A ship is a watercraft of significant size that is driving on the water surface.
alternative label: Schiff @de
term tracker annotation: issue: https://github.com/OpenEnergyPlatform/ontology/issues/1277 pull request: https://github.com/OpenEnergyPlatform/ontology/pull/1293

passenger ship
type: Class
subclass of: ship
subclass of: Restriction
  on property: participates in
  some values from: passenger transport
definition: A passenger ship is a ship that is used for passenger transport.
alternative label: Passagierschiff @de
term tracker annotation: issue: https://github.com/OpenEnergyPlatform/ontology/issues/1277 pull request: https://github.com/OpenEnergyPlatform/ontology/pull/1293

cargo ship
type: Class
subclass of: ship
subclass of: Restriction
  on property: participates in
  some values from: freight transport
definition: A cargo ship is a ship that is used for freight transport.
alternative label: Frachtschiff @de
term tracker annotation: issue: https://github.com/OpenEnergyPlatform/ontology/issues/1277 pull request: https://github.com/OpenEnergyPlatform/ontology/pull/1293

container ship
type: Class
subclass of: cargo ship
definition: A container ship is a cargo ship used for the transport of containers.
alternative label: Containerschiff @de
term tracker annotation: issue: https://github.com/OpenEnergyPlatform/ontology/issues/1277 pull request: https://github.com/OpenEnergyPlatform/ontology/pull/1293

tank ship
type: Class
subclass of: cargo ship
subclass of: Restriction
  on property: has part
  some values from: OEO_00320055
definition: A tank ship is a cargo ship used for the transport of liquid goods.
alternative label: Tankschiff @de
term tracker annotation: issue: https://github.com/OpenEnergyPlatform/ontology/issues/1277 pull request: https://github.com/OpenEnergyPlatform/ontology/pull/1293 Add tank axiom: issue: https://github.com/OpenEnergyPlatform/ontology/issues/1301 pull request: https://github.com/OpenEnergyPlatform/ontology/pull/1356

motorised vehicle
type: Class
equivalent class: Class
  intersection of: vehicle
  intersection of: Restriction
    on property: has part
    some values from: traction motor
subclass of: vehicle
definition: A motorised vehicle is a vehicle that has a traction motor.
alternative label: Kraftfahrzeug @de
term tracker annotation: issue: https://github.com/OpenEnergyPlatform/ontology/issues/1277 pull request: https://github.com/OpenEnergyPlatform/ontology/pull/1293

aircraft
type: Class
subclass of: vehicle
definition: An aircraft is a vehicle that is flying in the air.
alternative label: Luftfahrzeug @de
term tracker annotation: issue: https://github.com/OpenEnergyPlatform/ontology/issues/1277 pull request: https://github.com/OpenEnergyPlatform/ontology/pull/1293

airplane
type: Class
subclass of: aircraft
definition: An airplane is an aircraft that has fixed wings.
alternative label: Flugzeug @de
term tracker annotation: issue: https://github.com/OpenEnergyPlatform/ontology/issues/1277 pull request: https://github.com/OpenEnergyPlatform/ontology/pull/1293

helicopter
type: Class
subclass of: aircraft
definition: A helicopter is an aircraft that has rotating wings.
alternative label: Helikopter @de
alternative label: Hubschrauber @de
term tracker annotation: issue: https://github.com/OpenEnergyPlatform/ontology/issues/1277 pull request: https://github.com/OpenEnergyPlatform/ontology/pull/1293

conventional energy
type: Class
equivalent class: Class
  intersection of: energy
  intersection of: Restriction
    on property: has origin
    some values from: conventional
subclass of: energy
disjoint with: renewable energy
definition: A conventional energy is an energy that has a conventional origin.
alternative label: konventionelle Energie @de
term tracker annotation: issue: https://github.com/OpenEnergyPlatform/ontology/issues/1270 pull request: https://github.com/OpenEnergyPlatform/ontology/pull/1295

primary energy consumption calculation method
type: Class
subclass of: methodology
subclass of: Restriction
  on property: is about
  some values from: primary energy consumption value
definition: A primary energy consumption calculation method is a methodology to calculate primary energy consumption.
term tracker annotation: issue: https://github.com/OpenEnergyPlatform/ontology/issues/1129 pull request: https://github.com/OpenEnergyPlatform/ontology/pull/1306 Move to oeo-shared: issue: https://github.com/OpenEnergyPlatform/ontology/issues/1400 pull request: https://github.com/OpenEnergyPlatform/ontology/pull/1463 rework module structure issue: https://github.com/OpenEnergyPlatform/ontology/issues/1592 pull request: https://github.com/OpenEnergyPlatform/ontology/pull/1652

substitution method
type: Class
subclass of: primary energy consumption calculation method
definition: A substitution method is a primary energy consumption calculation method that treats renewable energy carriers as if they have similar conversion losses as a specified fossil reference energy carrier.
alternative label: Substitutionsmethode @de
term tracker annotation: issue: https://github.com/OpenEnergyPlatform/ontology/issues/1129 pull request: https://github.com/OpenEnergyPlatform/ontology/pull/1306 rework module structure issue: https://github.com/OpenEnergyPlatform/ontology/issues/1592 pull request: https://github.com/OpenEnergyPlatform/ontology/pull/1652

direct equivalent method
type: Class
subclass of: primary energy consumption calculation method
definition: A direct equivalent method is a primary energy consumption calculation method that quantifies renewable and nuclear energies using its secondary energy content assuming no conversion losses.
term tracker annotation: issue: https://github.com/OpenEnergyPlatform/ontology/issues/1129 pull request: https://github.com/OpenEnergyPlatform/ontology/pull/1306 rework module structure issue: https://github.com/OpenEnergyPlatform/ontology/issues/1592 pull request: https://github.com/OpenEnergyPlatform/ontology/pull/1652

physical method
type: Class
subclass of: primary energy consumption calculation method
definition: A physical method is a method to calculate primary energy consumption that quantifies renewable and nuclear energies by attributing an efficiency value each.
alternative label: physikalische Methode @de
term tracker annotation: issue: https://github.com/OpenEnergyPlatform/ontology/issues/1129 pull request: https://github.com/OpenEnergyPlatform/ontology/pull/1306 rework module structure issue: https://github.com/OpenEnergyPlatform/ontology/issues/1592 pull request: https://github.com/OpenEnergyPlatform/ontology/pull/1652

current collector
type: Class
subclass of: energy converting component
subclass of: Restriction
  on property: part of
  some values from: grid supplied electric vehicle
subclass of: Restriction
  on property: has energy input
  some values from: electrical energy
subclass of: Restriction
  on property: has energy output
  some values from: electrical energy
definition: A current collector is an energy converting component that transfers electrical energy between a stationary conductor and a grid supplied electric vehicle.
alternative label: Stromabnehmer @de
term tracker annotation: issue: https://github.com/OpenEnergyPlatform/ontology/issues/1311 pull request: https://github.com/OpenEnergyPlatform/ontology/pull/1315

gas turbine vehicle
type: Class
equivalent class: Class
  intersection of: vehicle
  intersection of: Restriction
    on property: has part
    some values from: Class
      intersection of: gas turbine
      intersection of: Restriction
        on property: participates in
        some values from: traction
subclass of: vehicle
subclass of: Restriction
  on property: has part
  some values from: OEO_00320056
definition: A gas turbine vehicle is a vehicle that uses a gas turbine for propulsion.
alternative label: Gasturbinenfahrzeug @de
term tracker annotation: issue: https://github.com/OpenEnergyPlatform/ontology/issues/1311 pull request: https://github.com/OpenEnergyPlatform/ontology/pull/1315 Add fuel tank axiom: issue: https://github.com/OpenEnergyPlatform/ontology/issues/1301 pull request: https://github.com/OpenEnergyPlatform/ontology/pull/1356

jet fuel vehicle
type: Class
equivalent class: Class
  intersection of: gas turbine vehicle
  intersection of: Restriction
    on property: has part
    some values from: Class
      intersection of: jet fuel turbine
      intersection of: Restriction
        on property: participates in
        some values from: traction
subclass of: gas turbine vehicle
definition: A jet fuel vehicle is a gas turbine vehicle that uses a jet fuel turbine.
term tracker annotation: issue: https://github.com/OpenEnergyPlatform/ontology/issues/1311 pull request: https://github.com/OpenEnergyPlatform/ontology/pull/1315

jet fuel turbine
type: Class
subclass of: gas turbine
subclass of: Restriction
  on property: uses
  some values from: jet fuel
definition: A jet fuel turbine is a turbine fueled with jet fuel.
alternative label: aviation turbine
alternative label: jet turbine
term tracker annotation: issue: https://github.com/OpenEnergyPlatform/ontology/issues/1311 pull request: https://github.com/OpenEnergyPlatform/ontology/pull/1315

NC/BR sector division
type: Class
subclass of: CRF-based sector division
definition: The NC/BR sector division is a CRF-based sector division defined by the UNFCCC reporting guidelines on national communications for Parties included in Annex I to the Convention. (https://unfccc.int/sites/default/files/resource/cp2019_13a01_adv.pdf, 6/CP.25, VI, Table 2)
term tracker annotation: issue: https://github.com/OpenEnergyPlatform/ontology/issues/1273 pull request: https://github.com/OpenEnergyPlatform/ontology/pull/1317 Convert to class: issue: https://github.com/OpenEnergyPlatform/ontology/issues/1449 pull request: https://github.com/OpenEnergyPlatform/ontology/pull/1462 move to oeo-sector issue: https://github.com/OpenEnergyPlatform/ontology/issues/1399 pull request: https://github.com/OpenEnergyPlatform/ontology/pull/1724

sectoral energy consumption
type: Class
subclass of: energy use
subclass of: Restriction
  on property: has quantity value
  some values from: energy value
definition: A sectoral energy consumption is the energy use of a sector.
alternative label: sectoral energy use
alternative label: sektoraler Energieverbrauch @de
term tracker annotation: issue: https://github.com/OpenEnergyPlatform/ontology/issues/864 pull request: https://github.com/OpenEnergyPlatform/ontology/pull/1321

sectoral emission
type: Class
subclass of: emission
subclass of: Restriction
  on property: has quantity value
  some values from: energy value
definition: A sectoral emission is an emission caused by a certain sector.
alternative label: sektorale Emission @de
term tracker annotation: issue: https://github.com/OpenEnergyPlatform/ontology/issues/864 pull request: https://github.com/OpenEnergyPlatform/ontology/pull/1321

mineral oil refining process
type: Class
subclass of: secondary energy production
subclass of: Restriction
  on property: has part
  some values from: chemical reaction
subclass of: Restriction
  on property: has physical input
  some values from: crude oil
subclass of: Restriction
  on property: has physical output
  some values from: mineral oil product
subclass of: Restriction
  on property: has energy input
  some values from: chemical energy
subclass of: Restriction
  on property: has energy output
  some values from: chemical energy
definition: A mineral oil refining process is a secondary energy production that converts crude oil by cracking and distillation into various mineral oil products.
alternative label: Mineralölraffination @de
alternative label: mineral oil refining
term tracker annotation: issue: https://github.com/OpenEnergyPlatform/ontology/issues/1318 pull request: https://github.com/OpenEnergyPlatform/ontology/pull/1331 move to oeo-shared: issue: https://github.com/OpenEnergyPlatform/ontology/issues/1384 pull request: https://github.com/OpenEnergyPlatform/ontology/pull/1390 make subclass of secondary energy production and further changes: issue: https://github.com/OpenEnergyPlatform/ontology/issues/1522 pull request: https://github.com/OpenEnergyPlatform/ontology/pull/1531 rework module structure issue: https://github.com/OpenEnergyPlatform/ontology/issues/1592 pull request: https://github.com/OpenEnergyPlatform/ontology/pull/1652

mineral oil product
type: Class
equivalent class: Class
  intersection of: fossil combustion fuel
  intersection of: Restriction
    on property: physical output of
    some values from: mineral oil refining process
subclass of: fossil combustion fuel
subclass of: Restriction
  on property: has disposition
  some values from: secondary energy carrier disposition
definition: A mineral oil product is a fossil combustion fuel produced in a mineral oil refining process.
alternative label: Mineralölprodukt @de
term tracker annotation: issue: https://github.com/OpenEnergyPlatform/ontology/issues/1318 pull request: https://github.com/OpenEnergyPlatform/ontology/pull/1331 move to oeo-shared: issue: https://github.com/OpenEnergyPlatform/ontology/issues/1384 pull request: https://github.com/OpenEnergyPlatform/ontology/pull/1390 Add 'secondary energy carrier disposition' axiom issue: https://github.com/OpenEnergyPlatform/ontology/issues/1522 pull request: https://github.com/OpenEnergyPlatform/ontology/pull/1531 rework module structure issue: https://github.com/OpenEnergyPlatform/ontology/issues/1592 pull request: https://github.com/OpenEnergyPlatform/ontology/pull/1652

mineral oil
type: Class
equivalent class: Class
  intersection of: fossil combustion fuel
  intersection of: Class
    union of: crude oil
    union of: mineral oil product
subclass of: fossil combustion fuel
definition: A mineral oil is a fossil combustion fuel that is either crude oil or a mineral oil product.
alternative label: Mineralöl @de
term tracker annotation: issue: https://github.com/OpenEnergyPlatform/ontology/issues/1318 pull request: https://github.com/OpenEnergyPlatform/ontology/pull/1331

mineral oil refinery
type: Class
subclass of: energy transformation unit
subclass of: Restriction
  on property: participates in
  some values from: mineral oil refining process
subclass of: Restriction
  on property: uses
  some values from: crude oil
definition: A mineral oil refinery is an energy transformation unit that applies a mineral oil refining process.
alternative label: Mineralölraffinerie @de
term tracker annotation: issue: https://github.com/OpenEnergyPlatform/ontology/issues/1318 pull request: https://github.com/OpenEnergyPlatform/ontology/pull/1331

mineral oil refining sector
type: Class
subclass of: energy transformation sector
subclass of: Restriction
  on property: is sector of
  some values from: mineral oil refining process
definition: A mineral oil refining sector is an energy transformation sector that covers mineral oil refining.
term tracker annotation: issue: https://github.com/OpenEnergyPlatform/ontology/issues/1318 pull request: https://github.com/OpenEnergyPlatform/ontology/pull/1331 move axiom to shared-axioms issue: https://github.com/OpenEnergyPlatform/ontology/issues/1703 pull request: https://github.com/OpenEnergyPlatform/ontology/pull/1706 move to oeo-sector issue: https://github.com/OpenEnergyPlatform/ontology/issues/1399 pull request: https://github.com/OpenEnergyPlatform/ontology/pull/1724

international transport sector
type: Class
subclass of: transport sector
subclass of: Restriction
  on property: is sector of
  some values from: international transport
definition: An international transport sector is a transport sector of international transport processes.
term tracker annotation: issue: https://github.com/OpenEnergyPlatform/ontology/issues/969 pull request: https://github.com/OpenEnergyPlatform/ontology/pull/1334 move axiom to shared-axioms issue: https://github.com/OpenEnergyPlatform/ontology/issues/1703 pull request: https://github.com/OpenEnergyPlatform/ontology/pull/1706 move to oeo-sector issue: https://github.com/OpenEnergyPlatform/ontology/issues/1399 pull request: https://github.com/OpenEnergyPlatform/ontology/pull/1724

chemical energy storage function
type: Class
subclass of: energy storage function
definition: A chemical energy storage function is an energy storage function with chemical energy as input and output.
term tracker annotation: issue: https://github.com/OpenEnergyPlatform/ontology/issues/1262 pull request: https://github.com/OpenEnergyPlatform/ontology/pull/1348

electrical energy storage function
type: Class
subclass of: energy storage function
definition: An electrical energy storage function is an energy storage function with electrical energy as input and output.
term tracker annotation: issue: https://github.com/OpenEnergyPlatform/ontology/issues/1262 pull request: https://github.com/OpenEnergyPlatform/ontology/pull/1348

kinetic energy storage function
type: Class
subclass of: energy storage function
definition: A kinetic energy storage function is an energy storage function with kinetic energy as input and output.
term tracker annotation: issue: https://github.com/OpenEnergyPlatform/ontology/issues/1262 pull request: https://github.com/OpenEnergyPlatform/ontology/pull/1348

potential energy storage function
type: Class
subclass of: energy storage function
definition: A potential energy storage function is an energy storage function with potential energy as input and output.
editor note: This function was introduce for the sake of completeness, but there is no actual use case seen at the moment.
term tracker annotation: issue: https://github.com/OpenEnergyPlatform/ontology/issues/1262 pull request: https://github.com/OpenEnergyPlatform/ontology/pull/1348 add editor note issue: https://github.com/OpenEnergyPlatform/ontology/issues/1572 pull request: https://github.com/OpenEnergyPlatform/ontology/pull/1728

underground fuel storage object
type: Class
subclass of: energy storage object
subclass of: Restriction
  on property: has function
  some values from: chemical energy storage function
definition: An underground fuel storage object is an energy storage object that stores chemical energy in form of fuels underground.
term tracker annotation: issue: https://github.com/OpenEnergyPlatform/ontology/issues/1262 pull request: https://github.com/OpenEnergyPlatform/ontology/pull/1348

refinery gas
type: Class
subclass of: gas mixture
subclass of: Restriction
  on property: has part
  some values from: Class
    intersection of: methane
    intersection of: hydrogen
subclass of: Restriction
  on property: has role
  some values from: fuel role
subclass of: Restriction
  on property: has disposition
  some values from: combustible energy carrier disposition
subclass of: Restriction
  on property: has origin
  some values from: fossil
subclass of: Restriction
  on property: physical output of
  some values from: mineral oil refining process
subclass of: Restriction
  on property: has normal state of matter
  has value: OEO_00000182
definition: Refinery gas is a gas mixture that is produced as a by-product of a mineral oil refining process. It mainly consists of hydrogen, methane, ethane and olefins and can be used as a fuel.
alternative label: Raffineriegas @de
term tracker annotation: issue: https://github.com/OpenEnergyPlatform/ontology/issues/1332 pull request: https://github.com/OpenEnergyPlatform/ontology/pull/1351

petroleum coke
type: Class
subclass of: portion of matter
subclass of: Restriction
  on property: has role
  some values from: fuel role
subclass of: Restriction
  on property: has disposition
  some values from: combustible energy carrier disposition
subclass of: Restriction
  on property: has origin
  some values from: fossil
subclass of: Restriction
  on property: physical output of
  some values from: mineral oil refining process
subclass of: Restriction
  on property: has normal state of matter
  has value: OEO_00000390
definition: Petroleum coke is a portion of matter with a solid state of matter that is produced in a mineral oil refining process. It consists mainly of carbon and can be uses as a fuel.
alternative label: Petrolkoks @de
alternative label: coke
alternative label: pet coke
term tracker annotation: issue: https://github.com/OpenEnergyPlatform/ontology/issues/1332 pull request: https://github.com/OpenEnergyPlatform/ontology/pull/1351

OEP user
type: Class
subclass of: user
definition: An OEP user is a user who interacts with the Open Energy Platform.
term tracker annotation: issue: https://github.com/OpenEnergyPlatform/ontology/issues/1339 pull request: https://github.com/OpenEnergyPlatform/ontology/pull/1383

qualitist
type: Class
subclass of: OEP user
definition: A qualitist is an OEP user who mainly interacts with qualitative information.
term tracker annotation: issue: https://github.com/OpenEnergyPlatform/ontology/issues/1339 pull request: https://github.com/OpenEnergyPlatform/ontology/pull/1383

quantitist
type: Class
subclass of: OEP user
definition: A quantitist is an OEP user who mainly interacts with quantitative information.
term tracker annotation: issue: https://github.com/OpenEnergyPlatform/ontology/issues/1339 pull request: https://github.com/OpenEnergyPlatform/ontology/pull/1383

apinist
type: Class
subclass of: OEP user
definition: An apinist is an OEP user who mainly interacts via an API.
term tracker annotation: issue: https://github.com/OpenEnergyPlatform/ontology/issues/1339 pull request: https://github.com/OpenEnergyPlatform/ontology/pull/1383

sustainability criterion
type: Class
subclass of: plan specification
definition: A sustainability criterion is a plan specification that intends to meet the needs of the present without compromising the ability of future generations to meet their own environmental, economic and social needs.
alternative label: Nachhaltigkeitskriterium @de
term tracker annotation: issue: https://github.com/OpenEnergyPlatform/ontology/issues/872 pull request: https://github.com/OpenEnergyPlatform/ontology/pull/1385

material sustainability
type: Class
subclass of: disposition
subclass of: Restriction
  on property: characteristic of
  some values from: material entity
subclass of: Restriction
  on property: is subject of
  some values from: sustainability criterion
definition: Material sustainability is a disposition is a material entity that conforms to some sustainability criteria.
term tracker annotation: issue: https://github.com/OpenEnergyPlatform/ontology/issues/872 pull request: https://github.com/OpenEnergyPlatform/ontology/pull/1385 replaced 'has bearer' with 'characteristic of' issue: https://github.com/OpenEnergyPlatform/ontology/issues/1907 pull request: https://github.com/OpenEnergyPlatform/ontology/pull/1928

process sustainability
type: Class
subclass of: process attribute
subclass of: Restriction
  on property: is subject of
  some values from: sustainability criterion
definition: Process sustainability is a process attribute that conforms to some sustainability criteria.
term tracker annotation: issue: https://github.com/OpenEnergyPlatform/ontology/issues/872 pull request: https://github.com/OpenEnergyPlatform/ontology/pull/1385

sustainable process
type: Class
equivalent class: Class
  intersection of: process
  intersection of: Restriction
    on property: has process attribute
    some values from: process sustainability
subclass of: process
definition: A sustainable process is a process that has a process sustainability attribute.
alternative label: nachhaltiger Prozess @de
term tracker annotation: issue: https://github.com/OpenEnergyPlatform/ontology/issues/872 pull request: https://github.com/OpenEnergyPlatform/ontology/pull/1385

sustainable biofuel
type: Class
equivalent class: Class
  intersection of: biofuel
  intersection of: Restriction
    on property: has disposition
    some values from: material sustainability
subclass of: biofuel
subclass of: Restriction
  on property: has disposition
  some values from: renewable energy carrier disposition
disjoint with: non-sustainable biofuel
definition: A sustainable biofuel is a biofuel that does conform to sustainability criteria.
term tracker annotation: issue: https://github.com/OpenEnergyPlatform/ontology/issues/872 pull request: https://github.com/OpenEnergyPlatform/ontology/pull/1409

non-sustainable biofuel
type: Class
equivalent class: Class
  intersection of: biofuel
  intersection of: Class
    complement of: Restriction
      on property: has disposition
      some values from: material sustainability
subclass of: biofuel
subclass of: Restriction
  on property: has disposition
  some values from: conventional energy carrier disposition
definition: A non-sustainable biofuel is a biofuel that does not conform to sustainability criteria.
term tracker annotation: issue: https://github.com/OpenEnergyPlatform/ontology/issues/872 pull request: https://github.com/OpenEnergyPlatform/ontology/pull/1409

source category
type: Class
equivalent class: Class
  intersection of: sector
  intersection of: Restriction
    on property: is defined by
    some values from: common reporting format
subclass of: sector
definition: A source category is a sector that is defined by a common reporting format.
alternative label: CRF sector
alternative label: Quellgruppe @de
term tracker annotation: issue: https://github.com/OpenEnergyPlatform/ontology/issues/1426 pull request: https://github.com/OpenEnergyPlatform/ontology/pull/1428 move to oeo-sector issue: https://github.com/OpenEnergyPlatform/ontology/issues/1399 pull request: https://github.com/OpenEnergyPlatform/ontology/pull/1724

renewable power unit
type: Class
equivalent class: Class
  intersection of: power generating unit
  intersection of: Restriction
    on property: has function
    some values from: renewable energy transformation function
subclass of: power generating unit
subclass of: Restriction
  on property: has energy input
  some values from: renewable energy
definition: A renewable power unit is a power generating unit that has the function to transform renewable energy.
term tracker annotation: issue: https://github.com/OpenEnergyPlatform/ontology/issues/1423 pull request: https://github.com/OpenEnergyPlatform/ontology/pull/1437 rework module structure issue: https://github.com/OpenEnergyPlatform/ontology/issues/1592 pull request: https://github.com/OpenEnergyPlatform/ontology/pull/1652

renewable power plant
type: Class
equivalent class: Class
  intersection of: power plant
  intersection of: Restriction
    on property: has part
    some values from: renewable power unit
subclass of: power plant
definition: A renewable power plant is a power plant that has renewable power units as parts.
alternative label: Erneuerbare-Energien-Kraftwerk @de
term tracker annotation: issue: https://github.com/OpenEnergyPlatform/ontology/issues/1423 pull request: https://github.com/OpenEnergyPlatform/ontology/pull/1437 rework module structure issue: https://github.com/OpenEnergyPlatform/ontology/issues/1592 pull request: https://github.com/OpenEnergyPlatform/ontology/pull/1652

electrolytic hydrogen
type: Class
equivalent class: Class
  intersection of: hydrogen
  intersection of: Restriction
    on property: physical output of
    some values from: water electrolysis process
subclass of: hydrogen
subclass of: Restriction
  on property: has origin
  some values from: synthetic
definition: Electrolytic hydrogen is hydrogen that is a physical output of a water electrolysis process.
alternative label: Elektrolysewasserstoff @de
term tracker annotation: issue: https://github.com/OpenEnergyPlatform/ontology/issues/1013 pull request: https://github.com/OpenEnergyPlatform/ontology/pull/1442

renewable electrolytic hydrogen
type: Class
equivalent class: Class
  intersection of: electrolytic hydrogen
  intersection of: Restriction
    on property: physical output of
    some values from: Class
      intersection of: water electrolysis process
      intersection of: Restriction
        on property: has energy input
        some values from: renewable electrical energy
subclass of: electrolytic hydrogen
subclass of: Class
  intersection of: electrolytic hydrogen
  intersection of: Restriction
    on property: has characteristic
    some values from: renewable energy carrier disposition
definition: Renewable electrolytic hydrogen is electrolytic hydrogen that is produced with renewable electrical energy.
alternative label: erneuerbarer Elektrolysewasserstoff @de
alternative label: green hydrogen
term tracker annotation: issue: https://github.com/OpenEnergyPlatform/ontology/issues/1013 pull request: https://github.com/OpenEnergyPlatform/ontology/pull/1442

steam reforming hydrogen
type: Class
equivalent class: Class
  intersection of: hydrogen
  intersection of: Restriction
    on property: physical output of
    some values from: steam reforming
subclass of: hydrogen
subclass of: Restriction
  on property: has origin
  some values from: synthetic
definition: Steam reforming hydrogen is hydrogen that is a physical output of a steam reforming process.
term tracker annotation: issue: https://github.com/OpenEnergyPlatform/ontology/issues/1013 pull request: https://github.com/OpenEnergyPlatform/ontology/pull/1442

fossil steam reforming hydrogen
type: Class
equivalent class: Class
  intersection of: hydrogen
  intersection of: Restriction
    on property: physical output of
    some values from: Class
      intersection of: steam reforming
      intersection of: Class
        complement of: Restriction
      intersection of: Restriction
        on property: has physical input
        some values from: fossil combustion fuel
subclass of: hydrogen
subclass of: Restriction
  on property: has characteristic
  some values from: conventional energy carrier disposition
subclass of: Restriction
  on property: has origin
  some values from: fossil
subclass of: Restriction
  on property: has origin
  some values from: synthetic
definition: Fossil steam reforming hydrogen is hydrogen that is produced from a fossil combustion fuel in a steam reforming process which is not followed by a carbon capture and storage process.
alternative label: grey hydrogen
term tracker annotation: issue: https://github.com/OpenEnergyPlatform/ontology/issues/1013 pull request: https://github.com/OpenEnergyPlatform/ontology/pull/1442

abated steam reforming hydrogen
type: Class
equivalent class: Class
  intersection of: hydrogen
  intersection of: Restriction
    on property: physical output of
    some values from: Class
      intersection of: steam reforming
      intersection of: Restriction
        on property: causally upstream of or within
        some values from: carbon capture and storage
      intersection of: Restriction
        on property: has physical input
        some values from: fossil combustion fuel
subclass of: hydrogen
subclass of: Restriction
  on property: has characteristic
  some values from: conventional energy carrier disposition
subclass of: Restriction
  on property: has origin
  some values from: fossil
subclass of: Restriction
  on property: has origin
  some values from: synthetic
definition: Abated steam reforming hydrogen is hydrogen that is output of a steam reforming process which is followed by a carbon capture and storage process.
alternative label: CCS steam reforming hydrogen
alternative label: blue hydrogen
term tracker annotation: issue: https://github.com/OpenEnergyPlatform/ontology/issues/1013 pull request: https://github.com/OpenEnergyPlatform/ontology/pull/1442

renewable electrical energy
type: Class
equivalent class: Class
  intersection of: electrical energy
  intersection of: Restriction
    on property: has origin
    some values from: renewable
subclass of: electrical energy
definition: Renewable electrical energy is electrical energy with a renewable origin.
alternative label: erneuerbare elektrische Energie @de
term tracker annotation: issue: https://github.com/OpenEnergyPlatform/ontology/issues/1013 pull request: https://github.com/OpenEnergyPlatform/ontology/pull/1442

energy transformation function
type: Class
subclass of: function
subclass of: Restriction
  on property: realized in
  some values from: energy transformation
subclass of: Restriction
  on property: characteristic of
  some values from: artificial object
definition: An energy transformation function is the function of an artificial object that has been engineered to transform input energy into usable output energy of a different type.
term tracker annotation: issue: https://github.com/OpenEnergyPlatform/ontology/issues/1438 pull request: https://github.com/OpenEnergyPlatform/ontology/pull/1445 Move to oeo-shared: pull request: https://github.com/OpenEnergyPlatform/ontology/pull/1437 rework module structure issue: https://github.com/OpenEnergyPlatform/ontology/issues/1592 pull request: https://github.com/OpenEnergyPlatform/ontology/pull/1652 Add 'realized in' axiom: issue: https://github.com/OpenEnergyPlatform/ontology/issues/1539 pull request: https://github.com/OpenEnergyPlatform/ontology/pull/1785 replaced 'has bearer' with 'characteristic of' issue: https://github.com/OpenEnergyPlatform/ontology/issues/1907 pull request: https://github.com/OpenEnergyPlatform/ontology/pull/1928

electricity generation function
type: Class
subclass of: energy transformation function
subclass of: Restriction
  on property: realized in
  some values from: OEO_00240014
definition: An electricity generation function is an energy transformation function to transform other types of energy to electrical energy.
alternative label: electrical energy generation function
term tracker annotation: issue: https://github.com/OpenEnergyPlatform/ontology/issues/1438 pull request: https://github.com/OpenEnergyPlatform/ontology/pull/1445 Move to oeo-shared: https://github.com/OpenEnergyPlatform/ontology/pull/1360 rework module structure issue: https://github.com/OpenEnergyPlatform/ontology/issues/1592 pull request: https://github.com/OpenEnergyPlatform/ontology/pull/1652 Add 'realized in' axiom: issue: https://github.com/OpenEnergyPlatform/ontology/issues/1539 pull request: https://github.com/OpenEnergyPlatform/ontology/pull/1785

heat generation function
type: Class
subclass of: energy transformation function
subclass of: Restriction
  on property: realized in
  some values from: heat gain process
definition: A heat generation function is an energy transformation function to transform other types of energy to thermal energy.
alternative label: thermal energy transformation function
term tracker annotation: issue: https://github.com/OpenEnergyPlatform/ontology/issues/1438 pull request: https://github.com/OpenEnergyPlatform/ontology/pull/1445 Add 'realized in' axiom: issue: https://github.com/OpenEnergyPlatform/ontology/issues/1539 pull request: https://github.com/OpenEnergyPlatform/ontology/pull/1785

renewable energy transformation function
type: Class
subclass of: energy transformation function
subclass of: Restriction
  on property: realized in
  some values from: Class
    intersection of: energy transformation
    intersection of: Restriction
      on property: has participant
      some values from: renewable energy
definition: A renewable energy function is the energy transformation function to transform renewable energy.
term tracker annotation: issue: https://github.com/OpenEnergyPlatform/ontology/issues/1438 pull request: https://github.com/OpenEnergyPlatform/ontology/pull/1445 Move to oeo-shared: pull request: https://github.com/OpenEnergyPlatform/ontology/pull/1437 rework module structure issue: https://github.com/OpenEnergyPlatform/ontology/issues/1592 pull request: https://github.com/OpenEnergyPlatform/ontology/pull/1652 Add 'realized in' axiom: issue: https://github.com/OpenEnergyPlatform/ontology/issues/1539 pull request: https://github.com/OpenEnergyPlatform/ontology/pull/1785

direct solar radiation
type: Class
subclass of: solar radiation
disjoint with: diffuse solar radiation
definition: Direct solar radiation is radiation that is the non-scattered part of solar radiation from the sun within the extent of the solar disk only.
term tracker annotation: issue: https://github.com/OpenEnergyPlatform/ontology/issues/1076 pull request: https://github.com/OpenEnergyPlatform/ontology/pull/1448

diffuse solar radiation
type: Class
subclass of: solar radiation
definition: Diffuse solar radiation is radiation that is the part of solar radiation that has been scattered by gas molecules in the atmosphere and by particles such as cloud droplets and aerosols.
alternative label: diffuse Solarstrahlung @de
term tracker annotation: issue: https://github.com/OpenEnergyPlatform/ontology/issues/1076 pull request: https://github.com/OpenEnergyPlatform/ontology/pull/1448

non-scattered radiant flux density
type: Class
equivalent class: Restriction
  on property: quantity value of
  some values from: direct solar radiation
subclass of: areal solar power density
definition: A non-scattered radiant flux density is an areal solar power density that measures the direct solar radiation within the extent of the solar disk only (half-angle 0.266 deg).
term tracker annotation: issue: https://github.com/OpenEnergyPlatform/ontology/issues/1076 pull request: https://github.com/OpenEnergyPlatform/ontology/pull/1448

solar tracking
type: Class
subclass of: process
definition: Solar tracking is a process in which a radiation receiving surface is following the path of the sun on the sky.
alternative label: Sonnennachführung @de
term tracker annotation: issue: https://github.com/OpenEnergyPlatform/ontology/issues/1076 pull request: https://github.com/OpenEnergyPlatform/ontology/pull/1448

single axis tracking
type: Class
subclass of: solar tracking
definition: Single axis tracking is solar tracking in which a radiation receiving surface is following the path of the sun by roting along a fixed axis. Typical axis orientations are North-South or East-West.
alternative label: Einachs-Nachführung @de
term tracker annotation: issue: https://github.com/OpenEnergyPlatform/ontology/issues/1076 pull request: https://github.com/OpenEnergyPlatform/ontology/pull/1448

two axis tracking
type: Class
subclass of: solar tracking
definition: Two axis tracking is solar tracking in which a radiation receiving surface is following the sun by rotating around two axes. The surface is always oriented normal.
alternative label: Zweiachs-Nachführung @de
term tracker annotation: issue: https://github.com/OpenEnergyPlatform/ontology/issues/1076 pull request: https://github.com/OpenEnergyPlatform/ontology/pull/1448

solar tracked receiving surface
type: Class
equivalent class: Class
  intersection of: solar radiation receiving surface
  intersection of: Restriction
    on property: participates in
    some values from: solar tracking
subclass of: solar radiation receiving surface
definition: A solar tracked receiving surface is a solar radiation receiving surface that participates in solar tracking.
term tracker annotation: issue: https://github.com/OpenEnergyPlatform/ontology/issues/1076 pull request: https://github.com/OpenEnergyPlatform/ontology/pull/1448

single axis tracked receiving surface
type: Class
equivalent class: Class
  intersection of: solar radiation receiving surface
  intersection of: Restriction
    on property: participates in
    some values from: single axis tracking
subclass of: solar radiation receiving surface
definition: A single axis tracked receiving surface is a solar radiation receiving surface that participates in single axis tracking.
term tracker annotation: issue: https://github.com/OpenEnergyPlatform/ontology/issues/1076 pull request: https://github.com/OpenEnergyPlatform/ontology/pull/1448

two axis tracked receiving surface
type: Class
equivalent class: Class
  intersection of: solar radiation receiving surface
  intersection of: Restriction
    on property: participates in
    some values from: two axis tracking
subclass of: solar radiation receiving surface
definition: A two axis tracked receiving surface is a solar radiation receiving surface that participates in two axis tracking.
term tracker annotation: issue: https://github.com/OpenEnergyPlatform/ontology/issues/1076 pull request: https://github.com/OpenEnergyPlatform/ontology/pull/1448

power-only generating unit
type: Class
equivalent class: Class
  intersection of: power generating unit
  intersection of: Restriction
    on property: has function
    some values from: electricity generation function
  intersection of: Restriction
    on property: has function
    all values from: Class
      union of: electricity generation function
      union of: Class
        complement of: energy transformation function
subclass of: power generating unit
definition: A power-only generating unit is a power generating unit that has only the function to produce electrical energy.
term tracker annotation: issue: https://github.com/OpenEnergyPlatform/ontology/issues/1439 pull request: https://github.com/OpenEnergyPlatform/ontology/pull/1456

CRF-based sector division
type: Class
equivalent class: Class
  intersection of: sector division
  intersection of: Restriction
    on property: uses
    some values from: common reporting format
subclass of: sector division
definition: A CRF-based sector division is a sector division that is derived from a common reporting format.
term tracker annotation: issue: https://github.com/OpenEnergyPlatform/ontology/issues/1449 pull request: https://github.com/OpenEnergyPlatform/ontology/pull/1462 move to oeo-sector issue: https://github.com/OpenEnergyPlatform/ontology/issues/1399 pull request: https://github.com/OpenEnergyPlatform/ontology/pull/1724

EU legislation sector division
type: Class
subclass of: sector division
definition: An EU legislation sector division is a sector division that is used in EU legislation.
term tracker annotation: issue: https://github.com/OpenEnergyPlatform/ontology/issues/1449 pull request: https://github.com/OpenEnergyPlatform/ontology/pull/1462 move to oeo-sector issue: https://github.com/OpenEnergyPlatform/ontology/issues/1399 pull request: https://github.com/OpenEnergyPlatform/ontology/pull/1724

energy balance data set
type: Class
subclass of: empirical data set
subclass of: Restriction
  on property: is about
  some values from: energy carrier
subclass of: Restriction
  on property: is about
  qualified cardinality: 1
  on class: spatial region
subclass of: Restriction
  on property: is about
  qualified cardinality: 1
  on class: time step
definition: An energy balance data set is an empirical data set that describes a specified set of energy transformations and a specified set of energy carriers in a spatial region for a specific time step (usually a year).
alternative label: Energiebilanzdatensatz @de
term tracker annotation: issue: https://github.com/OpenEnergyPlatform/ontology/issues/1400 pull request: https://github.com/OpenEnergyPlatform/ontology/pull/1463 rework module structure issue: https://github.com/OpenEnergyPlatform/ontology/issues/1592 pull request: https://github.com/OpenEnergyPlatform/ontology/pull/1652 change label issue: https://github.com/OpenEnergyPlatform/ontology/issues/1549 pull request: https://github.com/OpenEnergyPlatform/ontology/pull/1717

energy balance collection
type: Class
subclass of: data set
subclass of: Restriction
  on property: has part
  some values from: energy balance data set
subclass of: Restriction
  on property: is about
  some values from: spatial region
subclass of: Restriction
  on property: is about
  some values from: time step
definition: An energy balance collection is a data set of energy balances for various time steps and/or temporal regions.
term tracker annotation: issue: https://github.com/OpenEnergyPlatform/ontology/issues/1400 pull request: https://github.com/OpenEnergyPlatform/ontology/pull/1463

energy balance calculation method
type: Class
subclass of: methodology
subclass of: Restriction
  on property: has part
  some values from: primary energy consumption calculation method
subclass of: Restriction
  on property: is about
  some values from: energy balance data set
definition: An energy balance calculation method is a methodology to calculate an energy balance.
term tracker annotation: issue: https://github.com/OpenEnergyPlatform/ontology/issues/1400 pull request: https://github.com/OpenEnergyPlatform/ontology/pull/1463 rework module structure issue: https://github.com/OpenEnergyPlatform/ontology/issues/1592 pull request: https://github.com/OpenEnergyPlatform/ontology/pull/1652

energy balance sector division
type: Class
subclass of: sector division
subclass of: Restriction
  on property: is defined by
  some values from: energy balance calculation method
definition: An energy balance sector division is a sector division that is defined by an energy balance calculation method.
term tracker annotation: issue: https://github.com/OpenEnergyPlatform/ontology/issues/1400 pull request: https://github.com/OpenEnergyPlatform/ontology/pull/1463 rework module structure issue: https://github.com/OpenEnergyPlatform/ontology/issues/1592 pull request: https://github.com/OpenEnergyPlatform/ontology/pull/1652 move to oeo-sector issue: https://github.com/OpenEnergyPlatform/ontology/issues/1399 pull request: https://github.com/OpenEnergyPlatform/ontology/pull/1724

Brent crude
type: Class
subclass of: crude oil
subclass of: Restriction
  on property: is traded at
  some values from: fuel market exchange
definition: Brent crude is a crude oil that is extracted in the North Sea and traded at ICE London.
term tracker annotation: issue: https://github.com/OpenEnergyPlatform/ontology/issues/1458 pull request: https://github.com/OpenEnergyPlatform/ontology/pull/1478

Western Texas Intermediate
type: Class
subclass of: crude oil
subclass of: Restriction
  on property: is traded at
  some values from: fuel market exchange
definition: Western Texas Intermediate (WTI) is a crude oil that is extracted on US territory and traded at NYMEX New York.
alternative label: WTI
term tracker annotation: issue: https://github.com/OpenEnergyPlatform/ontology/issues/1458 pull request: https://github.com/OpenEnergyPlatform/ontology/pull/1478

energy transfer function
type: Class
subclass of: function
subclass of: Restriction
  on property: realized in
  some values from: energy transfer
subclass of: Restriction
  on property: characteristic of
  some values from: grid component link
definition: An energy transfer function is a function of a grid component link that has been engineered to transfer energy over a spatial distance.
term tracker annotation: issue: https://github.com/OpenEnergyPlatform/ontology/issues/1454 pull request: https://github.com/OpenEnergyPlatform/ontology/pull/1515 Add 'realized in' axiom: issue: https://github.com/OpenEnergyPlatform/ontology/issues/1539 pull request: https://github.com/OpenEnergyPlatform/ontology/pull/1785 replaced 'has bearer' with 'characteristic of' issue: https://github.com/OpenEnergyPlatform/ontology/issues/1907 pull request: https://github.com/OpenEnergyPlatform/ontology/pull/1928 Changed class to represent a function of 'grid component link's issue: https://github.com/OpenEnergyPlatform/ontology/issues/2044 pull request: https://github.com/OpenEnergyPlatform/ontology/pull/2073

forecast
type: Class
subclass of: information content entity
definition: A forecast is an information content entity that contains statements about the most probable future development predicted with the help of past and present data.
term tracker annotation: issue: https://github.com/OpenEnergyPlatform/ontology/issues/1501 pull request: https://github.com/OpenEnergyPlatform/ontology/pull/1544

creative work licence
type: Class
subclass of: copyright licence
definition: A creative work licence is a copyright license that determines ownership and permissions for literary work and multimedia work that combines various media types such as text, audio, images, animations, video and interactive content and its collections.
alternative label: creative work license
term tracker annotation: issue: https://github.com/OpenEnergyPlatform/ontology/issues/1275 pull request: https://github.com/OpenEnergyPlatform/ontology/pull/1547 rework module structure issue: https://github.com/OpenEnergyPlatform/ontology/issues/1592 pull request: https://github.com/OpenEnergyPlatform/ontology/pull/1652

subsurface collector
type: Class
subclass of: heat exchanger
definition: A subsurface collector is a heat exchanger that transfers ambient thermal energy to a working fluid. It consists of plastic pipes laid horizontally under the ground.
term tracker annotation: issue: https://github.com/OpenEnergyPlatform/ontology/issues/1361 pull request: https://github.com/OpenEnergyPlatform/ontology/pull/1557

downhole heat exchanger
type: Class
subclass of: heat exchanger
definition: A downhole heat exchanger is a heat exchanger that transfers ambient thermal energy or geothermal energy to a working fluid. It consists of plastic pipes installed vertically or inclined in a borehole.
term tracker annotation: issue: https://github.com/OpenEnergyPlatform/ontology/issues/1361 pull request: https://github.com/OpenEnergyPlatform/ontology/pull/1557

nuclear
type: Class
subclass of: conventional
definition: Nuclear is a conventional origin that indicates that the energy comes originally from nuclear binding energy.
term tracker annotation: issue: https://github.com/OpenEnergyPlatform/ontology/issues/1491 pull request: https://github.com/OpenEnergyPlatform/ontology/pull/1559

nuclear electric hydrogen
type: Class
equivalent class: Class
  intersection of: electrolytic hydrogen
  intersection of: Restriction
    on property: physical output of
    some values from: Class
      intersection of: water electrolysis process
      intersection of: Restriction
        on property: has energy input
        some values from: nuclear electrical energy
subclass of: electrolytic hydrogen
definition: Nuclear electrolytic hydrogen is electrolytic hydrogen that is produced with nuclear electrical energy.
alternative label: pink hydrogen
term tracker annotation: issue: https://github.com/OpenEnergyPlatform/ontology/issues/1490 pull request: https://github.com/OpenEnergyPlatform/ontology/pull/1559

nuclear electrical energy
type: Class
equivalent class: Class
  intersection of: electrical energy
  intersection of: Restriction
    on property: has origin
    some values from: nuclear
subclass of: electrical energy
definition: Nuclear electrical energy is electrical energy with a nuclear origin.
term tracker annotation: issue: https://github.com/OpenEnergyPlatform/ontology/issues/1490 pull request: https://github.com/OpenEnergyPlatform/ontology/pull/1559

solar electrolytic hydrogen
type: Class
equivalent class: Class
  intersection of: electrolytic hydrogen
  intersection of: Restriction
    on property: physical output of
    some values from: Class
      intersection of: water electrolysis process
      intersection of: Restriction
        on property: has energy input
        some values from: solar electrical energy
subclass of: electrolytic hydrogen
definition: Solar electrolytic hydrogen is electrolytic hydrogen that is produced with solar electrical energy.
alternative label: yellow hydrogen
term tracker annotation: issue: https://github.com/OpenEnergyPlatform/ontology/issues/1490 pull request: https://github.com/OpenEnergyPlatform/ontology/pull/1559

solar electrical energy
type: Class
equivalent class: Class
  intersection of: electrical energy
  intersection of: Restriction
    on property: is energy output of
    some values from: solar energy transformation
subclass of: electrical energy
subclass of: Restriction
  on property: has origin
  some values from: renewable
definition: Solar electrical energy is electrical energy that is energy output of a solar energy transformation.
term tracker annotation: issue: https://github.com/OpenEnergyPlatform/ontology/issues/1490 pull request: https://github.com/OpenEnergyPlatform/ontology/pull/1559

fuel production
type: Class
equivalent class: Class
  intersection of: OEO_00240003
  intersection of: Restriction
    on property: has physical output
    some values from: fuel
subclass of: OEO_00240003
definition: Fuel production is a production process which has fuel as physical output.
term tracker annotation: issue: https://github.com/OpenEnergyPlatform/ontology/issues/1526 pull request: https://github.com/OpenEnergyPlatform/ontology/pull/1575

boolean value
type: Class
subclass of: information content entity
definition: A boolean value is an variable information content entity that can only be true or false.
alternative label: truth value
term tracker annotation: issue: https://github.com/OpenEnergyPlatform/ontology/issues/1148 pull request: https://github.com/OpenEnergyPlatform/ontology/pull/1255

power generation technology
type: Class
subclass of: energy technology
subclass of: Restriction
  on property: is about
  some values from: Class
    intersection of: power generating unit
    intersection of: Restriction
      on property: participates in
      some values from: OEO_00240014
definition: A power generation technology is an energy technology that describes how to combine power generating units and energy carriers in a power generation process to generate electrical energy.
term tracker annotation: issue: https://github.com/OpenEnergyPlatform/ontology/issues/1572 pull request: https://github.com/OpenEnergyPlatform/ontology/pull/1601

wind power technology
type: Class
subclass of: power generation technology
subclass of: Class
  intersection of: Restriction
    on property: is about
    some values from: wind energy converting unit
  intersection of: Restriction
    on property: participates in
    some values from: wind energy transformation
definition: A wind power technology is a power generation technology that describes how to combine wind energy converting units and a wind energy transformation.
term tracker annotation: issue: https://github.com/OpenEnergyPlatform/ontology/issues/1572 pull request: https://github.com/OpenEnergyPlatform/ontology/pull/1601

onshore wind power technology
type: Class
subclass of: wind power technology
subclass of: Class
  intersection of: Restriction
    on property: is about
    some values from: Class
      intersection of: wind energy converting unit
      intersection of: Restriction
        on property: part of
        some values from: onshore wind farm
  intersection of: Restriction
    on property: participates in
    some values from: wind energy transformation
definition: An onshore wind power technology is a wind power generation technology that describes how to use wind energy converting units in onshore wind farms.
term tracker annotation: issue: https://github.com/OpenEnergyPlatform/ontology/issues/1572 pull request: https://github.com/OpenEnergyPlatform/ontology/pull/1601

offshore wind power technology
type: Class
subclass of: wind power technology
subclass of: Class
  intersection of: Restriction
    on property: is about
    some values from: Class
      intersection of: wind energy converting unit
      intersection of: Restriction
        on property: part of
        some values from: offshore wind farm
  intersection of: Restriction
    on property: participates in
    some values from: wind energy transformation
definition: An offshore wind power technology is a wind power generation technology that describes how to use wind energy converting units in offshore wind farms.
term tracker annotation: issue: https://github.com/OpenEnergyPlatform/ontology/issues/1572 pull request: https://github.com/OpenEnergyPlatform/ontology/pull/1601

solar power technology
type: Class
subclass of: power generation technology
subclass of: Class
  intersection of: Restriction
    on property: is about
    some values from: solar power unit
  intersection of: Restriction
    on property: participates in
    some values from: Class
      intersection of: energy transformation
      intersection of: Restriction
        on property: has energy input
        some values from: solar energy
definition: A solar power technology is a power generation technology that describes how to combine solar power units in an electricity generation process with solar energy as input.
term tracker annotation: issue: https://github.com/OpenEnergyPlatform/ontology/issues/1572 pull request: https://github.com/OpenEnergyPlatform/ontology/pull/1601

photovoltaic technology
type: Class
subclass of: solar power technology
subclass of: Class
  intersection of: Restriction
    on property: is about
    some values from: PV panel
  intersection of: Restriction
    on property: participates in
    some values from: Class
      intersection of: energy transformation
      intersection of: Restriction
        on property: has energy input
        some values from: solar energy
definition: A photovoltaic technology is a power generation technology that describes how to combine photovoltaic panels in an electricity generation process with solar energy as input.
term tracker annotation: issue: https://github.com/OpenEnergyPlatform/ontology/issues/1572 pull request: https://github.com/OpenEnergyPlatform/ontology/pull/1601

solar thermal power technology
type: Class
subclass of: solar power technology
subclass of: Class
  intersection of: Restriction
    on property: is about
    some values from: solar thermal power unit
  intersection of: Restriction
    on property: participates in
    some values from: Class
      intersection of: energy transformation
      intersection of: Restriction
        on property: has energy input
        some values from: solar energy
definition: A solar thermal power technology is a power generation technology that describes how to combine solar thermal power units in an electricity generation process with solar energy as input.
term tracker annotation: issue: https://github.com/OpenEnergyPlatform/ontology/issues/1572 pull request: https://github.com/OpenEnergyPlatform/ontology/pull/1601

geothermal power technology
type: Class
subclass of: power generation technology
subclass of: Class
  intersection of: Restriction
    on property: is about
    some values from: geothermal power unit
  intersection of: Restriction
    on property: participates in
    some values from: Class
      intersection of: OEO_00240014
      intersection of: Restriction
        on property: has energy input
        some values from: geothermal energy
definition: A geothermal power technology is a power generation technology that describes how to combine geothermal power units in an electricity generation process with geothermal energy as input.
term tracker annotation: issue: https://github.com/OpenEnergyPlatform/ontology/issues/1572 pull request: https://github.com/OpenEnergyPlatform/ontology/pull/1601

hydro power technology
type: Class
subclass of: power generation technology
subclass of: Restriction
  on property: is about
  some values from: Class
    intersection of: hydro power unit
    intersection of: Restriction
      on property: participates in
      some values from: hydroelectric energy transformation
definition: A hydro power technology is a power generation technology that describes how to combine hydro power units and a hydroelectric energy transformation.
term tracker annotation: issue: https://github.com/OpenEnergyPlatform/ontology/issues/1572 pull request: https://github.com/OpenEnergyPlatform/ontology/pull/1601

run of river power technology
type: Class
subclass of: hydro power technology
subclass of: Class
  intersection of: Restriction
    on property: is about
    some values from: Class
      intersection of: hydro power unit
      intersection of: Restriction
        on property: part of
        some values from: run of river power plant
  intersection of: Restriction
    on property: participates in
    some values from: hydroelectric energy transformation
definition: A reservoir hydro storage power technology is a power generation technology that describes how to combine hydro power units in run of river power plant and a hydroelectric energy transformation.
term tracker annotation: issue: https://github.com/OpenEnergyPlatform/ontology/issues/1572 pull request: https://github.com/OpenEnergyPlatform/ontology/pull/1601

reservoir hydro storage power technology
type: Class
subclass of: hydro power technology
subclass of: Class
  intersection of: Restriction
    on property: is about
    some values from: Class
      intersection of: hydro power unit
      intersection of: Restriction
        on property: part of
        some values from: reservoir hydro storage power plant
  intersection of: Restriction
    on property: participates in
    some values from: hydroelectric energy transformation
definition: A reservoir hydro storage power technology is a power generation technology that describes how to combine hydro power units in reservoir hydro storage power plants and a hydroelectric energy transformation.
term tracker annotation: issue: https://github.com/OpenEnergyPlatform/ontology/issues/1572 pull request: https://github.com/OpenEnergyPlatform/ontology/pull/1601

marine hydro power technology
type: Class
subclass of: hydro power technology
subclass of: Restriction
  on property: is about
  some values from: Class
    intersection of: hydro power unit
    intersection of: Restriction
      on property: participates in
      some values from: Class
        intersection of: hydroelectric energy transformation
        intersection of: Restriction
definition: A marine hydro power technology is a hydro power technology that describes how to combine hydro power units, a hydroelectric energy transformation and oceans.
term tracker annotation: issue: https://github.com/OpenEnergyPlatform/ontology/issues/1572 pull request: https://github.com/OpenEnergyPlatform/ontology/pull/1601

marine current energy technology
type: Class
subclass of: marine hydro power technology
subclass of: Class
  intersection of: Restriction
    on property: is about
    some values from: marine current energy converting unit
  intersection of: Restriction
    on property: participates in
    some values from: marine current energy transformation
definition: A marine current energy technology is a marine hydro power technology that describes how to combine marine current energy converting units in marine current energy transformations.
term tracker annotation: issue: https://github.com/OpenEnergyPlatform/ontology/issues/1572 pull request: https://github.com/OpenEnergyPlatform/ontology/pull/1601

marine tidal energy technology
type: Class
subclass of: marine hydro power technology
subclass of: Class
  intersection of: Restriction
    on property: is about
    some values from: marine tidal energy converting unit
  intersection of: Restriction
    on property: participates in
    some values from: marine tidal energy transformation
definition: A marine tidal energy technology is a marine hydro power technology that describes how to combine marine tidal energy converting units in marine tidal energy transformations.
term tracker annotation: issue: https://github.com/OpenEnergyPlatform/ontology/issues/1572 pull request: https://github.com/OpenEnergyPlatform/ontology/pull/1601

marine wave energy technology
type: Class
subclass of: marine hydro power technology
subclass of: Class
  intersection of: Restriction
    on property: is about
    some values from: marine tidal energy converting unit
  intersection of: Restriction
    on property: participates in
    some values from: marine tidal energy transformation
definition: A marine wave energy technology is a marine hydro power technology that describes how to combine marine wave energy converting units in marine wave energy transformations.
term tracker annotation: issue: https://github.com/OpenEnergyPlatform/ontology/issues/1572 pull request: https://github.com/OpenEnergyPlatform/ontology/pull/1601

pumped hydro storage power technology
type: Class
subclass of: hydro power technology
subclass of: Class
  intersection of: Restriction
    on property: is about
    some values from: Class
      intersection of: hydro power unit
      intersection of: Restriction
        on property: part of
        some values from: pumped hydro storage power plant
  intersection of: Restriction
    on property: participates in
    some values from: hydroelectric energy transformation
definition: A pumped hydro storage power technology is a power generation technology that describes how to combine hydro power units in pumped hydro storage power plants and a hydroelectric energy transformation.
term tracker annotation: issue: https://github.com/OpenEnergyPlatform/ontology/issues/1572 pull request: https://github.com/OpenEnergyPlatform/ontology/pull/1601

nuclear power technology
type: Class
subclass of: power generation technology
subclass of: Class
  intersection of: Restriction
    on property: is about
    some values from: nuclear power unit
  intersection of: Restriction
    on property: participates in
    some values from: Class
      intersection of: OEO_00240014
      intersection of: Restriction
        on property: has physical input
        some values from: nuclear fuel
definition: A nuclear power generation technology is a power generation technology that describes how to combine nuclear power units and nuclear fuel in an electricity generation process.
term tracker annotation: issue: https://github.com/OpenEnergyPlatform/ontology/issues/1572 pull request: https://github.com/OpenEnergyPlatform/ontology/pull/1601

fuel power technology
type: Class
subclass of: power generation technology
subclass of: Class
  intersection of: Restriction
    on property: is about
    some values from: fueled power unit
  intersection of: Restriction
    on property: participates in
    some values from: fuel-powered electricity generation process
definition: A fuel-powered generation technology is a power technology that describes how to combine fuel-powered units in a fuel-powered electricity generation process.
term tracker annotation: issue: https://github.com/OpenEnergyPlatform/ontology/issues/1572 pull request: https://github.com/OpenEnergyPlatform/ontology/pull/1601

coal power technology
type: Class
subclass of: fuel power technology
subclass of: Class
  intersection of: Restriction
    on property: is about
    some values from: coal power unit
  intersection of: Restriction
    on property: participates in
    some values from: Class
      intersection of: fuel-powered electricity generation process
      intersection of: Restriction
        on property: has physical input
        some values from: coal
definition: A coal power technology is a fuel-powered technology that describes how to combine coal power units and coal in a fuel-powered electricity generation process.
term tracker annotation: issue: https://github.com/OpenEnergyPlatform/ontology/issues/1572 pull request: https://github.com/OpenEnergyPlatform/ontology/pull/1601

hard coal power technology
type: Class
subclass of: coal power technology
subclass of: Class
  intersection of: Restriction
    on property: is about
    some values from: hard coal power unit
  intersection of: Restriction
    on property: participates in
    some values from: Class
      intersection of: fuel-powered electricity generation process
      intersection of: Restriction
        on property: has physical input
        some values from: hard coal
definition: A hard coal power technology is a coal power technology that describes how to combine hard coal power units and hard coal in a fuel-powered electricity generation process.
term tracker annotation: issue: https://github.com/OpenEnergyPlatform/ontology/issues/1572 pull request: https://github.com/OpenEnergyPlatform/ontology/pull/1601

lignite power technology
type: Class
subclass of: coal power technology
subclass of: Class
  intersection of: Restriction
    on property: is about
    some values from: lignite power unit
  intersection of: Restriction
    on property: participates in
    some values from: Class
      intersection of: fuel-powered electricity generation process
      intersection of: Restriction
        on property: has physical input
        some values from: lignite
definition: A lignite power technology is a coal power technology that describes how to combine hard coal power units and lignite in a fuel-powered electricity generation process.
term tracker annotation: issue: https://github.com/OpenEnergyPlatform/ontology/issues/1572 pull request: https://github.com/OpenEnergyPlatform/ontology/pull/1601

sufficiency
type: Class
subclass of: plan specification
subclass of: Restriction
  on property: is about
  some values from: Class
    union of: consumption
    union of: OEO_00240003
definition: Sufficiency is a plan specification for reducing, in absolute terms, the consumption and production of end-use products and services through changes in social practices in order to comply with environmental sustainability while ensuring an adequate social foundation for all people.
definition source: Definition and elucidation based on: Jonas Lage, Johannes Thema, Carina Zell-Ziegler, Benjamin Best, Luisa Cordroch, and Frauke Wiese (2023): Citizens call for sufficiency and regulation — A comparison of European citizen assemblies and National Energy and Climate Plans. In: Energy Research & Social Science, Vol. 104, https://doi.org/10.1016/j.erss.2023.103254
elucidation: This definition consists of three characteristics that are present in most definitions of sufficiency: 1) sufficiency is understood as a strategy for achieving mainly (but not solely) environmental goals of sustainability, 2) sufficiency pursues sustainability goals by absolute reductions in consumption and production and 3) sufficiency implies a focus on social innovation to change social practices and individual behaviour.
oekg annotation: study descriptor
term tracker annotation: issue: https://github.com/OpenEnergyPlatform/ontology/issues/1553 pull request: https://github.com/OpenEnergyPlatform/ontology/pull/1648 add oekg annotation issue: https://github.com/OpenEnergyPlatform/ontology/issues/1529 pull request: https://github.com/OpenEnergyPlatform/ontology/pull/1897

blended liquid fuel
type: Class
equivalent class: Class
  intersection of: liquid combustion fuel
  intersection of: Restriction
    on property: has part
    some values from: liquid fossil fuel
  intersection of: Restriction
    on property: has part
    some values from: Class
      union of: liquid biofuel
      union of: liquid renewable fuel
subclass of: liquid combustion fuel
definition: A blended liquid fuel is a liquid combustion fuel that contains a liquid fossil fuel and a liquid renewable fuel or a liquid biofuel.
term tracker annotation: issue: https://github.com/OpenEnergyPlatform/ontology/issues/1504 pull request: https://github.com/OpenEnergyPlatform/ontology/pull/1723

bioethanol
type: Class
equivalent class: Class
  intersection of: ethanol
  intersection of: Restriction
    on property: has origin
    some values from: biogenic
subclass of: ethanol
definition: Bioethanol is ethanol with a biogenic origin.
term tracker annotation: issue: https://github.com/OpenEnergyPlatform/ontology/issues/1504 pull request: https://github.com/OpenEnergyPlatform/ontology/pull/1723

E10
type: Class
subclass of: gasoline fuel
subclass of: Class
  intersection of: Restriction
    on property: has part
    some values from: gasoline
  intersection of: Restriction
    on property: has part
    some values from: bioethanol
subclass of: Restriction
  on property: has normal state of matter
  has value: OEO_00000256
definition: E10 is a gasoline fuel that consists of (fossil) gasoline and up to 10 % ethanol and that is liquid.
term tracker annotation: issue: https://github.com/OpenEnergyPlatform/ontology/issues/1504 pull request: https://github.com/OpenEnergyPlatform/ontology/pull/1723 Make liquid fuel: issue: https://github.com/OpenEnergyPlatform/ontology/issues/1764 pull request: https://github.com/OpenEnergyPlatform/ontology/pull/1774

B7
type: Class
subclass of: diesel fuel
subclass of: Class
  intersection of: Restriction
    on property: has part
    some values from: biodiesel
  intersection of: Restriction
    on property: has part
    some values from: gasoline
subclass of: Restriction
  on property: has normal state of matter
  has value: OEO_00000256
definition: B7 is a diesel fuel that consists of fossil diesel fuel and up to 7 % biodiesel and that is liquid.
term tracker annotation: issue: https://github.com/OpenEnergyPlatform/ontology/issues/1504 pull request: https://github.com/OpenEnergyPlatform/ontology/pull/1723 Make liquid fuel: issue: https://github.com/OpenEnergyPlatform/ontology/issues/1764 pull request: https://github.com/OpenEnergyPlatform/ontology/pull/1774

mobility technology
type: Class
subclass of: technology
subclass of: Restriction
  on property: is about
  some values from: Class
    intersection of: vehicle
    intersection of: Restriction
      on property: participates in
      some values from: transport
definition: A mobility technology is a technology that describes how vehicles participate in transport
term tracker annotation: issue: https://github.com/OpenEnergyPlatform/ontology/issues/1572 pull request: https://github.com/OpenEnergyPlatform/ontology/pull/1727

electric mobility technology
type: Class
subclass of: mobility technology
subclass of: Restriction
  on property: is about
  some values from: Class
    intersection of: electric vehicle
    intersection of: Restriction
      on property: participates in
      some values from: transport
definition: An electric mobility is a technology that describes how electric vehicles participate in transport.
term tracker annotation: issue: https://github.com/OpenEnergyPlatform/ontology/issues/1572 pull request: https://github.com/OpenEnergyPlatform/ontology/pull/1727

fuel blending quota
type: Class
subclass of: quality
definition: A fuel blending quota is a quality of a blended fuel that indicates the share of liquid renewable fuel or liquid biofuel mixed into fossil fuel.
term tracker annotation: issue: https://github.com/OpenEnergyPlatform/ontology/issues/1413 pull request: https://github.com/OpenEnergyPlatform/ontology/pull/1763

fuel quota blending value
type: Class
subclass of: fraction value
subclass of: Restriction
  on property: is about
  some values from: fuel blending quota
definition: A fuel blending quota value is a fraction value that quantifies a fuel blending quota.
definition: issue: https://github.com/OpenEnergyPlatform/ontology/issues/1413 pull request: https://github.com/OpenEnergyPlatform/ontology/pull/1763

temperature
type: Class
subclass of: quality
subclass of: Restriction
  on property: characteristic of
  some values from: material entity
definition: Temperature is a quality representing the driving force for the flow of heat energy and is a measure of the heat content of a material entity.
term tracker annotation: issue: https://github.com/OpenEnergyPlatform/ontology/issues/1505 pull request: https://github.com/OpenEnergyPlatform/ontology/pull/1767 replaced 'has bearer' with 'characteristic of' issue: https://github.com/OpenEnergyPlatform/ontology/issues/1907 pull request: https://github.com/OpenEnergyPlatform/ontology/pull/1928

pressure
type: Class
subclass of: quality
subclass of: Restriction
  on property: characteristic of
  some values from: material entity
definition: A pressure is a quality representing the force per unit area that its bearer exerts on itself or on a surface that bounds its bearer.
term tracker annotation: issue: https://github.com/OpenEnergyPlatform/ontology/issues/1505 pull request: https://github.com/OpenEnergyPlatform/ontology/pull/1767 replaced 'has bearer' with 'characteristic of' issue: https://github.com/OpenEnergyPlatform/ontology/issues/1907 pull request: https://github.com/OpenEnergyPlatform/ontology/pull/1928

carbon capture and storage technology
type: Class
subclass of: technology
subclass of: Restriction
  on property: is about
  some values from: Class
    intersection of: artificial object
    intersection of: Restriction
      on property: participates in
      some values from: carbon capture and storage
definition: A carbon capture and storage technology is a technology that describes how to combine artificial objects and a carbon capture and storage process in a specific way to permanently store CO2.
alternative label: CCS technology
term tracker annotation: issue: https://github.com/OpenEnergyPlatform/ontology/issues/1760 pull request: https://github.com/OpenEnergyPlatform/ontology/pull/1768

economic instrument
type: Class
equivalent class: Class
  intersection of: policy instrument
  intersection of: Restriction
    on property: has characteristic
    some values from: economic instrument function
subclass of: policy instrument
definition: An economic instrument is a policy instrument that creates monetary (price) incentives to stimulate transformative measures.
elucidation: Examples: subsidies for installation of renewable energy technologies, tradable permits
term tracker annotation: issue: https://github.com/OpenEnergyPlatform/ontology/issues/1545 pull request: https://github.com/OpenEnergyPlatform/ontology/pull/1786 Convert to equivalent class: issue: https://github.com/OpenEnergyPlatform/ontology/issues/1826 pull request: https://github.com/OpenEnergyPlatform/ontology/pull/1906

voluntary agreement
type: Class
subclass of: contract
elucidation: A voluntary agreement is a contract between a government (institution) and one or more private institutions. The agreement's goal is to ensure transformative measures by the participating private institutions.
term tracker annotation: issue: https://github.com/OpenEnergyPlatform/ontology/issues/1545 pull request: https://github.com/OpenEnergyPlatform/ontology/pull/1786

regulatory instrument
type: Class
equivalent class: Class
  intersection of: policy instrument
  intersection of: Restriction
    on property: has characteristic
    some values from: regulatory instrument function
subclass of: policy instrument
definition: A regulatory instrument is a policy instrument that stipulates rules made by a government (=institution) to control the way something is done.
term tracker annotation: issue: https://github.com/OpenEnergyPlatform/ontology/issues/1545 pull request: https://github.com/OpenEnergyPlatform/ontology/pull/1786 Convert to equivalent class: issue: https://github.com/OpenEnergyPlatform/ontology/issues/1826 pull request: https://github.com/OpenEnergyPlatform/ontology/pull/1906

information instrument
type: Class
equivalent class: Class
  intersection of: policy instrument
  intersection of: Restriction
    on property: has characteristic
    some values from: information instrument function
subclass of: policy instrument
definition: An information instrument is a policy instrument that aims at providing knowledge to persons and/or institutions to stimulate transformative measures.
term tracker annotation: issue: https://github.com/OpenEnergyPlatform/ontology/issues/1545 pull request: https://github.com/OpenEnergyPlatform/ontology/pull/1786 Convert to equivalent class: issue: https://github.com/OpenEnergyPlatform/ontology/issues/1826 pull request: https://github.com/OpenEnergyPlatform/ontology/pull/1906

education instrument
type: Class
equivalent class: Class
  intersection of: policy instrument
  intersection of: Restriction
    on property: has characteristic
    some values from: education instrument function
subclass of: policy instrument
definition: An education instrument is a policy instrument that aims at teaching the necessary understanding and skills to specific groups of people so that these are enabled to perform specific transformative measures.
term tracker annotation: issue: https://github.com/OpenEnergyPlatform/ontology/issues/1545 pull request: https://github.com/OpenEnergyPlatform/ontology/pull/1786 Convert to equivalent class: issue: https://github.com/OpenEnergyPlatform/ontology/issues/1826 pull request: https://github.com/OpenEnergyPlatform/ontology/pull/1906

voluntary agreement instrument
type: Class
equivalent class: Class
  intersection of: policy instrument
  intersection of: Restriction
    on property: has characteristic
    some values from: voluntary agreement instrument function
subclass of: policy instrument
subclass of: Restriction
  on property: is about
  some values from: voluntary agreement
definition: A voluntary agreement instrument is a policy instrument that uses voluntary instruments between a government (institution) and one or more private institutions. The agreement's goal is to ensure transformative measures by the participating private institutions.
term tracker annotation: issue: https://github.com/OpenEnergyPlatform/ontology/issues/1545 pull request: https://github.com/OpenEnergyPlatform/ontology/pull/1786 Convert to equivalent class: issue: https://github.com/OpenEnergyPlatform/ontology/issues/1826 pull request: https://github.com/OpenEnergyPlatform/ontology/pull/1906

subsector
type: Class
equivalent class: Class
  intersection of: sector
  intersection of: Restriction
    on property: subsector of
    some values from: sector
subclass of: sector
definition: A subsector is a sector that is a part of an other sector.
term tracker annotation: issue: https://github.com/OpenEnergyPlatform/ontology/issues/1333 pull request: https://github.com/OpenEnergyPlatform/ontology/pull/1788

missing value reason
type: Class
subclass of: data item
definition: A missing value reason is a data item that is used to indicate that data is not available and to provide a specific reason explaining why a meaningful value is not available.
alternative label: absent data
alternative label: missing data
definition source: Definition partly adapted from http://purl.obolibrary.org/obo/NCIT_C48655
term tracker annotation: issue: https://github.com/OpenEnergyPlatform/ontology/issues/1765 pull request: https://github.com/OpenEnergyPlatform/ontology/pull/1795

notation key
type: Class
subclass of: missing value reason
definition: A notation key is a missing value reason defined by the UNFCCC to indicate why data is missing.
term tracker annotation: issue: https://github.com/OpenEnergyPlatform/ontology/issues/1765 pull request: https://github.com/OpenEnergyPlatform/ontology/pull/1795

forecasting model calculation
type: Class
subclass of: model calculation
subclass of: Restriction
  on property: has information output
  some values from: forecast
definition: A forecasting model calculation is a model calculation that produces a forecast.
alternative label: forecasting
term tracker annotation: issue: https://github.com/OpenEnergyPlatform/ontology/issues/1691 pull request: https://github.com/OpenEnergyPlatform/ontology/pull/1799

non-energy use technology
type: Class
equivalent class: Class
  intersection of: technology
  intersection of: Restriction
    on property: is about
    some values from: Restriction
      on property: participates in
      some values from: non-energy use
subclass of: technology
definition: A non-energy use technology is a technology that describes among other things how to combine the consumption of energy carriers for non-energy use with other processes and artificial objects or other material entities in a specific way.
alternative label: non-energy consumption technology
term tracker annotation: issue: https://github.com/OpenEnergyPlatform/ontology/issues/1773 pull request: https://github.com/OpenEnergyPlatform/ontology/pull/1803

compressor
type: Class
subclass of: pump
subclass of: Restriction
  on property: uses
  some values from: Class
    intersection of: fluid
    intersection of: Restriction
      on property: has state of matter
      has value: OEO_00000182
definition: A compressor is a pump that converts energy into kinetic or potential energy of a gaseous fluid.
term tracker annotation: issue: https://github.com/OpenEnergyPlatform/ontology/issues/1813 pull request: https://github.com/OpenEnergyPlatform/ontology/pull/1818

compressor station
type: Class
subclass of: energy transformation unit
subclass of: Restriction
  on property: part of
  some values from: gas grid
subclass of: Restriction
  on property: part of
  some values from: OEO_00320016
subclass of: Restriction
  on property: has part
  some values from: compressor
definition: A compressor station is an energy transformation unit that has a compressor to enable gas transport via a gas grid.
term tracker annotation: issue: https://github.com/OpenEnergyPlatform/ontology/issues/1813 pull request: https://github.com/OpenEnergyPlatform/ontology/pull/1818

gas turbine compressor station
type: Class
subclass of: compressor station
subclass of: Restriction
  on property: has part
  some values from: gas turbine
subclass of: Restriction
  on property: uses
  some values from: gaseous combustion fuel
definition: A gas turbine compressor station is a compressor station that has a gas turbine for driving the compressor.
term tracker annotation: issue: https://github.com/OpenEnergyPlatform/ontology/issues/1813 pull request: https://github.com/OpenEnergyPlatform/ontology/pull/1818

electric compressor station
type: Class
subclass of: compressor station
subclass of: Restriction
  on property: has part
  some values from: electric motor
subclass of: Restriction
  on property: uses
  some values from: electrical energy
definition: An electric compressor station is a compressor station that has en elecrtric motor for driving the compressor.
term tracker annotation: issue: https://github.com/OpenEnergyPlatform/ontology/issues/1813 pull request: https://github.com/OpenEnergyPlatform/ontology/pull/1818

methanol
type: Class
subclass of: hydrocarbon
subclass of: Restriction
  on property: has role
  some values from: fuel role
subclass of: Restriction
  on property: has disposition
  some values from: combustible energy carrier disposition
subclass of: Restriction
  on property: has normal state of matter
  has value: OEO_00000256
definition: Methanol is a hydrocarbon with the chemical formula CH3OH. It has a liquid normal state of matter. As it can be oxidised it can be used as a fuel.
alternative label: CH3OH
alternative label: CH4O
may be identical to: http://purl.obolibrary.org/obo/CHEBI_17790
term tracker annotation: issue: https://github.com/OpenEnergyPlatform/ontology/issues/1825 pull request: https://github.com/OpenEnergyPlatform/ontology/pull/1827

manufacturing technology
type: Class
subclass of: technology
subclass of: Restriction
  on property: is about
  some values from: Class
    intersection of: manufacturing plant
    intersection of: Restriction
      on property: participates in
      some values from: Class
        intersection of: manufacturing process
        intersection of: Restriction
definition: A manufacturing technology is a technology that describes how to combine manufactuing plants and manufacturing processes to produce manufactured materials.
alternative label: industrial technology
term tracker annotation: issue: https://github.com/OpenEnergyPlatform/ontology/issues/1726 pull request: https://github.com/OpenEnergyPlatform/ontology/pull/1840

manufacturing plant
type: Class
subclass of: artificial object
subclass of: Restriction
  on property: participates in
  some values from: manufacturing process
definition: A manufacturing plant is an artificial object that applies one or more manufacturing processes to produce one more kinds of manufactured materials.
alternative label: industrial plant
term tracker annotation: issue: https://github.com/OpenEnergyPlatform/ontology/issues/1726 pull request: https://github.com/OpenEnergyPlatform/ontology/pull/1840

unit
type: Class
subclass of: generically dependent continuant
definition: A unit of measurement is a generically dependent continuant that represents a standardised quantity value of a quantifiable entity
editor note: The OEO developers have different views on the correct classification of a (physical) unit. On one hand, a (physical) unit is often referred to be "a standardized quantity", e.g. in the UO, and thus is interpreted as a quantity itself. On the other hand, a (physical) unit can be seen as a generically dependent reference measure that is not bound to a specific bearer. Together with the numerical value it can describe a quantity value. In the OEO, we have opted for the latter view and therefore implemented (physical) unit as generically dependent continuants.
alternative label: Einheit @de
alternative label: Maßeinheit @de
alternative label: unit of measurement
term tracker annotation: issue: https://github.com/OpenEnergyPlatform/ontology/issues/1871 pull request: https://github.com/OpenEnergyPlatform/ontology/pull/1892

physical unit
type: Class
subclass of: unit
definition: A physical unit is a unit that represents a standardised quantity value of a physical quantifiable entity.
editor note: The OEO developers have different views on the correct classification of a (physical) unit. On one hand, a (physical) unit is often referred to be "a standardized quantity", e.g. in the UO, and thus is interpreted as a quantity itself. On the other hand, a (physical) unit can be seen as a generically dependent reference measure that is not bound to a specific bearer. Together with the numerical value it can describe a quantity value. In the OEO, we have opted for the latter view and therefore implemented (physical) unit as generically dependent continuants.
alternative label: physikalische Einheit
term tracker annotation: issue: https://github.com/OpenEnergyPlatform/ontology/issues/1871 pull request: https://github.com/OpenEnergyPlatform/ontology/pull/1892 remove equivalence axiom to uo:unit issue: https://github.com/OpenEnergyPlatform/ontology/issues/2135 pull request: https://github.com/OpenEnergyPlatform/ontology/pull/2141

manufactured commodity
type: Class
equivalent class: Class
  intersection of: portion of matter
  intersection of: Restriction
    on property: has role
    some values from: commodity role
  intersection of: Restriction
    on property: physical output of
    some values from: manufacturing process
subclass of: portion of matter
definition: A manufactured commodity is a portion of matter that is the physical output of a manufacturing process and that has a commodity role.
alternative label: industrial commodity
term tracker annotation: Split 'industrial material' into 'manufactured material' and 'manufactured commodity': issue: https://github.com/OpenEnergyPlatform/ontology/issues/1726 pull request: https://github.com/OpenEnergyPlatform/ontology/pull/1840

economic instrument function
type: Class
subclass of: function
subclass of: Restriction
  on property: characteristic of
  some values from: policy instrument
definition: An economic instrument function is a function of a policy instrument that promotes, amongst others, economic measures.
term tracker annotation: issue: https://github.com/OpenEnergyPlatform/ontology/issues/1826 pull request: https://github.com/OpenEnergyPlatform/ontology/pull/1906

education instrument function
type: Class
subclass of: function
subclass of: Restriction
  on property: characteristic of
  some values from: policy instrument
definition: An education instrument function is a function of a policy instrument that promotes, amongst others, education measures.
term tracker annotation: issue: https://github.com/OpenEnergyPlatform/ontology/issues/1826 pull request: https://github.com/OpenEnergyPlatform/ontology/pull/1906

information instrument function
type: Class
subclass of: function
subclass of: Restriction
  on property: characteristic of
  some values from: policy instrument
definition: An information instrument function is a function of a policy instrument that promotes, amongst others, information measures.
term tracker annotation: issue: https://github.com/OpenEnergyPlatform/ontology/issues/1826 pull request: https://github.com/OpenEnergyPlatform/ontology/pull/1906

regulatory instrument function
type: Class
subclass of: function
subclass of: Restriction
  on property: characteristic of
  some values from: policy instrument
definition: An regulatory instrument function is a function of a policy instrument that promotes, amongst others, regulatory measures.
term tracker annotation: issue: https://github.com/OpenEnergyPlatform/ontology/issues/1826 pull request: https://github.com/OpenEnergyPlatform/ontology/pull/1906

voluntary agreement instrument function
type: Class
subclass of: function
subclass of: Restriction
  on property: characteristic of
  some values from: policy instrument
definition: An voluntary agreement instrument function is a function of a policy instrument that promotes, amongst others, voluntary agreement measures.
term tracker annotation: issue: https://github.com/OpenEnergyPlatform/ontology/issues/1826 pull request: https://github.com/OpenEnergyPlatform/ontology/pull/1906

licensee
type: Class
subclass of: agent
definition: A licensee is an agent that is permitted by a licence provider to participate in some process.
alternative label: Lizenznehmer @de
term tracker annotation: issue: https://github.com/OpenEnergyPlatform/ontology/issues/1873 pull request: https://github.com/OpenEnergyPlatform/ontology/pull/1925

licence provider
type: Class
subclass of: agent
definition: A licence provider is an agent that provides a licence that allows a licensee to do something specific.
alternative label: Lizenzgeber @de
term tracker annotation: issue: https://github.com/OpenEnergyPlatform/ontology/issues/1873 pull request: https://github.com/OpenEnergyPlatform/ontology/pull/1925

product
type: Class
equivalent class: Class
  union of: good
  union of: OEO_00360019
subclass of: continuant
definition: A product is a continuant that is either a good or a service product.
alternative label: Produkt @de
term tracker annotation: issue: https://github.com/OpenEnergyPlatform/ontology/issues/1239 issue: https://github.com/OpenEnergyPlatform/ontology/issues/1514 pull request: https://github.com/OpenEnergyPlatform/ontology/pull/1912

ethanol
type: Class
subclass of: portion of matter
subclass of: Restriction
  on property: part of
  some values from: biogasoline
subclass of: Restriction
  on property: has role
  some values from: fuel role
subclass of: Restriction
  on property: has disposition
  some values from: combustible energy carrier disposition
subclass of: Restriction
  on property: has normal state of matter
  has value: OEO_00000256
definition: Ethanol is a portion of matter with the chemical formula C2H6O. It has a liquid normal state of matter and can be used as a combustion fuel.
alternative label: C2H6O
alternative label: Ethanol @de
may be identical to: http://purl.obolibrary.org/obo/CHEBI_16236
term tracker annotation: class: issue: https://github.com/OpenEnergyPlatform/ontology/issues/439 pull request: https://github.com/OpenEnergyPlatform/ontology/pull/445 axioms: issue: https://github.com/OpenEnergyPlatform/ontology/issues/703 pull request: https://github.com/OpenEnergyPlatform/ontology/pull/704

Axiom
annotated source: ethanol
annotated property: alternative label
annotated target: C2H6O
term tracker annotation: issue: https://github.com/OpenEnergyPlatform/ontology/issues/636 pull request: https://github.com/OpenEnergyPlatform/ontology/pull/810

Axiom
annotated source: ethanol
annotated property: may be identical to
annotated target: http://purl.obolibrary.org/obo/CHEBI_16236
term tracker annotation: issue: https://github.com/OpenEnergyPlatform/ontology/issues/636 pull request: https://github.com/OpenEnergyPlatform/ontology/pull/810

energy transformation
type: Class
subclass of: transformation
subclass of: Class
  intersection of: Restriction
    on property: has occurrent part
    some values from: Class
      intersection of: MENO_01013
      intersection of: Restriction
        on property: negatively regulates characteristic
        some values from: energy
  intersection of: Restriction
    on property: has occurrent part
    some values from: Class
      intersection of: MENO_01014
      intersection of: Restriction
        on property: positively regulates characteristic
        some values from: energy
subclass of: Restriction
subclass of: Restriction
  on property: has participant
  some values from: energy carrier
subclass of: Restriction
  on property: has participant
  some values from: energy transformation unit
subclass of: Restriction
  on property: has process attribute
  some values from: power
subclass of: Restriction
  on property: has process attribute
  some values from: energy conversion efficiency
definition: Energy transformation is a transformation in which one or more certain types of energy as input result in certain types of energy as output.
alternative label: Energieumwandlung @de
term tracker annotation: class added: issue: https://github.com/OpenEnergyPlatform/ontology/issues/77 pull request: https://github.com/OpenEnergyPlatform/ontology/pull/371 make class a subclass of transformation: issue: https://github.com/OpenEnergyPlatform/ontology/issues/435 pull request: https://github.com/OpenEnergyPlatform/ontology/pull/450 add input and output relations: issue: https://github.com/OpenEnergyPlatform/ontology/issues/680 pull request: https://github.com/OpenEnergyPlatform/ontology/pull/690 pull request: https://github.com/OpenEnergyPlatform/ontology/pull/702 add relation to energy transformation unit: pull request: https://github.com/OpenEnergyPlatform/ontology/pull/895 change 'has physical input / output' axioms to 'has energy input / output': https://github.com/OpenEnergyPlatform/ontology/issues/994 https://github.com/OpenEnergyPlatform/ontology/pull/1041 add axiom relating to energy carrier / input and output axioms: issue: https://github.com/OpenEnergyPlatform/ontology/issues/1167 pull request: https://github.com/OpenEnergyPlatform/ontology/pull/1178 update definition: issue: https://github.com/OpenEnergyPlatform/ontology/issues/1175 pull request: https://github.com/OpenEnergyPlatform/ontology/pull/1182 make equivalent class: issue: https://github.com/OpenEnergyPlatform/ontology/issues/1211 pull request: https://github.com/OpenEnergyPlatform/ontology/pull/1251 move to oeo-shared: issue: https://github.com/OpenEnergyPlatform/ontology/issues/1384 pull request: https://github.com/OpenEnergyPlatform/ontology/pull/1390 added process attributes: issue: https://github.com/OpenEnergyPlatform/ontology/issues/1543 pull request: https://github.com/OpenEnergyPlatform/ontology/pull/1625 rework module structure issue: https://github.com/OpenEnergyPlatform/ontology/issues/1592 pull request: https://github.com/OpenEnergyPlatform/ontology/pull/1652 replace energy-participant axioms issue: https://github.com/OpenEnergyPlatform/ontology/issues/2053 pull request: https://github.com/Open…

Axiom
annotated source: energy transformation
annotated property: subClassOf
annotated target: Restriction
term tracker annotation: issue: https://github.com/OpenEnergyPlatform/ontology/issues/980 pull request: https://github.com/OpenEnergyPlatform/ontology/pull/1010

gas grid
type: Class
subclass of: supply grid
subclass of: Restriction
  on property: has part
  some values from: gas grid component
definition: A gas grid is a supply grid that distributes gaseous fuel, e.g. methane.
alternative label: Gasnetz @de
oekg annotation: study descriptor
term tracker annotation: issue: https://github.com/OpenEnergyPlatform/ontology/issues/36 pull request: https://github.com/OpenEnergyPlatform/ontology/385 add oekg annotation issue: https://github.com/OpenEnergyPlatform/ontology/issues/1529 pull request: https://github.com/OpenEnergyPlatform/ontology/pull/1897

heating grid
type: Class
subclass of: supply grid
subclass of: Restriction
  on property: has part
  some values from: heating grid component
definition: A heating grid is a supply grid that distributes thermal energy via circulating steam or liquids.
alternative label: Wärmenetz @de
oekg annotation: study descriptor
term tracker annotation: issue: https://github.com/OpenEnergyPlatform/ontology/issues/36 pull request: https://github.com/OpenEnergyPlatform/ontology/385 add oekg annotation issue: https://github.com/OpenEnergyPlatform/ontology/issues/1529 pull request: https://github.com/OpenEnergyPlatform/ontology/pull/1897

grid component
type: Class
equivalent class: Class
  intersection of: energy transformation unit
  intersection of: Restriction
    on property: has role
    some values from: OEO_00410067
subclass of: energy transformation unit
subclass of: Restriction
  on property: part of
  some values from: supply grid
definition: A grid component is an energy transformation unit that is a discrete part of a supply grid serving a specific purpose. A grid component is defined by having a grid component role.
alternative label: Netzkomponente @de
term tracker annotation: issue: https://github.com/OpenEnergyPlatform/ontology/issues/36 pull request: https://github.com/OpenEnergyPlatform/ontology/pull/385 subclass of energy transformation unit pull request: https://github.com/OpenEnergyPlatform/ontology/pull/895 rework module structure issue: https://github.com/OpenEnergyPlatform/ontology/issues/1592 pull request: https://github.com/OpenEnergyPlatform/ontology/pull/1652 dependence to 'grid component role' issue: https://github.com/OpenEnergyPlatform/ontology/issues/1960 pull request: https://github.com/OpenEnergyPlatform/ontology/pull/2054

gas grid component
type: Class
equivalent class: Class
  intersection of: grid component
  intersection of: Restriction
    on property: part of
    some values from: gas grid
subclass of: grid component
definition: A gas grid component is a grid component that is part of a gas grid.
alternative label: Gasnetzkomponente @de
term tracker annotation: issue: https://github.com/OpenEnergyPlatform/ontology/issues/36 issue: https://github.com/OpenEnergyPlatform/ontology/issues/231 pull request: https://github.com/OpenEnergyPlatform/ontology/pull/385

heating grid component
type: Class
equivalent class: Class
  intersection of: grid component
  intersection of: Restriction
    on property: part of
    some values from: heating grid
subclass of: grid component
definition: A heating grid component is a grid component that is part of a heating grid.
alternative label: Wärmenetzkomponente @de
term tracker annotation: issue: https://github.com/OpenEnergyPlatform/ontology/issues/36 issue: https://github.com/OpenEnergyPlatform/ontology/issues/231 pull request: https://github.com/OpenEnergyPlatform/ontology/pull/385

switchyard
type: Class
subclass of: grid component
subclass of: Restriction
  on property: part of
  some values from: electricity grid
subclass of: Restriction
  on property: has part
  some values from: transformer
definition: A switchyard is an electricity grid component that connects different levels of voltage
alternative label: Schaltanlage @de
term tracker annotation: issue: https://github.com/OpenEnergyPlatform/ontology/issues/231 pull request: https://github.com/OpenEnergyPlatform/ontology/pull/385

study
type: Class
subclass of: project
subclass of: Restriction
  on property: has participant
  some values from: data set
subclass of: Restriction
  on property: has participant
  some values from: methodology
subclass of: Restriction
  on property: has output
  some values from: study report
subclass of: Restriction
  on property: covers
  some values from: analysis scope
definition: A study is a project with the goal to methodologically investigate something.
editor note: The construct 'has funding source' some ('has role' some funder) is necessary, because has funding source has the range has role some funder. This range comes from issue https://github.com/OpenEnergyPlatform/ontology/issues/850 : funding source is some kind of independent continuant, i.e. a organisation or person, that does something special (giving money). So it is anything that has role some funder.
alternative label: Studie @de
term tracker annotation: issue: https://github.com/OpenEnergyPlatform/ontology/issues/247 pull request: https://github.com/OpenEnergyPlatform/ontology/pull/497 add covers-relation (oeo-model) pull request: https://github.com/OpenEnergyPlatform/ontology/pull/764 move to oeo-shared issue: https://github.com/OpenEnergyPlatform/ontology/issues/862 pull request: https://github.com/OpenEnergyPlatform/ontology/pull/869 add axiom (study report) issue: https://github.com/OpenEnergyPlatform/ontology/issues/971 pull request: https://github.com/OpenEnergyPlatform/ontology/pull/1011 add etitor note pull request: https://github.com/OpenEnergyPlatform/ontology/pull/1025 add axiom (methodologically) issue: https://github.com/OpenEnergyPlatform/ontology/issues/1640 pull request: https://github.com/OpenEnergyPlatform/ontology/pull/1711

Axiom
annotated source: study
annotated property: subClassOf
annotated target: Restriction
term tracker annotation: issue: https://github.com/OpenEnergyPlatform/ontology/issues/473 pull request: https://github.com/OpenEnergyPlatform/ontology/pull/557

study report
type: Class
subclass of: report
subclass of: Restriction
  on property: is about
  some values from: data set
subclass of: Restriction
  on property: output of
  some values from: study
definition: A study report is a report that is the output from some study.
term tracker annotation: issue: https://github.com/OpenEnergyPlatform/ontology/issues/247 pull request: https://github.com/OpenEnergyPlatform/ontology/pull/497 add etitor note pull request: https://github.com/OpenEnergyPlatform/ontology/pull/1025

Axiom
annotated source: study report
annotated property: subClassOf
annotated target: Restriction
term tracker annotation: issue: https://github.com/OpenEnergyPlatform/ontology/issues/473 pull request: https://github.com/OpenEnergyPlatform/ontology/pull/557 issue: https://github.com/OpenEnergyPlatform/ontology/issues/850 pull request: https://github.com/OpenEnergyPlatform/ontology/pull/871

output data
type: Class
subclass of: endogenous data
subclass of: Restriction
  on property: has role
  some values from: OEO_00400022
definition: Output data is endogenous data that is determined by a model calculation and presented as a result.
alternative label: modelling results
term tracker annotation: issue: https://github.com/OpenEnergyPlatform/ontology/issues/520 pull request: https://github.com/OpenEnergyPlatform/ontology/pull/536 add alternative term pull request: https://github.com/OpenEnergyPlatform/ontology/pull/1113 Add 'model uncertainty location axiom' issue:https://github.com/OpenEnergyPlatform/ontology/issues/1829 pull request: https://github.com/OpenEnergyPlatform/ontology/pull/1990

licence
type: Class
subclass of: information content entity
definition: A licence is an information content entity that contains an official permission or permit to do, use or own something.
alternative label: Lizenz @de
alternative label: license
term tracker annotation: issue https://github.com/OpenEnergyPlatform/ontology/issues/31 pull request https://github.com/OpenEnergyPlatform/ontology/pull/561 move to oeo-shared pull request https://github.com/OpenEnergyPlatform/ontology/pull/740 rework module structure issue: https://github.com/OpenEnergyPlatform/ontology/issues/1592 pull request: https://github.com/OpenEnergyPlatform/ontology/pull/1652

model descriptor
type: Class
equivalent class: Class
  intersection of: information content entity
  intersection of: Restriction
    on property: is about
    some values from: numerical computer model
subclass of: information content entity
definition: A model descriptor is an information content entity that contains information about some model.
term tracker annotation: issue: https://github.com/OpenEnergyPlatform/ontology/issues/82 pull request: https://github.com/OpenEnergyPlatform/ontology/pull/577 Add SubclassOf axiom: issue: https://github.com/OpenEnergyPlatform/ontology/issues/1386 pull request: https://github.com/OpenEnergyPlatform/ontology/pull/1387 rework module structure issue: https://github.com/OpenEnergyPlatform/ontology/issues/1592 pull request: https://github.com/OpenEnergyPlatform/ontology/pull/1652

analytical approach
type: Class
subclass of: model descriptor
definition: A analytical approach is a model descriptor that contains information about the analysis strategy of a model.
alternative label: analytischer Ansatz @de
term tracker annotation: issue: https://github.com/OpenEnergyPlatform/ontology/issues/82 pull request: https://github.com/OpenEnergyPlatform/ontology/pull/577 fix typo of label pull request: https://github.com/OpenEnergyPlatform/ontology/pull/981

methodical focus
type: Class
subclass of: model descriptor
subclass of: Restriction
  on property: is about
  some values from: model calculation
definition: A methodical focus is a model descriptor that specifies the primary calculation method used in a model.
alternative label: methodology
term tracker annotation: issue: https://github.com/OpenEnergyPlatform/ontology/issues/82 pull request: https://github.com/OpenEnergyPlatform/ontology/pull/577 alternative term pull request: https://github.com/OpenEnergyPlatform/ontology/pull/1011 rework module structure issue: https://github.com/OpenEnergyPlatform/ontology/issues/1592 pull request: https://github.com/OpenEnergyPlatform/ontology/pull/1652

primary modelling purpose
type: Class
subclass of: model descriptor
definition: A primary modelling purpose is a model descriptor stating the main purpose of a model.
alternative label: primary modeling purpose
term tracker annotation: issue: https://github.com/OpenEnergyPlatform/ontology/issues/82 pull request: https://github.com/OpenEnergyPlatform/ontology/pull/577

model documentation
type: Class
subclass of: model descriptor
definition: A model documentation is a model descriptor that contains a detailed description of a model.
alternative label: Modelldokumentation @de
term tracker annotation: issue: https://github.com/OpenEnergyPlatform/ontology/issues/82 pull request: https://github.com/OpenEnergyPlatform/ontology/pull/577

top down
type: Class
subclass of: analytical approach
definition: Top down is an analytical approach where design starts from the system as a whole. The system is then divided into smaller sub-applications with more details. Each part again goes through the top down approach till the complete system is designed with all minute details. Top down approach is also termed as breaking the bigger problem into smaller problems and solving them individually in a recursive manner. A top down model is based on a decomposition approach.
term tracker annotation: Convert to subclass and add definition: issue: https://github.com/OpenEnergyPlatform/ontology/issues/1147 pull request: https://github.com/OpenEnergyPlatform/ontology/pull/1302

bottom up
type: Class
subclass of: analytical approach
definition: Bottom up is an analytical approach where parts of the system are defined in details. Once these parts are designed and developed, then these parts or components are linked together to prepare a bigger component. This approach is repeated until the complete system is built. A bottom up model is based on a composition approach.
term tracker annotation: Convert to subclass and add definition: issue: https://github.com/OpenEnergyPlatform/ontology/issues/1147 pull request: https://github.com/OpenEnergyPlatform/ontology/pull/1302

hybrid
type: Class
subclass of: analytical approach
definition: Hybrid is an analytical approach that combines the top down and the bottom up approach. Some parts are based on composition approach while other parts are based on decomposition approach.
alternative label: hybrid @de
term tracker annotation: Convert to subclass and add definition: issue: https://github.com/OpenEnergyPlatform/ontology/issues/1147 pull request: https://github.com/OpenEnergyPlatform/ontology/pull/1302

study region
type: Class
equivalent class: Class
  intersection of: OEO_00360020
  intersection of: Restriction
    on property: has role
    some values from: OEO_00360021
subclass of: OEO_00360020
example of usage: In a study, the spatial focus of the investigation lies on one European country, e.g. Germany. This is the study region. The study region is not modelled as a whole, but several subregions are modelled, e.g. German Federal States. These are study subregions. In the study, a spatial region outside the study region plays a role. E.g. for modelling the electricity transfer between Germany and its neighbouring countries. In this example, the neighbouring countries represent the interacting / external region. The union of the study region and the interacting/ external region is the considered region.
definition: A study region is a region of relevance that has the study region role and consists entirely of one or more subregions.
term tracker annotation: issue: https://github.com/OpenEnergyPlatform/ontology/issues/475 pull request: https://github.com/OpenEnergyPlatform/ontology/pull/585 rework module structure issue: https://github.com/OpenEnergyPlatform/ontology/issues/1592 pull request: https://github.com/OpenEnergyPlatform/ontology/pull/1652 relocated, made equivalent issue: https://github.com/OpenEnergyPlatform/ontology/issues/1745 pull request: https://github.com/OpenEnergyPlatform/ontology/pull/1749

subregion
type: Class
subclass of: OEO_00360020
definition: A subregion is a region of relevance that is in every respect a component of a region of relevance, but never encompasses the entire extent of a region of relevance.
alternative label: Teilregion @de
term tracker annotation: issue: https://github.com/OpenEnergyPlatform/ontology/issues/475 pull request: https://github.com/OpenEnergyPlatform/ontology/pull/585 changed definition, relocated issue: https://github.com/OpenEnergyPlatform/ontology/issues/1745 pull request: https://github.com/OpenEnergyPlatform/ontology/pull/1749

study subregion
type: Class
equivalent class: Class
  intersection of: subregion
  intersection of: Restriction
    on property: has role
    some values from: OEO_00360024
subclass of: subregion
example of usage: In a study, the spatial focus of the investigation lies on one European country, e.g. Germany. This is the study region. The study region is not modelled as a whole, but several subregions are modelled, e.g. German Federal States. These are study subregions. In the study, a spatial region outside the study region plays a role. E.g. for modelling the electricity transfer between Germany and its neighbouring countries. In this example, the neighbouring countries represent the interacting / external region. The union of the study region and the interacting/ external region ist the considered region.
definition: A study subregion is a subregion that has the study subregion role.
term tracker annotation: issue: https://github.com/OpenEnergyPlatform/ontology/issues/475 pull request: https://github.com/OpenEnergyPlatform/ontology/pull/585 relocated, made equivalent issue: https://github.com/OpenEnergyPlatform/ontology/issues/1745 pull request: https://github.com/OpenEnergyPlatform/ontology/pull/1749

considered region
type: Class
equivalent class: Class
  intersection of: OEO_00360020
  intersection of: Restriction
    on property: has role
    some values from: OEO_00360022
subclass of: OEO_00360020
example of usage: In a study, the spatial focus of the investigation lies on one European country, e.g. Germany. This is the study region. The study region is not modelled as a whole, but several subregions are modelled, e.g. German Federal States. These are study subregions. In the study, a spatial region outside the study region plays a role. E.g. for modelling the electricity transfer between Germany and its neighbouring countries. In this example, the neighbouring countries represent the interacting / external region. The union of the study region and the interacting/ external region ist the considered region.
definition: A considered region is a region of relevance that has the considered region role.
alternative label: betrachtete Region @de
term tracker annotation: issue: https://github.com/OpenEnergyPlatform/ontology/issues/475 pull request: https://github.com/OpenEnergyPlatform/ontology/pull/585 rework module structure issue: https://github.com/OpenEnergyPlatform/ontology/issues/1592 pull request: https://github.com/OpenEnergyPlatform/ontology/pull/1652 relocated, made equivalent issue: https://github.com/OpenEnergyPlatform/ontology/issues/1745 pull request: https://github.com/OpenEnergyPlatform/ontology/pull/1749

interacting region
type: Class
equivalent class: Class
  intersection of: OEO_00360020
  intersection of: Restriction
    on property: has role
    some values from: OEO_00360023
subclass of: OEO_00360020
example of usage: In a study, the spatial focus of the investigation lies on one European country, e.g. Germany. This is the study region. The study region is not modelled as a whole, but several subregions are modelled, e.g. German Federal States. These are study subregions. In the study, a spatial region outside the study region plays a role. E.g. for modelling the electricity transfer between Germany and its neighbouring countries. In this example, the neighbouring countries represent the interacting / external region. The union of the study region and the interacting/ external region ist the considered region.
definition: An interacting region is a region of relevance that has the interacting region role.
alternative label: external region
term tracker annotation: issue: https://github.com/OpenEnergyPlatform/ontology/issues/475 pull request: https://github.com/OpenEnergyPlatform/ontology/pull/585 relocated, made equivalent issue: https://github.com/OpenEnergyPlatform/ontology/issues/1745 pull request: https://github.com/OpenEnergyPlatform/ontology/pull/1749

radiation
type: Class
subclass of: energy transfer
subclass of: Class
  intersection of: Restriction
    on property: has occurrent part
    some values from: Class
      intersection of: MENO_01013
      intersection of: Restriction
        on property: negatively regulates characteristic
        some values from: radiative energy
  intersection of: Restriction
    on property: has occurrent part
    some values from: Class
      intersection of: MENO_01014
      intersection of: Restriction
        on property: positively regulates characteristic
        some values from: radiative energy
subclass of: Restriction
  on property: has participant
  some values from: OEO_00230021
definition: Radiation is an energy transfer by emitting or transmitting energy in the form of waves or particles through a spatial region or a material entity.
alternative label: Strahlung @de
definition source: Adaptation of https://en.wikipedia.org/w/index.php?title=Radiation&oldid=986678480
term tracker annotation: issue: https://github.com/OpenEnergyPlatform/ontology/issues/362 pull request: https://github.com/OpenEnergyPlatform/ontology/pull/600 issue: https://github.com/OpenEnergyPlatform/ontology/issues/1031 pull request: https://github.com/OpenEnergyPlatform/ontology/pull/1447

Axiom
annotated source: radiation
annotated property: closeMatch
annotated target: ENVO_01001023
term tracker annotation: issue: https://github.com/OpenEnergyPlatform/ontology/issues/636 pull request: https://github.com/OpenEnergyPlatform/ontology/pull/810 Convert to skos:closeMatch issue: https://github.com/OpenEnergyPlatform/ontology/issues/636 pull request: https://github.com/OpenEnergyPlatform/ontology/pull/1879

solar radiation
type: Class
subclass of: radiation
definition: Solar radiation is radiation that is emitted by the sun.
editor note: Solar radiation is the mereological sum of direct solar radiation and diffuse solar radiation
alternative label: Solarstrahlung @de
alternative label: global radiation
term tracker annotation: issue: https://github.com/OpenEnergyPlatform/ontology/issues/362 pull request: https://github.com/OpenEnergyPlatform/ontology/pull/600 Add alternative label and editor note: issue: https://github.com/OpenEnergyPlatform/ontology/issues/1076 pull request: https://github.com/OpenEnergyPlatform/ontology/pull/1448

Axiom
annotated source: solar radiation
annotated property: closeMatch
annotated target: ENVO_01001862
term tracker annotation: issue: https://github.com/OpenEnergyPlatform/ontology/issues/636 pull request: https://github.com/OpenEnergyPlatform/ontology/pull/810 Convert to skos:closeMatch issue: https://github.com/OpenEnergyPlatform/ontology/issues/636 pull request: https://github.com/OpenEnergyPlatform/ontology/pull/1879

energy carrier
type: Class
equivalent class: Class
  intersection of: material entity
  intersection of: Restriction
    on property: has disposition
    some values from: energy carrier disposition
subclass of: material entity
definition: An energy carrier is a material entity that has an energy carrier disposition.
alternative label: Energieträger @de
term tracker annotation: issue: https://github.com/OpenEnergyPlatform/ontology/issues/407 pull request: https://github.com/OpenEnergyPlatform/ontology/pull/627 move to oeo-shared pull request: https://github.com/OpenEnergyPlatform/ontology/pull/869 improve definition: issue: https://github.com/OpenEnergyPlatform/ontology/issues/1169 pull request: https://github.com/OpenEnergyPlatform/ontology/pull/1173 rework module structure issue: https://github.com/OpenEnergyPlatform/ontology/issues/1592 pull request: https://github.com/OpenEnergyPlatform/ontology/pull/1652

radiative energy
type: Class
subclass of: energy
definition: Radiative energy is energy that has been transmitted by a radiation process.
alternative label: Strahlungsenergie @de
term tracker annotation: issue: https://github.com/OpenEnergyPlatform/ontology/issues/660 pull request: https://github.com/OpenEnergyPlatform/ontology/pull/665

Axiom
annotated source: radiative energy
annotated property: closeMatch
annotated target: ENVO_2000030
term tracker annotation: issue: https://github.com/OpenEnergyPlatform/ontology/issues/636 pull request: https://github.com/OpenEnergyPlatform/ontology/pull/810 Convert to skos:closeMatch issue: https://github.com/OpenEnergyPlatform/ontology/issues/636 pull request: https://github.com/OpenEnergyPlatform/ontology/pull/1879

wind energy transformation
type: Class
subclass of: energy transformation
subclass of: Class
  intersection of: Restriction
    on property: has occurrent part
    some values from: Class
      intersection of: MENO_01013
      intersection of: Restriction
        on property: negatively regulates characteristic
        some values from: wind energy
  intersection of: Restriction
    on property: has occurrent part
    some values from: Class
      intersection of: MENO_01014
      intersection of: Restriction
        on property: positively regulates characteristic
        some values from: electrical energy
subclass of: Restriction
  on property: has participant
  some values from: wind energy converting unit
definition: Wind energy transformation is an energy transformation that converts wind energy to electrical energy.
alternative label: Windenergieumwandlung @de
term tracker annotation: issue: https://github.com/OpenEnergyPlatform/ontology/issues/662 pull request: https://github.com/OpenEnergyPlatform/ontology/pull/666 pull request: https://github.com/OpenEnergyPlatform/ontology/pull/702 replace energy-participant axioms issue: https://github.com/OpenEnergyPlatform/ontology/issues/2053 pull request: https://github.com/OpenEnergyPlatform/ontology/pull/2120

potential energy
type: Class
subclass of: energy
alternative label: Lageenergie @de
alternative label: potentielle Energie @de
comment: Potential energy is the energy that a material entity contains due to its position relative to other material entities or to stresses within itself.
term tracker annotation: issue: https://github.com/OpenEnergyPlatform/ontology/issues/628 pull request: https://github.com/OpenEnergyPlatform/ontology/pull/670

Axiom
annotated source: potential energy
annotated property: closeMatch
annotated target: ENVO_2000016
term tracker annotation: issue: https://github.com/OpenEnergyPlatform/ontology/issues/636 pull request: https://github.com/OpenEnergyPlatform/ontology/pull/810 Convert to skos:closeMatch issue: https://github.com/OpenEnergyPlatform/ontology/issues/636 pull request: https://github.com/OpenEnergyPlatform/ontology/pull/1879

solar energy transformation
type: Class
equivalent class: Class
  intersection of: Restriction
    on property: has occurrent part
    some values from: Class
      intersection of: MENO_01013
      intersection of: Restriction
        on property: negatively regulates characteristic
        some values from: solar energy
  intersection of: Restriction
    on property: has occurrent part
    some values from: Class
      intersection of: MENO_01014
      intersection of: Restriction
        on property: positively regulates characteristic
        some values from: energy
subclass of: energy transformation
definition: Solar energy transformation is an energy transformation that converts solar energy.
term tracker annotation: class: issue: https://github.com/OpenEnergyPlatform/ontology/issues/663 pull request: https://github.com/OpenEnergyPlatform/ontology/pull/672 has input relation: issue: https://github.com/OpenEnergyPlatform/ontology/issues/668 pull request: https://github.com/OpenEnergyPlatform/ontology/pull/701 delete has physical output relation: issue: https://github.com/OpenEnergyPlatform/ontology/issues/980 pull request: https://github.com/OpenEnergyPlatform/ontology/pull/1010 change 'has physical input / output' axioms to 'has energy input / output': https://github.com/OpenEnergyPlatform/ontology/issues/994 https://github.com/OpenEnergyPlatform/ontology/pull/1041 replace energy-participant axioms issue: https://github.com/OpenEnergyPlatform/ontology/issues/2053 pull request: https://github.com/OpenEnergyPlatform/ontology/pull/2120

solar thermal energy transformation
type: Class
subclass of: energy transformation
subclass of: Class
  intersection of: Restriction
    on property: has occurrent part
    some values from: Class
      intersection of: MENO_01013
      intersection of: Restriction
        on property: negatively regulates characteristic
        some values from: solar energy
  intersection of: Restriction
    on property: has occurrent part
    some values from: Class
      intersection of: MENO_01014
      intersection of: Restriction
        on property: positively regulates characteristic
        some values from: solar thermal energy
subclass of: Restriction
  on property: has participant
  some values from: solar thermal collector
definition: Solar thermal energy transformation is a solar energy transformation that converts solar energy into thermal energy.
term tracker annotation: issue: https://github.com/OpenEnergyPlatform/ontology/issues/663 pull request: https://github.com/OpenEnergyPlatform/ontology/pull/672 change 'has physical input / output' axioms to 'has energy input / output': https://github.com/OpenEnergyPlatform/ontology/issues/994 https://github.com/OpenEnergyPlatform/ontology/pull/1041 replace energy-participant axioms issue: https://github.com/OpenEnergyPlatform/ontology/issues/2053 pull request: https://github.com/OpenEnergyPlatform/ontology/pull/2120

photovoltaic energy transformation
type: Class
subclass of: energy transformation
subclass of: Class
  intersection of: Restriction
    on property: has occurrent part
    some values from: Class
      intersection of: MENO_01013
      intersection of: Restriction
        on property: negatively regulates characteristic
        some values from: solar energy
  intersection of: Restriction
    on property: has occurrent part
    some values from: Class
      intersection of: MENO_01014
      intersection of: Restriction
        on property: positively regulates characteristic
        some values from: electrical energy
subclass of: Restriction
  on property: has participant
  some values from: photovoltaic cell
definition: Photovoltaic energy transformation is a solar energy transformation that converts solar energy into electrical energy.
term tracker annotation: issue: https://github.com/OpenEnergyPlatform/ontology/issues/663 pull request: https://github.com/OpenEnergyPlatform/ontology/pull/672 change 'has physical input / output' axioms to 'has energy input / output': https://github.com/OpenEnergyPlatform/ontology/issues/994 https://github.com/OpenEnergyPlatform/ontology/pull/1041 replace energy-participant axioms issue: https://github.com/OpenEnergyPlatform/ontology/issues/2053 pull request: https://github.com/OpenEnergyPlatform/ontology/pull/2120

renewable energy carrier
type: Class
equivalent class: Class
  intersection of: material entity
  intersection of: Restriction
    on property: has disposition
    some values from: renewable energy carrier disposition
subclass of: energy carrier
definition: A renewable energy carrier is an energy carrier that has a renewable energy carrier disposition.
alternative label: erneuerbarer Energieträger @de
term tracker annotation: issue: https://github.com/OpenEnergyPlatform/ontology/issues/515 pull request: https://github.com/OpenEnergyPlatform/ontology/pull/684 change def and equivalence pull request: https://github.com/OpenEnergyPlatform/ontology/pull/861

nuclear fission
type: Class
subclass of: process
subclass of: Restriction
  on property: has participant
  some values from: nuclear fuel
definition: Nuclear fission is a process of nuclear reaction or a radioactive decay in which the nucleus of an atom splits into two or more smaller, lighter nuclei.
alternative label: Kernspaltung @de
term tracker annotation: issue: https://github.com/OpenEnergyPlatform/ontology/issues/692 pull request: https://github.com/OpenEnergyPlatform/ontology/pull/698

nuclear energy transformation
type: Class
subclass of: energy transformation
subclass of: Class
  intersection of: Restriction
    on property: has occurrent part
    some values from: Class
      intersection of: MENO_01013
      intersection of: Restriction
        on property: negatively regulates characteristic
        some values from: nuclear binding energy
  intersection of: Restriction
    on property: has occurrent part
    some values from: Class
      intersection of: MENO_01014
      intersection of: Restriction
        on property: positively regulates characteristic
        some values from: thermal energy
definition: Nuclear energy transformation is an energy transformation that converts nuclear binding energy to thermal energy.
alternative label: kernphysikalische Energieumwandlung @de
term tracker annotation: issue: https://github.com/OpenEnergyPlatform/ontology/issues/692 pull request: https://github.com/OpenEnergyPlatform/ontology/pull/698 pull request: https://github.com/OpenEnergyPlatform/ontology/pull/702 change 'has physical input / output' axioms to 'has energy input / output': https://github.com/OpenEnergyPlatform/ontology/issues/994 https://github.com/OpenEnergyPlatform/ontology/pull/1041 replace energy-participant axioms issue: https://github.com/OpenEnergyPlatform/ontology/issues/2053 pull request: https://github.com/OpenEnergyPlatform/ontology/pull/2120

rock
type: Class
subclass of: portion of matter
subclass of: Restriction
  on property: has disposition
  some values from: energy carrier disposition
subclass of: Restriction
  on property: has origin
  some values from: geogenic
subclass of: Restriction
  on property: has normal state of matter
  has value: OEO_00000390
definition: A rock is a portion of matter that is a naturally occurring solid aggregate of minerals or mineraloid matter that is part of the earth's crust.
alternative label: Fels @de
term tracker annotation: issue: https://github.com/OpenEnergyPlatform/ontology/issues/727 pull request: https://github.com/OpenEnergyPlatform/ontology/pull/739

geothermal heat transfer
type: Class
subclass of: heat transfer
subclass of: Class
  intersection of: Restriction
    on property: has occurrent part
    some values from: Class
      intersection of: MENO_01013
      intersection of: Restriction
        on property: negatively regulates characteristic
        some values from: geothermal energy
  intersection of: Restriction
    on property: has occurrent part
    some values from: Class
      intersection of: MENO_01014
      intersection of: Restriction
        on property: positively regulates characteristic
        some values from: thermal energy
definition: Geothermal heat transfer is a heat transfer from the earth crust to a transportable material entity. E.g. a liquid or gas.
term tracker annotation: issue: https://github.com/OpenEnergyPlatform/ontology/issues/727 pull request: https://github.com/OpenEnergyPlatform/ontology/pull/739 change 'has physical input / output' axioms to 'has energy input / output': https://github.com/OpenEnergyPlatform/ontology/issues/994 https://github.com/OpenEnergyPlatform/ontology/pull/1041

fuel market exchange
type: Class
subclass of: energy market exchange
subclass of: Restriction
  on property: trades
  some values from: Restriction
    on property: has role
    some values from: fuel commodity role
definition: A fuel market exchange is an energy market exchange where fuels like oil, coal, renewable fuels, and natural gas are traded.
term tracker annotation: issue https://github.com/OpenEnergyPlatform/ontology/issues/677 pull request https://github.com/OpenEnergyPlatform/ontology/pull/740 pull request https://github.com/OpenEnergyPlatform/ontology/pull/748 Move to oeo-shared: issue: https://github.com/OpenEnergyPlatform/ontology/issues/1458 pull request: https://github.com/OpenEnergyPlatform/ontology/pull/1478 rework module structure issue: https://github.com/OpenEnergyPlatform/ontology/issues/1592 pull request: https://github.com/OpenEnergyPlatform/ontology/pull/1652

emission certificate
type: Class
subclass of: licence
subclass of: Restriction
  on property: has quantity value
  some values from: emission value
subclass of: Restriction
  on property: has quantity value
  some values from: emission certificate price
definition: An emission certificate is a licence that permits its holder/owner a specific emission value. An emission certificate can be traded at a CO2 market exchange.
alternative label: Emissionszertifikat @de
term tracker annotation: issue https://github.com/OpenEnergyPlatform/ontology/issues/677 pull request https://github.com/OpenEnergyPlatform/ontology/pull/740 moved to oeo-shared pull request https://github.com/OpenEnergyPlatform/ontology/pull/956 add axiom to emission quantity value and emission certificate price pull request https://github.com/OpenEnergyPlatform/ontology/pull/1034 rework module structure issue: https://github.com/OpenEnergyPlatform/ontology/issues/1592 pull request: https://github.com/OpenEnergyPlatform/ontology/pull/1652rework module change axiom to emission certificate price issue: https://github.com/OpenEnergyPlatform/ontology/issues/2144 pull request: https://github.com/OpenEnergyPlatform/ontology/pull/2161

EU allowance
type: Class
subclass of: emission certificate
definition: An EU Allowance (EUA) is an emission certificate used in the European Union Emissions Trading System (EU ETS). It permits the emission of a CO2 equivalent quantity of 1 tonne.
alternative label: EU-Berechtigung @de
alternative label: EU-Klimazertifikat @de
alternative label: EUA
term tracker annotation: issue https://github.com/OpenEnergyPlatform/ontology/issues/677 pull request https://github.com/OpenEnergyPlatform/ontology/pull/740

energy market exchange
type: Class
subclass of: market exchange
definition: An energy market exchange is a market exchange in which energy commodities are traded.
alternative label: Energiebörse @de
term tracker annotation: issue https://github.com/OpenEnergyPlatform/ontology/issues/256 pull request https://github.com/OpenEnergyPlatform/ontology/pull/748 Move to oeo-shared: issue: https://github.com/OpenEnergyPlatform/ontology/issues/1458 pull request: https://github.com/OpenEnergyPlatform/ontology/pull/1478 rework module structure issue: https://github.com/OpenEnergyPlatform/ontology/issues/1592 pull request: https://github.com/OpenEnergyPlatform/ontology/pull/1652

fuel commodity role
type: Class
subclass of: commodity role
definition: Fuel commodity role is the commodity role of fuels.
term tracker annotation: https://github.com/OpenEnergyPlatform/ontology/issues/256 https://github.com/OpenEnergyPlatform/ontology/pull/748 rework module structure issue: https://github.com/OpenEnergyPlatform/ontology/issues/1592 pull request: https://github.com/OpenEnergyPlatform/ontology/pull/1652

commodity
type: Class
equivalent class: Class
  intersection of: good
  intersection of: Restriction
    on property: has role
    some values from: commodity role
subclass of: good
subclass of: Restriction
  on property: is traded at
  some values from: market exchange
definition: A commodity is a good that bears the commodity role.
alternative label: Ware @de
alternative label: product
term tracker annotation: issue: https://github.com/OpenEnergyPlatform/ontology/issues/302 pull request: https://github.com/OpenEnergyPlatform/ontology/pull/748 add alternative term pull request: https://github.com/OpenEnergyPlatform/ontology/pull/800 subclass of good pull request: https://github.com/OpenEnergyPlatform/ontology/pull/843 change axiom pull request: https://github.com/OpenEnergyPlatform/ontology/pull/869 rework module structure issue: https://github.com/OpenEnergyPlatform/ontology/issues/1592 pull request: https://github.com/OpenEnergyPlatform/ontology/pull/1652

fuel commodity
type: Class
equivalent class: Restriction
  on property: has role
  some values from: fuel commodity role
subclass of: commodity
subclass of: Restriction
  on property: has role
  some values from: fuel role
subclass of: Restriction
  on property: is traded at
  some values from: fuel market exchange
definition: A fuel commodity is a commodity that is a fuel.
term tracker annotation: issue: https://github.com/OpenEnergyPlatform/ontology/issues/302 pull request: https://github.com/OpenEnergyPlatform/ontology/pull/748

market exchange
type: Class
equivalent class: Restriction
  on property: has role
  some values from: market exchange role
subclass of: organisation
subclass of: Restriction
definition: A market exchange is an organisation that has the market exchange role.
term tracker annotation: pull request: https://github.com/OpenEnergyPlatform/ontology/pull/748 Move to oeo-shared: issue: https://github.com/OpenEnergyPlatform/ontology/issues/1458 pull request: https://github.com/OpenEnergyPlatform/ontology/pull/1478 rework module structure issue: https://github.com/OpenEnergyPlatform/ontology/issues/1592 pull request: https://github.com/OpenEnergyPlatform/ontology/pull/1652s

Axiom
annotated source: market exchange
annotated property: subClassOf
annotated target: Restriction
term tracker annotation: https://github.com/OpenEnergyPlatform/ontology/issues/617 https://github.com/OpenEnergyPlatform/ontology/pull/1019 rework module structure issue: https://github.com/OpenEnergyPlatform/ontology/issues/1592 pull request: https://github.com/OpenEnergyPlatform/ontology/pull/1652

analysis scope
type: Class
subclass of: information content entity
subclass of: Restriction
  on property: is about
  some values from: sector
subclass of: Restriction
  on property: is about
  some values from: methodical focus
subclass of: Restriction
  on property: is about
  some values from: study region
subclass of: Restriction
  on property: is about
  some values from: considered region
subclass of: Restriction
  on property: is about
  some values from: scenario year
subclass of: Restriction
  on property: is about
  some values from: scenario horizon
definition: An analysis scope is an information content entity that describes the boundaries of what a study or scenario covers.
alternative label: Analyseumfang @de
term tracker annotation: issue: https://github.com/OpenEnergyPlatform/ontology/issues/638 pull request: https://github.com/OpenEnergyPlatform/ontology/pull/764 Add 'is about' axioms: issue: https://github.com/OpenEnergyPlatform/ontology/issues/1059 pull request: https://github.com/OpenEnergyPlatform/ontology/pull/1286 rework module structure issue: https://github.com/OpenEnergyPlatform/ontology/issues/1592 pull request: https://github.com/OpenEnergyPlatform/ontology/pull/1652

grid-bound heating
type: Class
subclass of: heat transfer
subclass of: Restriction
  on property: has participant
  some values from: heating grid
subclass of: Restriction
  on property: has participant
  some values from: Class
    union of: liquid water
    union of: steam
definition: Grid-bound heating is a heat transfer over a distance via a heating grid, using steam or (hot) water.
alternative label: distance heating
term tracker annotation: issue: https://github.com/OpenEnergyPlatform/ontology/issues/393 pull request: https://github.com/OpenEnergyPlatform/ontology/pull/770

industrial grid-bound heating
type: Class
subclass of: grid-bound heating
definition: Industrial grid-bound heating is a grid-bound heating transfer to industrial installations.
term tracker annotation: issue: https://github.com/OpenEnergyPlatform/ontology/issues/393 pull request: https://github.com/OpenEnergyPlatform/ontology/pull/770

emission market exchange
type: Class
subclass of: market exchange
subclass of: Restriction
  on property: trades
  some values from: emission certificate
definition: An emission market exchange is a market exchange where emission certificates are traded
term tracker annotation: issue https://github.com/OpenEnergyPlatform/ontology/issues/302 pull request https://github.com/OpenEnergyPlatform/ontology/pull/781

markup
type: Class
subclass of: quantity value
subclass of: Restriction
  on property: has unit
  some values from: currency
definition: A markup is a quantity value that indicates a virtual amount added to an assumed or historical price to predict a price in a different context.
alternative label: Aufschlag @de
term tracker annotation: issue: https://github.com/OpenEnergyPlatform/ontology/issues/256 pull request: https://github.com/OpenEnergyPlatform/ontology/pull/800 make subclass of quantity value issue: https://github.com/OpenEnergyPlatform/ontology/issues/1917 pull request: https://github.com/OpenEnergyPlatform/ontology/pull/1931

markdown
type: Class
subclass of: quantity value
subclass of: Restriction
  on property: has unit
  some values from: currency
definition: A markdown is a quantity value that indicates a virtual amount deducted from an assumed or historical price to predict a price in a different context.
alternative label: Abschlag @de
term tracker annotation: issue: https://github.com/OpenEnergyPlatform/ontology/issues/256 pull request: https://github.com/OpenEnergyPlatform/ontology/pull/800 make subclass of quantity value issue: https://github.com/OpenEnergyPlatform/ontology/issues/1917 pull request: https://github.com/OpenEnergyPlatform/ontology/pull/1931

renewable energy
type: Class
equivalent class: Class
  intersection of: energy
  intersection of: Restriction
    on property: has origin
    some values from: renewable
subclass of: energy
definition: A renewable energy is an energy that has renewable origin.
alternative label: erneuerbare Energie @de
term tracker annotation: issue: https://github.com/OpenEnergyPlatform/ontology/issues/741 pull request: https://github.com/OpenEnergyPlatform/ontology/pull/861 Move to oeo-shared: issue:https://github.com/OpenEnergyPlatform/ontology/issues/1423 pull request: https://github.com/OpenEnergyPlatform/ontology/pull/1437 rework module structure issue: https://github.com/OpenEnergyPlatform/ontology/issues/1592 pull request: https://github.com/OpenEnergyPlatform/ontology/pull/1652

renewable energy carrier disposition
type: Class
subclass of: energy carrier disposition
definition: A renewable energy carrier disposition is an energy carrier disposition of an material entity that contains renewable energy.
term tracker annotation: issue: https://github.com/OpenEnergyPlatform/ontology/issues/741 pull request: https://github.com/OpenEnergyPlatform/ontology/pull/861

natural hydro energy
type: Class
subclass of: hydro energy
subclass of: Restriction
  on property: uses
  some values from: water body
subclass of: Restriction
  on property: has origin
  some values from: renewable
definition: Natural hydro energy is hydro energy collected from the natural water cycle (rainwater, melted snow and ice).
term tracker annotation: issue: https://github.com/OpenEnergyPlatform/ontology/issues/741 pull request: https://github.com/OpenEnergyPlatform/ontology/pull/861

pumped hydro energy
type: Class
subclass of: hydro energy
subclass of: Restriction
  on property: uses
  some values from: pumped water
subclass of: Restriction
  on property: has origin
  some values from: conventional
definition: Pumped hydro energy is hydro energy that results from a water flow of pumped water.
term tracker annotation: issue: https://github.com/OpenEnergyPlatform/ontology/issues/741 pull request: https://github.com/OpenEnergyPlatform/ontology/pull/861

typical period
type: Class
subclass of: time series
subclass of: Restriction
  on property: uses
  some values from: aggregation type
definition: A typical period is a time series that represents a couple of real time periods that have certain characteristics in common, e.g. seasonal specifications, weekly routines, etc. It doesn't refer to a real date. Typical periods are used to reduce computing time of energy system models.
definition source: Definition adapted from: https://www.enargus.de/pub/bscw.cgi/d13068-2/*/*/Typtag.html?op=Wiki.getwiki&scope=all
term tracker annotation: add axiom `uses some 'aggregation type'`: issue: https://github.com/OpenEnergyPlatform/ontology/issues/880 pull request: https://github.com/OpenEnergyPlatform/ontology/pull/883 issue: https://github.com/OpenEnergyPlatform/ontology/issues/830 pull request: https://github.com/OpenEnergyPlatform/ontology/pull/875

typical year
type: Class
subclass of: typical period
subclass of: Restriction
  on property: has part
  some values from: Class
    intersection of: time span
    intersection of: Restriction
      on property: has unit
      some values from: year
    intersection of: Restriction
      on property: has number
      has value: 1
disjoint with: typical day
definition: A typical year is a typical period with the duration of one year.
alternative label: Typjahr @de
term tracker annotation: issue: https://github.com/OpenEnergyPlatform/ontology/issues/830 pull request: https://github.com/OpenEnergyPlatform/ontology/pull/875 add axiom pull request: https://github.com/OpenEnergyPlatform/ontology/pull/882

typical day
type: Class
subclass of: typical period
subclass of: Restriction
  on property: has part
  some values from: Class
    intersection of: time span
    intersection of: Restriction
      on property: has unit
      some values from: day
    intersection of: Restriction
      on property: has number
      has value: 1
definition: A typical day is a typical period with the duration of one day.
alternative label: Typtag @de
term tracker annotation: issue: https://github.com/OpenEnergyPlatform/ontology/issues/830 pull request: https://github.com/OpenEnergyPlatform/ontology/pull/875 add axiom pull request: https://github.com/OpenEnergyPlatform/ontology/pull/882

legal target description
type: Class
subclass of: objective specification
definition: A legal target description is an objective specification that contains statements about a desired future state of a system that a person or organisation commits to in a legally binding way.
alternative label: Zielbeschreibung @de
alternative label: target description
term tracker annotation: issue: https://github.com/OpenEnergyPlatform/ontology/issues/28 pull request: https://github.com/OpenEnergyPlatform/ontology/pull/881 reclassify issue: https://github.com/OpenEnergyPlatform/ontology/issues/1684 pull request: https://github.com/OpenEnergyPlatform/ontology/pull/1778 Renamed class from 'target description' to 'legal target description' issue: https://github.com/OpenEnergyPlatform/ontology/issues/2097 pull request: https://github.com/OpenEnergyPlatform/ontology/pull/2102

scenario year
type: Class
subclass of: time step
subclass of: Restriction
  on property: part of
  some values from: scenario horizon
subclass of: Restriction
  on property: has part
  some values from: Class
    intersection of: time span
    intersection of: Restriction
      on property: has unit
      some values from: year
    intersection of: Restriction
      on property: has number
      has value: 1
definition: A scenario year is a time step that has a duration of one year and is part of a scenario horizon.
alternative label: Szenariojahr @de
term tracker annotation: issue: https://github.com/OpenEnergyPlatform/ontology/issues/474 pull request: https://github.com/OpenEnergyPlatform/ontology/pull/882 rework module structure issue: https://github.com/OpenEnergyPlatform/ontology/issues/1592 pull request: https://github.com/OpenEnergyPlatform/ontology/pull/1652

scenario horizon
type: Class
subclass of: time step
subclass of: Restriction
  on property: has part
  some values from: scenario year
subclass of: Restriction
  on property: has part
  some values from: Class
    intersection of: time span
    intersection of: Restriction
      on property: has unit
      some values from: year
definition: A scenario horizon is a time step that is under investigation and consists entirely of one or more scenario years.
alternative label: Szenariohorizont @de
term tracker annotation: issue: https://github.com/OpenEnergyPlatform/ontology/issues/474 pull request: https://github.com/OpenEnergyPlatform/ontology/pull/882 rework module structure issue: https://github.com/OpenEnergyPlatform/ontology/issues/1592 pull request: https://github.com/OpenEnergyPlatform/ontology/pull/1652

meteorological year
type: Class
subclass of: time step
subclass of: Restriction
  on property: has part
  some values from: Class
    intersection of: time span
    intersection of: Restriction
      on property: has unit
      some values from: year
    intersection of: Restriction
      on property: has number
      has value: 1
definition: A meteorological year is a time step in which meteorological data was collected and that has a duration of one year.
alternative label: meteorologisches Jahr @de
term tracker annotation: issue: https://github.com/OpenEnergyPlatform/ontology/issues/474 pull request: https://github.com/OpenEnergyPlatform/ontology/pull/882

weather time series
type: Class
subclass of: time series
subclass of: Restriction
  on property: is about
  some values from: meteorological year
definition: A weather time series is a time series that contains data about a specific meteorological year.
alternative label: Wetterzeitreihe @de
alternative label: meteorological time series
term tracker annotation: issue: https://github.com/OpenEnergyPlatform/ontology/issues/474 pull request: https://github.com/OpenEnergyPlatform/ontology/pull/882

scenario time series
type: Class
subclass of: time series
subclass of: Restriction
  on property: is about
  some values from: scenario year
definition: A scenario time series is a time series that contains data about a specific scenario year.
alternative label: Szenariozeitreihe @de
term tracker annotation: issue: https://github.com/OpenEnergyPlatform/ontology/issues/474 pull request: https://github.com/OpenEnergyPlatform/ontology/pull/882

energy transformation unit
type: Class
subclass of: artificial object
subclass of: Restriction
subclass of: Restriction
  on property: participates in
  some values from: energy transformation
subclass of: Restriction
  on property: participates in
  some values from: outage
subclass of: Restriction
  on property: has energy output
  some values from: waste thermal energy
definition: An energy transformation unit is an artificial object that transforms, changes or transfers a certain type of energy.
term tracker annotation: issue: https://github.com/OpenEnergyPlatform/ontology/issues/465 pull request: https://github.com/OpenEnergyPlatform/ontology/pull/895 move to oeo-shared: issue: https://github.com/OpenEnergyPlatform/ontology/issues/1384 pull request: https://github.com/OpenEnergyPlatform/ontology/pull/1390 rework module structure issue: https://github.com/OpenEnergyPlatform/ontology/issues/1592 pull request: https://github.com/OpenEnergyPlatform/ontology/pull/1652

Axiom
annotated source: energy transformation unit
annotated property: subClassOf
annotated target: Restriction
term tracker annotation: issue: https://github.com/OpenEnergyPlatform/ontology/issues/980 pull request: https://github.com/OpenEnergyPlatform/ontology/pull/1010

energy transfer
type: Class
subclass of: energy transformation
definition: Energy transfer is an energy transformation in form of a spatial transmission, that does not change the types of energies, apart from losses, e.g. waste heat.
alternative label: Energieübertragung @de
term tracker annotation: class added: issue: https://github.com/OpenEnergyPlatform/ontology/issues/465 pull request: https://github.com/OpenEnergyPlatform/ontology/pull/895

outage
type: Class
subclass of: process
subclass of: Restriction
  on property: has participant
  some values from: energy transformation unit
definition: An outage is a process during which an artificial object cannot perform or operate.
term tracker annotation: issue: https://github.com/OpenEnergyPlatform/ontology/issues/887 pull request: https://github.com/OpenEnergyPlatform/ontology/pull/897 move to oeo-shared: issue: https://github.com/OpenEnergyPlatform/ontology/issues/1384 pull request: https://github.com/OpenEnergyPlatform/ontology/pull/1390 rework module structure issue: https://github.com/OpenEnergyPlatform/ontology/issues/1592 pull request: https://github.com/OpenEnergyPlatform/ontology/pull/1652

forced outage
type: Class
subclass of: outage
disjoint with: planned outage
definition: A forced outage is an outage of an artificial object caused by a failure.
term tracker annotation: issue: https://github.com/OpenEnergyPlatform/ontology/issues/887 pull request: https://github.com/OpenEnergyPlatform/ontology/pull/897

planned outage
type: Class
subclass of: outage
definition: A planned outage is an outage during which an artificial object is being maintained.
alternative label: geplante Abschaltung @de
term tracker annotation: issue: https://github.com/OpenEnergyPlatform/ontology/issues/887 pull request: https://github.com/OpenEnergyPlatform/ontology/pull/897

curtailment
type: Class
subclass of: process
subclass of: Restriction
  on property: has participant
  some values from: power generating unit
definition: Curtailment is a process in which a power generating unit is forced to reduce its output, in order to balance energy supply and demand or due to transmission constraints.
alternative label: Abregelung @de
term tracker annotation: issue: https://github.com/OpenEnergyPlatform/ontology/issues/888 pull request: https://github.com/OpenEnergyPlatform/ontology/pull/897 rework module structure issue: https://github.com/OpenEnergyPlatform/ontology/issues/1592 pull request: https://github.com/OpenEnergyPlatform/ontology/pull/1652

feed-in tariff
type: Class
subclass of: economic instrument
definition: A feed-in tariff is an economic instrument designed to stimulate investment in renewable energy technologies by offering long-term contracts to agents who are producers of renewable energy.
alternative label: Einspeisetarif @de
comment: Feed-in tariffs provide cost-based compensation to renewable energy producers, leading to price certainty and long-term contracts that help finance energy transformation units, e.g. power plants
term tracker annotation: issue: https://github.com/OpenEnergyPlatform/ontology/issues/839 issue: https://github.com/OpenEnergyPlatform/ontology/issues/898 pull request: https://github.com/OpenEnergyPlatform/ontology/pull/909 Make subclass of 'economic instrument': issue: https://github.com/OpenEnergyPlatform/ontology/issues/1545 pull request: https://github.com/OpenEnergyPlatform/ontology/pull/1786

market premium
type: Class
subclass of: economic instrument
definition: A market premium is an economic instrument that ensures a guaranteed remuneration, e.g. a fixed feed-in tariff, by paying to the producing agent the difference between a guaranteed return on a good/product and the monetary price for which the good/product is traded on the market.
alternative label: Marktprämie @de
term tracker annotation: issue: https://github.com/OpenEnergyPlatform/ontology/issues/839 issue: https://github.com/OpenEnergyPlatform/ontology/issues/899 pull request: https://github.com/OpenEnergyPlatform/ontology/pull/909 Make subclass of 'economic instrument': issue: https://github.com/OpenEnergyPlatform/ontology/issues/1545 pull request: https://github.com/OpenEnergyPlatform/ontology/pull/1786

levy
type: Class
subclass of: economic instrument
definition: A levy is an economic instrument that consists of a compulsory financial charge imposed on an agent or institution by a governmental organisation.
alternative label: Umlage @de
term tracker annotation: issue: https://github.com/OpenEnergyPlatform/ontology/issues/839 issue: https://github.com/OpenEnergyPlatform/ontology/issues/900 pull request: https://github.com/OpenEnergyPlatform/ontology/pull/909 Make subclass of 'economic instrument': issue: https://github.com/OpenEnergyPlatform/ontology/issues/1545 pull request: https://github.com/OpenEnergyPlatform/ontology/pull/1786

capacity premium
type: Class
subclass of: market premium
definition: A capacity premium is a market premium that guarantees remuneration for reserving capacity of energy transformation units to be available for unexpected events.
alternative label: Kapazitätsprämie @de
term tracker annotation: issue: https://github.com/OpenEnergyPlatform/ontology/issues/839 issue: https://github.com/OpenEnergyPlatform/ontology/issues/903 pull request: https://github.com/OpenEnergyPlatform/ontology/pull/909

tax
type: Class
subclass of: levy
definition: A tax is a levy whose returns are used by the government to finance expenditures for the common welfare.
alternative label: Steuer @de
term tracker annotation: issue: https://github.com/OpenEnergyPlatform/ontology/issues/839 issue: https://github.com/OpenEnergyPlatform/ontology/issues/901 pull request: https://github.com/OpenEnergyPlatform/ontology/pull/909

inflation rate
type: Class
subclass of: fraction value
subclass of: Restriction
  on property: has unit
  some values from: ratio
definition: Inflation rate is an economic value reprensenting the ratio between the monetary price for a good at two different points in time that equalises differences in monetary price levels between these two points in time.
alternative label: Inflationsrate @de
term tracker annotation: https://github.com/OpenEnergyPlatform/ontology/issues/335 https://github.com/OpenEnergyPlatform/ontology/pull/910 make subclass of fraction value issue: https://github.com/OpenEnergyPlatform/ontology/issues/1875 pull request: https://github.com/OpenEnergyPlatform/ontology/pull/1878

exchange rate
type: Class
subclass of: fraction value
subclass of: Restriction
  on property: has unit
  some values from: ratio
example of usage: The exchange rate between USD and EUR on March 15, 2020 was X.X.
definition: The exchange rate is an economic value representing the ratio at which one currency can be exchanged for another.
alternative label: Umrechnungskurs @de
alternative label: market exchange rate
comment: The ratio at which one can exchange one currency for another can differ over time therefore it is necessary to specify a time point when referring to an exchange rate.
term tracker annotation: https://github.com/OpenEnergyPlatform/ontology/issues/335 https://github.com/OpenEnergyPlatform/ontology/pull/910 make subclass of fraction value issue: https://github.com/OpenEnergyPlatform/ontology/issues/1875 pull request: https://github.com/OpenEnergyPlatform/ontology/pull/1878

purchasing power parity
type: Class
subclass of: fraction value
subclass of: Restriction
  on property: has unit
  some values from: ratio
definition: Purchasing power parity is an economic value representing the ratio between currencies that equalises differences in monetary price levels between countries for the same set of goods.
alternative label: PPP
source: https://www.oecd.org/sdd/prices-ppp/purchasingpowerparities-frequentlyaskedquestionsfaqs.htm#FAQ1
term tracker annotation: https://github.com/OpenEnergyPlatform/ontology/issues/867 https://github.com/OpenEnergyPlatform/ontology/pull/910 make subclass of fraction value issue: https://github.com/OpenEnergyPlatform/ontology/issues/1875 pull request: https://github.com/OpenEnergyPlatform/ontology/pull/1878

system cost
type: Class
subclass of: cost
definition: System cost are total costs of a system.
alternative label: Systemkosten @de
term tracker annotation: issue: https://github.com/OpenEnergyPlatform/ontology/issues/335 pull request: https://github.com/OpenEnergyPlatform/ontology/pull/910 make subclass of process attribute issue: https://github.com/OpenEnergyPlatform/ontology/issues/1914 pull request: https://github.com/OpenEnergyPlatform/ontology/pull/1999

electricity price
type: Class
subclass of: monetary value
subclass of: Restriction
  on property: quantity value of
  some values from: Class
    intersection of: electrical energy
    intersection of: Restriction
      on property: has characteristic
      some values from: monetary price
example of usage: The electricity price is Y EUR per megawatt-hour.
definition: Electricity price is the monetary price per energy unit of electricity.
alternative label: Strompreis @de
comment: has unit some "currency per energy unit"
term tracker annotation: issue: https://github.com/OpenEnergyPlatform/ontology/issues/335 pull request: https://github.com/OpenEnergyPlatform/ontology/pull/910
term tracker annotation: issue: https://github.com/OpenEnergyPlatform/ontology/issues/335 pull request: https://github.com/OpenEnergyPlatform/ontology/pull/910 add axiom in oeo-shared-axioms issue: https://github.com/OpenEnergyPlatform/ontology/issues/1902 pull request: https://github.com/OpenEnergyPlatform/ontology/pull/1915

resolution
type: Class
subclass of: quality
subclass of: Restriction
  on property: characteristic of
  some values from: data set
definition: Resolution is a quality of a dataset that indicates the level of detail of the data.
alternative label: Auflösung @de
term tracker annotation: issue: https://github.com/OpenEnergyPlatform/ontology/issues/849 pull request: https://github.com/OpenEnergyPlatform/ontology/pull/972 add 'has bearer' axiom issue: https://github.com/OpenEnergyPlatform/ontology/issues/1305 pull request: https://github.com/OpenEnergyPlatform/ontology/pull/1310 rework module structure issue: https://github.com/OpenEnergyPlatform/ontology/issues/1592 pull request: https://github.com/OpenEnergyPlatform/ontology/pull/1652 replaced 'has bearer' with 'characteristic of' issue: https://github.com/OpenEnergyPlatform/ontology/issues/1907 pull request: https://github.com/OpenEnergyPlatform/ontology/pull/1928

temporal resolution
type: Class
subclass of: resolution
subclass of: Restriction
  on property: characteristic of
  some values from: time series
disjoint with: spatial resolution
definition: Temporal resolution is the resolution of a time series that indicates time-dependent the level of detail.
alternative label: zeitliche Auflösung @de
term tracker annotation: issue: https://github.com/OpenEnergyPlatform/ontology/issues/849 pull request: https://github.com/OpenEnergyPlatform/ontology/pull/912 add individuals pull request: https://github.com/OpenEnergyPlatform/ontology/pull/972 add 'has bearer' axiom issue: https://github.com/OpenEnergyPlatform/ontology/issues/1305 pull request: https://github.com/OpenEnergyPlatform/ontology/pull/1310 rework module structure issue: https://github.com/OpenEnergyPlatform/ontology/issues/1592 pull request: https://github.com/OpenEnergyPlatform/ontology/pull/1652 replaced 'has bearer' with 'characteristic of' issue: https://github.com/OpenEnergyPlatform/ontology/issues/1907 pull request: https://github.com/OpenEnergyPlatform/ontology/pull/1928

spatial resolution
type: Class
subclass of: resolution
definition: Spatial resolution is the resolution of a georeferenced dataset that indicates the geographical level of detail.
alternative label: räumliche Auflösung @de
term tracker annotation: issue: https://github.com/OpenEnergyPlatform/ontology/issues/849 pull request: https://github.com/OpenEnergyPlatform/ontology/pull/912 rework module structure issue: https://github.com/OpenEnergyPlatform/ontology/issues/1592 pull request: https://github.com/OpenEnergyPlatform/ontology/pull/1652

due
type: Class
subclass of: quantity value
subclass of: Restriction
  on property: has unit
  some values from: currency
definition: A due is a quantity value that represents a payment that an agent makes to belong to an organisation.
alternative label: Mitgliedsbeitrag @de
term tracker annotation: issue: https://github.com/OpenEnergyPlatform/ontology/issues/904 pull request: https://github.com/OpenEnergyPlatform/ontology/pull/913 make subclass of quantity value issue: https://github.com/OpenEnergyPlatform/ontology/issues/1917 pull request: https://github.com/OpenEnergyPlatform/ontology/pull/1931

remuneration
type: Class
subclass of: quantity value
subclass of: Restriction
  on property: has unit
  some values from: currency
definition: A remuneration is a quantity value that describes a financial compensation provided in exchange for services performed.
term tracker annotation: issue: https://github.com/OpenEnergyPlatform/ontology/issues/902 pull request: https://github.com/OpenEnergyPlatform/ontology/pull/913 make subclass of quantity value issue: https://github.com/OpenEnergyPlatform/ontology/issues/1917 pull request: https://github.com/OpenEnergyPlatform/ontology/pull/1931

fee
type: Class
subclass of: quantity value
subclass of: Restriction
  on property: has unit
  some values from: currency
definition: A fee is a quantity value that represents an amount of money paid for a particular piece of work or for a particular right or service.
alternative label: Gebühr @de
term tracker annotation: issue: https://github.com/OpenEnergyPlatform/ontology/issues/905 pull request: https://github.com/OpenEnergyPlatform/ontology/pull/913 make subclass of quantity value issue: https://github.com/OpenEnergyPlatform/ontology/issues/1917 pull request: https://github.com/OpenEnergyPlatform/ontology/pull/1931

levelised cost of electricity
type: Class
subclass of: cost
definition: Levelised cost of electricity are the net cost of converting energy to electricity / electric energy over the lifetime of an energy transformation unit. They are calculated considering all relevant costs including investment, operation, maintenance and fuel cost, etc.
alternative label: LCOE
comment: Since over the lifetime of an energy transformation unit different costs exhibit different relevance or vary over time, the LCOE differ over the course of the lifetime.
term tracker annotation: issue: https://github.com/OpenEnergyPlatform/ontology/issues/906 pull request: https://github.com/OpenEnergyPlatform/ontology/pull/913 make subclass of process attribute issue: https://github.com/OpenEnergyPlatform/ontology/issues/1914 pull request: https://github.com/OpenEnergyPlatform/ontology/pull/1999

market revenue
type: Class
subclass of: quantity value
subclass of: Restriction
  on property: has unit
  some values from: currency
definition: Market revenue is a quantity value that represents the income from a trade at a market exchange.
term tracker annotation: add term https://github.com/OpenEnergyPlatform/ontology/issues/908 https://github.com/OpenEnergyPlatform/ontology/pull/929 make subclass of quantity value issue: https://github.com/OpenEnergyPlatform/ontology/issues/1917 pull request: https://github.com/OpenEnergyPlatform/ontology/pull/1931

space requirement
type: Class
subclass of: two-dimensional spatial region
definition: A space requirement is a two-dimensional spatial region that covers the area needed by an object or object aggregate.
alternative label: Flächenbedarf @de
alternative label: Platzbedarf @de
alternative label: Raumbedarf @de
alternative label: land use
term tracker annotation: issue: https://github.com/OpenEnergyPlatform/ontology/issues/889 pull request: https://github.com/OpenEnergyPlatform/ontology/pull/933 extend definition and add alternative term issue: https://github.com/OpenEnergyPlatform/ontology/issues/1051 pull request: https://github.com/OpenEnergyPlatform/ontology/pull/1084 rework module structure issue: https://github.com/OpenEnergyPlatform/ontology/issues/1592 pull request: https://github.com/OpenEnergyPlatform/ontology/pull/1652

operational space requirement
type: Class
subclass of: space requirement
definition: An operational space requirement is space requirement that covers the area needed by an artificial object in order to operate properly.
term tracker annotation: issue: https://github.com/OpenEnergyPlatform/ontology/issues/889 pull request: https://github.com/OpenEnergyPlatform/ontology/pull/933

space requirement for construction
type: Class
subclass of: space requirement
definition: A space requirement for construction is space requirement of an artificial object that covers the area needed in order to construct an artificial object.
term tracker annotation: issue: https://github.com/OpenEnergyPlatform/ontology/issues/889 pull request: https://github.com/OpenEnergyPlatform/ontology/pull/933

area per power unit
type: Class
subclass of: physical unit
definition: An area per power unit is a unit which is a measure for an area per nameplate capacity.
alternative label: Fläche pro Leistungseinheit @de
term tracker annotation: issue: https://github.com/OpenEnergyPlatform/ontology/issues/889 pull request: https://github.com/OpenEnergyPlatform/ontology/pull/930 rework module structure issue: https://github.com/OpenEnergyPlatform/ontology/issues/1592 pull request: https://github.com/OpenEnergyPlatform/ontology/pull/1652 make subclass of physical unit issue: https://github.com/OpenEnergyPlatform/ontology/issues/2135 pull request: https://github.com/OpenEnergyPlatform/ontology/pull/2141

specific space requirement
type: Class
subclass of: quantity value
subclass of: Restriction
  on property: has unit
  some values from: area per power unit
definition: A specific space requirement is a quantity value that indicates a certain space requirement per nameplate capacity.
alternative label: spezifischer Flächenbedarf @de
alternative label: spezifischer Raumbedarf @de
term tracker annotation: issue: https://github.com/OpenEnergyPlatform/ontology/issues/899 pull request: https://github.com/OpenEnergyPlatform/ontology/pull/933

square kilometer
type: Class
subclass of: area unit
definition: An area unit which is equal to one million square meters or 10^[6] m^[2].
alternative label: Quadratkilometer @de
alternative label: km^[2]
alternative label: square km
term tracker annotation: issue: https://github.com/OpenEnergyPlatform/ontology/issues/889 pull request: https://github.com/OpenEnergyPlatform/ontology/pull/933 rework module structure issue: https://github.com/OpenEnergyPlatform/ontology/issues/1592 pull request: https://github.com/OpenEnergyPlatform/ontology/pull/1652

area value
type: Class
subclass of: quantity value
subclass of: Restriction
  on property: is about
  some values from: two-dimensional spatial region
subclass of: Restriction
  on property: quantity value of
  some values from: OEO_00340068
subclass of: Restriction
  on property: has unit
  some values from: area unit
definition: An area value is a quantity value indicating the size of a two-dimensional spatial region.
alternative label: Flächenwert @de
alternative label: area quantity value
term tracker annotation: issue: https://github.com/OpenEnergyPlatform/ontology/issues/889 pull request: https://github.com/OpenEnergyPlatform/ontology/pull/933 rework module structure issue: https://github.com/OpenEnergyPlatform/ontology/issues/1592 pull request: https://github.com/OpenEnergyPlatform/ontology/pull/1652 restructuring of quantity values issue: https://github.com/OpenEnergyPlatform/ontology/issues/1848 pull request: https://github.com/OpenEnergyPlatform/ontology/pull/1851

rotor diameter
type: Class
subclass of: quality
subclass of: Restriction
  on property: characteristic of
  some values from: Class
    union of: wind energy converting unit
    union of: wind rotor
subclass of: Restriction
  on property: has quantity value
  some values from: length value
definition: Rotor diameter is a quality of a wind energy converting unit that measures the diameter of the wind rotor.
alternative label: Rotordurchmesser @de
term tracker annotation: add class issue: https://github.com/OpenEnergyPlatform/ontology/issues/892 pull request: https://github.com/OpenEnergyPlatform/ontology/pull/949 add 'has bearer' axiom issue: https://github.com/OpenEnergyPlatform/ontology/issues/1305 pull request: https://github.com/OpenEnergyPlatform/ontology/pull/1310 replaced 'has bearer' with 'characteristic of' issue: https://github.com/OpenEnergyPlatform/ontology/issues/1907 pull request: https://github.com/OpenEnergyPlatform/ontology/pull/1928

variable cost
type: Class
subclass of: cost
definition: A variable cost is a cost that depends on an amount of goods or services.
alternative label: unit-level cost
alternative label: variable Kosten @de
term tracker annotation: issue: https://github.com/OpenEnergyPlatform/ontology/issues/891 pull request: https://github.com/OpenEnergyPlatform/ontology/pull/953 Reformulate definition to singular: issue: https://github.com/OpenEnergyPlatform/ontology/issues/1257 pull request: https://github.com/OpenEnergyPlatform/ontology/pull/1260 make subclass of process attribute issue: https://github.com/OpenEnergyPlatform/ontology/issues/1914 pull request: https://github.com/OpenEnergyPlatform/ontology/pull/1999

variable production cost
type: Class
subclass of: variable cost
example of usage: An example for variable production cost are costs incurred for raw materials (of which more are needed if production is increased).
definition: Variable production costs are costs that depend on the amount of goods or services produced and which are paid by the producer.
alternative label: variable Produktionskosten @de
term tracker annotation: issue: https://github.com/OpenEnergyPlatform/ontology/issues/891 pull request: https://github.com/OpenEnergyPlatform/ontology/pull/953 make subclass of process attribute issue: https://github.com/OpenEnergyPlatform/ontology/issues/1914 pull request: https://github.com/OpenEnergyPlatform/ontology/pull/1999

conventional
type: Class
subclass of: origin
subclass of: Restriction
  on property: characteristic of
  some values from: energy
disjoint with: renewable
definition: Conventional is an origin of energies that don't replenish when transformed / consumed.
alternative label: konventionell @de
alternative label: non-renewable
term tracker annotation: issue: https://github.com/OpenEnergyPlatform/ontology/issues/833 pull request: https://github.com/OpenEnergyPlatform/ontology/pull/955 Axiomatise relations between origin, energy and portion of matter: issue: https://github.com/OpenEnergyPlatform/ontology/issues/1183 pull request: https://github.com/OpenEnergyPlatform/ontology/pull/1192 replaced 'has bearer' with 'characteristic of' issue: https://github.com/OpenEnergyPlatform/ontology/issues/1907 pull request: https://github.com/OpenEnergyPlatform/ontology/pull/1928

Axiom
annotated source: conventional
annotated property: disjointWith
annotated target: renewable
term tracker annotation: issue: https://github.com/OpenEnergyPlatform/ontology/issues/872 pull request: https://github.com/OpenEnergyPlatform/ontology/pull/1048

conventional energy carrier disposition
type: Class
subclass of: energy carrier disposition
definition: A conventional energy carrier disposition is an energy carrier disposition of a material entity that contains non-renewable energy.
term tracker annotation: issue: https://github.com/OpenEnergyPlatform/ontology/issues/833 pull request: https://github.com/OpenEnergyPlatform/ontology/pull/955

fossil energy
type: Class
equivalent class: Class
  intersection of: chemical energy
  intersection of: Restriction
    on property: characteristic of
    some values from: fossil combustion fuel
  intersection of: Restriction
    on property: has origin
    some values from: conventional
subclass of: chemical energy
definition: Fossil energy is chemical energy that is stored in fossil combustion fuels and thus has a conventional origin.
alternative label: fossile Energie @de
term tracker annotation: issue: https://github.com/OpenEnergyPlatform/ontology/issues/833 pull request: https://github.com/OpenEnergyPlatform/ontology/pull/955 Update definition and axiom: issue: https://github.com/OpenEnergyPlatform/ontology/issues/1172 pull request: https://github.com/OpenEnergyPlatform/ontology/pull/1185 replaced 'has bearer' with 'characteristic of' issue: https://github.com/OpenEnergyPlatform/ontology/issues/1907 pull request: https://github.com/OpenEnergyPlatform/ontology/pull/1928

emission certificate price
type: Class
subclass of: emission price
subclass of: Restriction
  on property: quantity value of
  some values from: emission certificate
definition: Emission certificate price is a monetary price of an emission certificate that allows the emission of a certain emission value.
alternative label: CO2 price
alternative label: Emissionszertifikatspreis @de
term tracker annotation: issue: https://github.com/OpenEnergyPlatform/ontology/issues/866 pull request: https://github.com/OpenEnergyPlatform/ontology/pull/956 add relation to emission certificate pull request: https://github.com/OpenEnergyPlatform/ontology/pull/1034 make subclass of 'emission price': issue: https://github.com/OpenEnergyPlatform/ontology/issues/866 pull request: https://github.com/OpenEnergyPlatform/ontology/pull/1253 rework module structure issue: https://github.com/OpenEnergyPlatform/ontology/issues/1592 pull request: https://github.com/OpenEnergyPlatform/ontology/pull/1652

social cost of carbon emission
type: Class
subclass of: social cost of emission
definition: Social cost of carbon emission is the cost the society bears for a greenhouse gas emission value.
alternative label: social cost of CO2
term tracker annotation: issue: https://github.com/OpenEnergyPlatform/ontology/issues/866 pull request: https://github.com/OpenEnergyPlatform/ontology/pull/956 add axiom to emission value, add new parent class and relabel pull request: https://github.com/OpenEnergyPlatform/ontology/pull/1034 rework module structure issue: https://github.com/OpenEnergyPlatform/ontology/issues/1592 pull request: https://github.com/OpenEnergyPlatform/ontology/pull/1652 make subclass of process attribute issue: https://github.com/OpenEnergyPlatform/ontology/issues/1914 pull request: https://github.com/OpenEnergyPlatform/ontology/pull/1999

carbon tax
type: Class
subclass of: tax
definition: Carbon tax is a tax for emitting CO2 or other greenhouse gases (measured in CO2 equivalent values).
alternative label: CO2 tax
alternative label: CO2-Steuer @de
term tracker annotation: issue: https://github.com/OpenEnergyPlatform/ontology/issues/866 pull request: https://github.com/OpenEnergyPlatform/ontology/pull/956

methodology
type: Class
subclass of: plan specification
subclass of: Restriction
  on property: part of
  some values from: study
definition: A methodology is a plan specification that describes processes that are part of a study.
term tracker annotation: issue: https://github.com/OpenEnergyPlatform/ontology/issues/971 pull request: https://github.com/OpenEnergyPlatform/ontology/pull/1011 move to oeo-shared: issue: https://github.com/OpenEnergyPlatform/ontology/issues/1129 pull request: https://github.com/OpenEnergyPlatform/ontology/pull/1306 rework module structure issue: https://github.com/OpenEnergyPlatform/ontology/issues/1592 pull request: https://github.com/OpenEnergyPlatform/ontology/pull/1652

investment cost
type: Class
subclass of: cost
definition: Investment costs are costs of a long-term commitment of financial resources in tangible or intangible assets.
alternative label: Investitionskosten @de
alternative label: capital investment cost
alternative label: fixed investment cost
alternative label: investment
definition source: FIBO definition of investment relates to property only: https://spec.edmcouncil.org/fibo/ontology?searchBoxQuery=investment, Gabler on Investition: langfristige Bindung finanzieller Mittel in materiellen oder in immateriellen Vermögensgegenständen (https://wirtschaftslexikon.gabler.de/definition/investition-39454)
term tracker annotation: issue: https://github.com/OpenEnergyPlatform/ontology/issues/891 pull request: https://github.com/OpenEnergyPlatform/ontology/pull/1022 make subclass of process attribute issue: https://github.com/OpenEnergyPlatform/ontology/issues/1914 pull request: https://github.com/OpenEnergyPlatform/ontology/pull/1999

fixed cost
type: Class
subclass of: cost
example of usage: rent, regular technical maintenance cost, staff cost, certification cost
definition: A fixed cost is a cost for operation and maintenance that does not vary with the amount of goods or services produced.
alternative label: Fixkosten @de
alternative label: fixed operation and maintenance cost
definition source: oemof-Model: https://oemof-solph.readthedocs.io/en/latest/_modules/oemof/solph/options.html?highlight=fix%20costs Fixe Kosten: Kosten, die von der jeweils betrachteten Einflussgröße bzw. Entscheidung unabhängig sind, d.h. Kosten, die sich nicht mit der jeweils betrachteten Einflussgröße ändern. (https://wirtschaftslexikon.gabler.de/definition/fixe-kosten-33359)
term tracker annotation: issue: https://github.com/OpenEnergyPlatform/ontology/issues/891 pull request: https://github.com/OpenEnergyPlatform/ontology/pull/1022 Reformulate definition to singular: issue: https://github.com/OpenEnergyPlatform/ontology/issues/1257 pull request: https://github.com/OpenEnergyPlatform/ontology/pull/1260 make subclass of process attribute issue: https://github.com/OpenEnergyPlatform/ontology/issues/1914 pull request: https://github.com/OpenEnergyPlatform/ontology/pull/1999

equipment cost
type: Class
subclass of: investment cost
definition: Equipment cost is an investment cost for acquisition of the components and machinery including environmental facilities.
alternative label: Ausrüstungskosten @de
term tracker annotation: issue: https://github.com/OpenEnergyPlatform/ontology/issues/891 pull request: https://github.com/OpenEnergyPlatform/ontology/pull/1022 Reformulate definition to singular: issue: https://github.com/OpenEnergyPlatform/ontology/issues/1257 pull request: https://github.com/OpenEnergyPlatform/ontology/pull/1260 make subclass of process attribute issue: https://github.com/OpenEnergyPlatform/ontology/issues/1914 pull request: https://github.com/OpenEnergyPlatform/ontology/pull/1999

installation cost
type: Class
subclass of: investment cost
example of usage: costs that occur for becoming operational
definition: Installation and development cost are investment costs incurred for setting up the installation.
alternative label: Installationskosten @de
alternative label: installation and development cost
alternative label: site development cost
term tracker annotation: issue: https://github.com/OpenEnergyPlatform/ontology/issues/891 pull request: https://github.com/OpenEnergyPlatform/ontology/pull/1022 make subclass of process attribute issue: https://github.com/OpenEnergyPlatform/ontology/issues/1914 pull request: https://github.com/OpenEnergyPlatform/ontology/pull/1999

grid connection cost
type: Class
subclass of: investment cost
definition: Grid connection costs are investment costs for establishing the grid connection from the energy generating device to point of connection to national grid.
term tracker annotation: issue: https://github.com/OpenEnergyPlatform/ontology/issues/891 pull request: https://github.com/OpenEnergyPlatform/ontology/pull/1022 make subclass of process attribute issue: https://github.com/OpenEnergyPlatform/ontology/issues/1914 pull request: https://github.com/OpenEnergyPlatform/ontology/pull/1999

property cost
type: Class
subclass of: investment cost
definition: A property cost is an investment cost arising from the acquisition of a property.
alternative label: land cost
term tracker annotation: issue: https://github.com/OpenEnergyPlatform/ontology/issues/891 pull request: https://github.com/OpenEnergyPlatform/ontology/pull/1022 Reformulate definition to singular: issue: https://github.com/OpenEnergyPlatform/ontology/issues/1257 pull request: https://github.com/OpenEnergyPlatform/ontology/pull/1260 make subclass of process attribute issue: https://github.com/OpenEnergyPlatform/ontology/issues/1914 pull request: https://github.com/OpenEnergyPlatform/ontology/pull/1999

decommissioning cost
type: Class
subclass of: investment cost
definition: Decommissioning costs are investment costs arising from the decommissioning of a technological device at the end of its lifetime.
alternative label: Stilllegungskosten @de
term tracker annotation: issue: https://github.com/OpenEnergyPlatform/ontology/issues/891 pull request: https://github.com/OpenEnergyPlatform/ontology/pull/1022 make subclass of process attribute issue: https://github.com/OpenEnergyPlatform/ontology/issues/1914 pull request: https://github.com/OpenEnergyPlatform/ontology/pull/1999

delivery cost
type: Class
subclass of: cost
definition: A delivery cost is a cost for a product or service that refers to the total unit cost of a product or commodity delivered to a certain market, city or customer. It is normally composed of all associated transport costs and the unit cost of production for that product.
alternative label: Lieferkosten @de
term tracker annotation: issue: https://github.com/OpenEnergyPlatform/ontology/issues/891 pull request: https://github.com/OpenEnergyPlatform/ontology/pull/1022 Reformulate definition to singular: issue: https://github.com/OpenEnergyPlatform/ontology/issues/1257 pull request: https://github.com/OpenEnergyPlatform/ontology/pull/1260 make subclass of process attribute issue: https://github.com/OpenEnergyPlatform/ontology/issues/1914 pull request: https://github.com/OpenEnergyPlatform/ontology/pull/1999

life time
type: Class
subclass of: time span
subclass of: Restriction
  on property: quantity value of
  some values from: artificial object
definition: A life time is a time span of an artificial object that measures the time during which the artificial object exists.
alternative label: Lebensdauer @de
term tracker annotation: issue: https://github.com/OpenEnergyPlatform/ontology/issues/894 pull request: https://github.com/OpenEnergyPlatform/ontology/pull/1026 rework module structure issue: https://github.com/OpenEnergyPlatform/ontology/issues/1592 pull request: https://github.com/OpenEnergyPlatform/ontology/pull/1652

construction time
type: Class
subclass of: time span
subclass of: Restriction
  on property: quantity value of
  some values from: artificial object
definition: A construction time is a time span that measures the time that is needed to construct an artificial object.
alternative label: Bauzeit @de
term tracker annotation: issue: https://github.com/OpenEnergyPlatform/ontology/issues/894 pull request: https://github.com/OpenEnergyPlatform/ontology/pull/1026 rework module structure issue: https://github.com/OpenEnergyPlatform/ontology/issues/1592 pull request: https://github.com/OpenEnergyPlatform/ontology/pull/1652

decommissioning time
type: Class
subclass of: time span
subclass of: Restriction
  on property: quantity value of
  some values from: artificial object
definition: A decommissioning time is a time span that measures the time that is needed to decommission an artificial object.
alternative label: Stilllegungszeitraum @de
term tracker annotation: issue: https://github.com/OpenEnergyPlatform/ontology/issues/894 pull request: https://github.com/OpenEnergyPlatform/ontology/pull/1026 rework module structure issue: https://github.com/OpenEnergyPlatform/ontology/issues/1592 pull request: https://github.com/OpenEnergyPlatform/ontology/pull/1652

operational life time
type: Class
subclass of: life time
definition: An operational life time is the lifetime of an artificial object. It is measured from the end of construction time to the start of decommissioning time.
term tracker annotation: issue: https://github.com/OpenEnergyPlatform/ontology/issues/894 pull request: https://github.com/OpenEnergyPlatform/ontology/pull/1026 rework module structure issue: https://github.com/OpenEnergyPlatform/ontology/issues/1592 pull request: https://github.com/OpenEnergyPlatform/ontology/pull/1652

social cost of emission
type: Class
subclass of: cost
definition: Social cost of emission is the cost the society bears for an emission value.
term tracker annotation: issue: https://github.com/OpenEnergyPlatform/ontology/issues/958 pull request: https://github.com/OpenEnergyPlatform/ontology/pull/1034 rework module structure issue: https://github.com/OpenEnergyPlatform/ontology/issues/1592 pull request: https://github.com/OpenEnergyPlatform/ontology/pull/1652 make subclass of process attribute issue: https://github.com/OpenEnergyPlatform/ontology/issues/1914 pull request: https://github.com/OpenEnergyPlatform/ontology/pull/1999

copyright licence
type: Class
subclass of: licence
definition: A copyright licence is a licence that states the ownership and contractually sets the rights and obligations to use, copy, and distribute a creative work.
alternative label: Urheberrechtslizenz @de
alternative label: copyright license
term tracker annotation: add relation has copyright license issue https://github.com/OpenEnergyPlatform/ontology/issues/1061 pull request https://github.com/OpenEnergyPlatform/ontology/pull/1090 Harmonise use of British English: issue: https://github.com/OpenEnergyPlatform/ontology/issues/1275 pull request: https://github.com/OpenEnergyPlatform/ontology/pull/1547 rework module structure issue: https://github.com/OpenEnergyPlatform/ontology/issues/1592 pull request: https://github.com/OpenEnergyPlatform/ontology/pull/1652

data licence
type: Class
subclass of: licence
definition: A data licence is a licence that determines ownership, database protection, and permissions for data.
alternative label: Datenlizenz @de
alternative label: data license
term tracker annotation: issue https://github.com/OpenEnergyPlatform/ontology/issues/1061 pull request https://github.com/OpenEnergyPlatform/ontology/pull/1090 Harmonise use of British English: issue: https://github.com/OpenEnergyPlatform/ontology/issues/1275 pull request: https://github.com/OpenEnergyPlatform/ontology/pull/1547 rework module structure issue: https://github.com/OpenEnergyPlatform/ontology/issues/1592 pull request: https://github.com/OpenEnergyPlatform/ontology/pull/1652

software licence
type: Class
subclass of: copyright licence
definition: A software licence is a copyright licence that determines ownership and permissions for software, code, or models.
alternative label: Softwarelizenz @de
alternative label: software license
term tracker annotation: issue https://github.com/OpenEnergyPlatform/ontology/issues/1061 pull request https://github.com/OpenEnergyPlatform/ontology/pull/1090 Harmonise use of British English: issue: https://github.com/OpenEnergyPlatform/ontology/issues/1275 pull request: https://github.com/OpenEnergyPlatform/ontology/pull/1547 rework module structure issue: https://github.com/OpenEnergyPlatform/ontology/issues/1592 pull request: https://github.com/OpenEnergyPlatform/ontology/pull/1652

Axiom
annotated source: software licence
annotated property: subClassOf
annotated target: copyright licence
term tracker annotation: fix wrong classification issue: https://github.com/OpenEnergyPlatform/ontology/issues/1153 pull request: https://github.com/OpenEnergyPlatform/ontology/pull/1163

fissile material entity
type: Class
equivalent class: Class
  intersection of: material entity
  intersection of: Restriction
    on property: has disposition
    some values from: nuclear energy carrier disposition
subclass of: material entity
definition: A fissile material entity is a material entity that has the disposition to carry nuclear (binding) energy.
term tracker annotation: issue: https://github.com/OpenEnergyPlatform/ontology/issues/1159 pull request: https://github.com/OpenEnergyPlatform/ontology/pull/1190 Fix spelling of label: https://github.com/OpenEnergyPlatform/ontology/pull/1196

tangential proper part
type: Class
subclass of: fiat object part
definition: A tangential proper part is a fiat object part of an entity which shares a boundary with that entity.
definition source: https://en.wikipedia.org/wiki/Region_connection_calculus
term tracker annotation: issue: https://github.com/OpenEnergyPlatform/ontology/issues/1074 pull request: https://github.com/OpenEnergyPlatform/ontology/pull/1209

surface
type: Class
subclass of: tangential proper part
subclass of: Restriction
  on property: part of
  some values from: object
definition: A surface is a tangential proper part of an object that extends in two dimensions.
alternative label: Oberfläche @de
term tracker annotation: issue: https://github.com/OpenEnergyPlatform/ontology/issues/1074 pull request: https://github.com/OpenEnergyPlatform/ontology/pull/1209

solar radiation receiving surface
type: Class
equivalent class: Class
  intersection of: surface
  intersection of: Restriction
    on property: has energy input
    some values from: solar energy
subclass of: surface
definition: A solar radiation receiving surface is a surface that is receiving solar energy via solar radiation.
term tracker annotation: issue: https://github.com/OpenEnergyPlatform/ontology/issues/1074 pull request: https://github.com/OpenEnergyPlatform/ontology/pull/1209

solar receiving object
type: Class
equivalent class: Class
  intersection of: artificial object
  intersection of: Restriction
    on property: has part
    some values from: solar radiation receiving surface
subclass of: artificial object
subclass of: Restriction
  on property: has energy output
  some values from: waste thermal energy
definition: A solar receiving object is an artificial object that has a solar radiation receiving surface as part.
term tracker annotation: issue: https://github.com/OpenEnergyPlatform/ontology/issues/1074 pull request: https://github.com/OpenEnergyPlatform/ontology/pull/1228 issue: https://github.com/OpenEnergyPlatform/ontology/issues/1265 pull request: https://github.com/OpenEnergyPlatform/ontology/pull/1359

import
type: Class
subclass of: process
subclass of: Class
  union of: Restriction
    on property: has participant
    some values from: good
  union of: Restriction
    on property: causally upstream of or within
    some values from: service
definition: Import is the process of purchasing goods or services abroad and their delivery to the domestic market.
alternative label: Import @de
term tracker annotation: add class issue: https://github.com/OpenEnergyPlatform/ontology/issues/998 pull request: https://github.com/OpenEnergyPlatform/ontology/pull/1221 add 'has participant axiom': issue: https://github.com/OpenEnergyPlatform/ontology/issues/1327 pull request: https://github.com/OpenEnergyPlatform/ontology/pull/1395 rework module structure issue: https://github.com/OpenEnergyPlatform/ontology/issues/1592 pull request: https://github.com/OpenEnergyPlatform/ontology/pull/1652

export
type: Class
subclass of: process
subclass of: Class
  union of: Restriction
    on property: has participant
    some values from: good
  union of: Restriction
    on property: causally upstream of or within
    some values from: service
definition: Export is the process of selling goods or services abroad and their delivery to a foreign market.
alternative label: Export @de
term tracker annotation: add class issue: https://github.com/OpenEnergyPlatform/ontology/issues/998 pull request: https://github.com/OpenEnergyPlatform/ontology/pull/1221 add 'has participant axiom': issue: https://github.com/OpenEnergyPlatform/ontology/issues/1327 pull request: https://github.com/OpenEnergyPlatform/ontology/pull/1395 rework module structure issue: https://github.com/OpenEnergyPlatform/ontology/issues/1592 pull request: https://github.com/OpenEnergyPlatform/ontology/pull/1652

electrical energy amount value
type: Class
subclass of: energy value
definition: An electrical energy amount value is an energy amount value that measures a quantity of electrical energy.
term tracker annotation: issue: https://github.com/OpenEnergyPlatform/ontology/issues/998 pull request: https://github.com/OpenEnergyPlatform/ontology/pull/1221 rework module structure issue: https://github.com/OpenEnergyPlatform/ontology/issues/1592 pull request: https://github.com/OpenEnergyPlatform/ontology/pull/1652

electricity import value
type: Class
subclass of: electrical energy amount value
subclass of: Restriction
  on property: is about
  some values from: electricity import
definition: An electricity import value is an electrical energy amount value that measures the import of electrical energy.
term tracker annotation: issue: https://github.com/OpenEnergyPlatform/ontology/issues/998 pull request: https://github.com/OpenEnergyPlatform/ontology/pull/1221 rework module structure issue: https://github.com/OpenEnergyPlatform/ontology/issues/1592 pull request: https://github.com/OpenEnergyPlatform/ontology/pull/1652 Fix definition: https://github.com/OpenEnergyPlatform/ontology/issues/1863 https://github.com/OpenEnergyPlatform/ontology/pull/1864

electricity export value
type: Class
subclass of: electrical energy amount value
subclass of: Restriction
  on property: is about
  some values from: electricity export
definition: An electricity export value is an electrical energy amount value that measures the export of electrical energy.
term tracker annotation: issue: https://github.com/OpenEnergyPlatform/ontology/issues/998 pull request: https://github.com/OpenEnergyPlatform/ontology/pull/1221 rework module structure issue: https://github.com/OpenEnergyPlatform/ontology/issues/1592 pull request: https://github.com/OpenEnergyPlatform/ontology/pull/1652 Fix definition: https://github.com/OpenEnergyPlatform/ontology/issues/1863 https://github.com/OpenEnergyPlatform/ontology/pull/1864

electricity import
type: Class
subclass of: import
subclass of: Restriction
  on property: has participant
  some values from: electrical energy
subclass of: Restriction
  on property: has quantity value
  some values from: electricity import value
definition: Electricity import is the import of electrical energy.
alternative label: Stromimport @de
term tracker annotation: add class issue: https://github.com/OpenEnergyPlatform/ontology/issues/998 pull request: https://github.com/OpenEnergyPlatform/ontology/pull/1221 add 'has participant axiom': issue: https://github.com/OpenEnergyPlatform/ontology/issues/1327 pull request: https://github.com/OpenEnergyPlatform/ontology/pull/1395 rework module structure issue: https://github.com/OpenEnergyPlatform/ontology/issues/1592 pull request: https://github.com/OpenEnergyPlatform/ontology/pull/1652

electricity export
type: Class
subclass of: export
subclass of: Restriction
  on property: has participant
  some values from: electrical energy
subclass of: Restriction
  on property: has quantity value
  some values from: electricity export value
definition: Electricity export is the export of electrical energy.
alternative label: Stromexport @de
term tracker annotation: add class issue: https://github.com/OpenEnergyPlatform/ontology/issues/998 pull request: https://github.com/OpenEnergyPlatform/ontology/pull/1221 add 'has participant axiom': issue: https://github.com/OpenEnergyPlatform/ontology/issues/1327 pull request: https://github.com/OpenEnergyPlatform/ontology/pull/1395 rework module structure issue: https://github.com/OpenEnergyPlatform/ontology/issues/1592 pull request: https://github.com/OpenEnergyPlatform/ontology/pull/1652

sirup
type: Class
subclass of: portion of matter
subclass of: Restriction
  on property: has part
  some values from: water
subclass of: Restriction
  on property: has state of matter
  has value: OEO_00000256
definition: A sirup is a portion of matter that consists mainly of water and sugar. It has a liquid state of matter.
alternative label: Sirup @de
alternative label: sirop
alternative label: syrup
term tracker annotation: pull request: https://github.com/OpenEnergyPlatform/ontology/pull/1221

scenario bundle
type: Class
subclass of: information content entity
subclass of: Restriction
  on property: is about
  some values from: scenario study
definition: A scenario bundle is an information content entity that connects information about a scenario study and the associated scenario projections on the OEP via the OEKG.
term tracker annotation: issue: https://github.com/OpenEnergyPlatform/ontology/issues/1343 pull request: https://github.com/OpenEnergyPlatform/ontology/pull/1429

target driven scenario
type: Class
equivalent class: Class
  intersection of: scenario
  intersection of: Restriction
    on property: is about
    some values from: legal target description
subclass of: scenario
definition: A target driven scenario is a scenario that contains certain target constraints/ statements that in a possible future shall be realized. The path how the targets will be met is not predefined in the scenario.
alternative label: Zielszenario @de
term tracker annotation: issue: https://github.com/OpenEnergyPlatform/ontology/issues/1110 pull request: https://github.com/OpenEnergyPlatform/ontology/pull/1459 make equivalent issue: https://github.com/OpenEnergyPlatform/ontology/issues/1329 pull request: https://github.com/OpenEnergyPlatform/ontology/pull/1642

explorative scenario
type: Class
subclass of: scenario
definition: An explorative scenario is a scenario that contains certain constraints / statements regarding measures that are taken in the near future / today to explore where these measures will lead to in a later future. The later future is not predefined in the scenario.
alternative label: exploratives Szenario @de
term tracker annotation: issue: https://github.com/OpenEnergyPlatform/ontology/issues/1110 pull request: https://github.com/OpenEnergyPlatform/ontology/pull/1459 move to oeo-shared issue: https://github.com/OpenEnergyPlatform/ontology/issues/1329 pull request: https://github.com/OpenEnergyPlatform/ontology/pull/1642 rework module structure issue: https://github.com/OpenEnergyPlatform/ontology/issues/1592 pull request: https://github.com/OpenEnergyPlatform/ontology/pull/1652

compressed-air energy storage unit
type: Class
subclass of: energy storage unit
subclass of: Restriction
  on property: uses
  some values from: compressed air
definition: A compressed-air energy storage unit is an energy storage unit that uses compressed air.
term tracker annotation: issue: https://github.com/OpenEnergyPlatform/ontology/issues/1495 pull request: https://github.com/OpenEnergyPlatform/ontology/pull/1499

propulsion
type: Class
equivalent class: Class
  intersection of: Restriction
    on property: has occurrent part
    some values from: Class
      intersection of: MENO_01013
      intersection of: Restriction
        on property: negatively regulates characteristic
        some values from: energy
  intersection of: Restriction
    on property: has occurrent part
    some values from: Class
      intersection of: MENO_01014
      intersection of: Restriction
        on property: positively regulates characteristic
        some values from: translational energy
subclass of: energy transformation
definition: Propulsion is an energy transformation that converts other forms of energy to translational kinetic energy.
alternative label: Antrieb @de
alternative label: energy-to-motion-process
term tracker annotation: issue: https://github.com/OpenEnergyPlatform/ontology/issues/1528 pull request: https://github.com/OpenEnergyPlatform/ontology/pull/1541 replace energy-participant axioms and adjust definition issue: https://github.com/OpenEnergyPlatform/ontology/issues/2053 pull request: https://github.com/OpenEnergyPlatform/ontology/pull/2120

climate system
type: Class
subclass of: system
definition: A climate system is a system that has five interacting components: the atmosphere (air), the hydrosphere (water), the cryosphere (ice and permafrost), the lithosphere (earth's upper rocky layer) and the biosphere (living things).
term tracker annotation: issue: https://github.com/OpenEnergyPlatform/ontology/issues/1540 pull request: https://github.com/OpenEnergyPlatform/ontology/pull/1542 move to oeo-share issue: https://github.com/OpenEnergyPlatform/ontology/issues/1329 pull request: https://github.com/OpenEnergyPlatform/ontology/pull/1615 rework module structure issue: https://github.com/OpenEnergyPlatform/ontology/issues/1592 pull request: https://github.com/OpenEnergyPlatform/ontology/pull/1652 Convert to skos:closeMatch issue: https://github.com/OpenEnergyPlatform/ontology/issues/636 pull request: https://github.com/OpenEnergyPlatform/ontology/pull/1879

electrical energy share
type: Class
subclass of: process attribute
subclass of: Restriction
  on property: has quantity value
  some values from: electrical energy share value
definition: Electrical energy share is a process attribute that indicates the fraction of electrical energy related to the total energy of an energy generation or consumption process.
alternative label: degree of electrification
oekg annotation: study descriptor
term tracker annotation: issue: https://github.com/OpenEnergyPlatform/ontology/issues/1434 pull request: https://github.com/OpenEnergyPlatform/ontology/pull/1561 add oekg annotation issue: https://github.com/OpenEnergyPlatform/ontology/issues/1529 pull request: https://github.com/OpenEnergyPlatform/ontology/pull/1897

renewable energy share value
type: Class
subclass of: fraction value
subclass of: Restriction
  on property: quantity value of
  some values from: renewable energy share
definition: A renewable energy share value is a fraction value that quantifies a share of renewable energy (RE-share)
alternative label: RE share value
term tracker annotation: issue: https://github.com/OpenEnergyPlatform/ontology/issues/1434 pull request: https://github.com/OpenEnergyPlatform/ontology/pull/1561

electrical energy share value
type: Class
subclass of: fraction value
subclass of: Restriction
  on property: quantity value of
  some values from: electrical energy share
definition: An electrical energy share value is a fraction value that quantifies the share of electrical energy (degree of electrification).
alternative label: renewable energy share value
term tracker annotation: issue: https://github.com/OpenEnergyPlatform/ontology/issues/1434 pull request: https://github.com/OpenEnergyPlatform/ontology/pull/1561

material transformation
type: Class
equivalent class: Class
  intersection of: transformation
  intersection of: Restriction
    on property: has physical input
    some values from: material entity
  intersection of: Restriction
    on property: has physical output
    some values from: material entity
subclass of: transformation
definition: A material transformation is a transformation in which one or more input material entities are, at least partially, physically changed and result in output material entites.
term tracker annotation: class added: issue: https://github.com/OpenEnergyPlatform/ontology/issues/1526 pull request: https://github.com/OpenEnergyPlatform/ontology/pull/1575 rework module structure issue: https://github.com/OpenEnergyPlatform/ontology/issues/1592 pull request: https://github.com/OpenEnergyPlatform/ontology/pull/1652

energy technology
type: Class
subclass of: technology
subclass of: Restriction
  on property: is about
  some values from: Class
    intersection of: energy transformation unit
    intersection of: Restriction
      on property: participates in
      some values from: energy transformation
definition: An energy technology is a technology that describes how to combine energy transformation units, energy transformations, energy carriers and energy in a specific way.
term tracker annotation: issue: https://github.com/OpenEnergyPlatform/ontology/issues/1572 pull request: https://github.com/OpenEnergyPlatform/ontology/pull/1591 rework module structure issue: https://github.com/OpenEnergyPlatform/ontology/issues/1592 pull request: https://github.com/OpenEnergyPlatform/ontology/pull/1652

geothermal heat technology
type: Class
subclass of: heat generation technology
subclass of: Restriction
  on property: is about
  some values from: Class
    intersection of: OEO_00310017
    intersection of: Restriction
      on property: participates in
      some values from: geothermal heat transfer
definition: A geothermal heat technology is a heat generation technology that describes how to combine geothermal heat units, geothermal heat transfer processes, energy carriers and energy in a specific way.
term tracker annotation: issue: https://github.com/OpenEnergyPlatform/ontology/issues/1572 pull request: https://github.com/OpenEnergyPlatform/ontology/pull/1610

solar thermal heat technology
type: Class
subclass of: heat generation technology
subclass of: Restriction
  on property: is about
  some values from: Class
    intersection of: OEO_00310048
    intersection of: Restriction
      on property: participates in
      some values from: solar thermal energy transformation
definition: A solar thermal heat technology is a heat generation technology that describes how to combine solar heat units, solar thermal energy transformation processes, energy carriers and energy in a specific way.
term tracker annotation: issue: https://github.com/OpenEnergyPlatform/ontology/issues/1572 pull request: https://github.com/OpenEnergyPlatform/ontology/pull/1610

heat generation technology
type: Class
subclass of: energy technology
subclass of: Restriction
  on property: is about
  some values from: Class
    intersection of: OEO_00310008
    intersection of: Restriction
      on property: participates in
      some values from: heat gain process
definition: A heat generation technology is an energy technology that describes how to combine heat generating units, heat generation processes, energy carriers and energy in a specific way.
term tracker annotation: issue: https://github.com/OpenEnergyPlatform/ontology/issues/1572 pull request: https://github.com/OpenEnergyPlatform/ontology/pull/1610

policy scenario
type: Class
equivalent class: Class
  intersection of: explorative scenario
  intersection of: Restriction
    on property: is about
    some values from: Class
      union of: transformative measure
      union of: policy instrument
subclass of: explorative scenario
definition: A policy scenario is a scenario in which certain policy instruments or transformative measures and their impacts are assessed.
term tracker annotation: issue: https://github.com/OpenEnergyPlatform/ontology/issues/1329 pull request: https://github.com/OpenEnergyPlatform/ontology/pull/1614 pull request: https://github.com/OpenEnergyPlatform/ontology/pull/1642 rework module structure issue: https://github.com/OpenEnergyPlatform/ontology/issues/1592 pull request: https://github.com/OpenEnergyPlatform/ontology/pull/1652

without measures scenario
type: Class
subclass of: policy scenario
definition: A without measures scenario (WOM) is a policy scenario that excludes all policy instruments and transformative measures which are planned, adopted or implemented.
alternative label: WOM scenario
alternative label: baseline scenario
definition source: Derived from https://eur-lex.europa.eu/legal-content/EN/TXT/HTML/?uri=CELEX:32018R1999&from=EN#d1e968-1-1 Article 2
term tracker annotation: issue: https://github.com/OpenEnergyPlatform/ontology/issues/1329 pull request: https://github.com/OpenEnergyPlatform/ontology/pull/1614 rework module structure issue: https://github.com/OpenEnergyPlatform/ontology/issues/1592 pull request: https://github.com/OpenEnergyPlatform/ontology/pull/1652

with existing measures scenario
type: Class
subclass of: policy scenario
definition: A with existing measures scenario (WEM) is a policy scenario that includes policy instruments and transformative measures that have been adopted and implemented.
alternative label: WEM scenario
alternative label: baseline scenario
definition source: Derived from https://eur-lex.europa.eu/legal-content/EN/TXT/HTML/?uri=CELEX:32018R1999&from=EN#d1e968-1-1 Article 2
term tracker annotation: issue: https://github.com/OpenEnergyPlatform/ontology/issues/1329 pull request: https://github.com/OpenEnergyPlatform/ontology/pull/1614 rework module structure issue: https://github.com/OpenEnergyPlatform/ontology/issues/1592 pull request: https://github.com/OpenEnergyPlatform/ontology/pull/1652

with additional measures scenario
type: Class
subclass of: policy scenario
definition: A with additional measures scenario (WAM) is a policy scenario that includes policy instruments and transformative measures which have been adopted and implemented to mitigate climate change or meet energy objectives, as well as policy instruments and transformative measures which are planned for that purpose.
alternative label: WAM scenario
definition source: Derived from https://eur-lex.europa.eu/legal-content/EN/TXT/HTML/?uri=CELEX:32018R1999&from=EN#d1e968-1-1 Article 2
term tracker annotation: issue: https://github.com/OpenEnergyPlatform/ontology/issues/1329 pull request: https://github.com/OpenEnergyPlatform/ontology/pull/1614 rework module structure issue: https://github.com/OpenEnergyPlatform/ontology/issues/1592 pull request: https://github.com/OpenEnergyPlatform/ontology/pull/1652

reference role
type: Class
subclass of: role
subclass of: Restriction
  on property: characteristic of
  some values from: OEO_00360020
definition: A role of an information content entity, that indicates a benchmark, e.g. in a comparison.
editor note: Although contradicting to BFO2, we add the reference role to the generically dependent "information content entity", aware of the ongoing discussion.
term tracker annotation: issue: https://github.com/OpenEnergyPlatform/ontology/issues/1329 pull request: https://github.com/OpenEnergyPlatform/ontology/pull/1614 rework module structure issue: https://github.com/OpenEnergyPlatform/ontology/issues/1592 pull request: https://github.com/OpenEnergyPlatform/ontology/pull/1652 replaced 'has bearer' with 'characteristic of' issue: https://github.com/OpenEnergyPlatform/ontology/issues/1907 pull request: https://github.com/OpenEnergyPlatform/ontology/pull/1928

reference scenario
type: Class
equivalent class: Class
  intersection of: scenario
  intersection of: Restriction
    on property: has role
    some values from: reference role
subclass of: scenario
definition: A reference scenario is a scenario that is used as a reference, e.g. in a scenario comparison. It has the reference role.
term tracker annotation: issue: https://github.com/OpenEnergyPlatform/ontology/issues/1329 pull request: https://github.com/OpenEnergyPlatform/ontology/pull/1614 rework module structure issue: https://github.com/OpenEnergyPlatform/ontology/issues/1592 pull request: https://github.com/OpenEnergyPlatform/ontology/pull/1652

greenhouse gas emission scenario
type: Class
equivalent class: Class
  intersection of: scenario
  intersection of: Restriction
    on property: is about
    some values from: greenhouse gas emission
subclass of: emission scenario
definition: A greenhouse gas emission scenario is an emission scenario that describes a possible greenhouse gas emission trajectory.
term tracker annotation: issue: https://github.com/OpenEnergyPlatform/ontology/issues/1329 pull request: https://github.com/OpenEnergyPlatform/ontology/pull/1615 rework module structure issue: https://github.com/OpenEnergyPlatform/ontology/issues/1592 pull request: https://github.com/OpenEnergyPlatform/ontology/pull/1652

CO2 emission scenario
type: Class
equivalent class: Class
  intersection of: scenario
  intersection of: Restriction
    on property: is about
    some values from: OEO_00260007
subclass of: emission scenario
definition: A CO2 emission scenario is an emission scenario that describes a possible CO2 emission trajectory.
term tracker annotation: issue: https://github.com/OpenEnergyPlatform/ontology/issues/1329 pull request: https://github.com/OpenEnergyPlatform/ontology/pull/1615 rework module structure issue: https://github.com/OpenEnergyPlatform/ontology/issues/1592 pull request: https://github.com/OpenEnergyPlatform/ontology/pull/1652

sufficiency scenario
type: Class
equivalent class: Class
  intersection of: scenario
  intersection of: Restriction
    on property: is about
    some values from: sufficiency
subclass of: scenario
definition: A sufficiency scenario is a scenario that comprises sufficiency strategies.
term tracker annotation: issue: https://github.com/OpenEnergyPlatform/ontology/issues/1329 pull request: https://github.com/OpenEnergyPlatform/ontology/pull/1642 Make equivalent class issue: https://github.com/OpenEnergyPlatform/ontology/issues/1553 pull request: https://github.com/OpenEnergyPlatform/ontology/pull/1648

power-to-fuel technology
type: Class
subclass of: energy technology
subclass of: Restriction
  on property: is about
  some values from: Class
    intersection of: OEO_00330009
    intersection of: Restriction
      on property: participates in
      some values from: OEO_00330007
definition: A power-to-fuel technology is an energy technology that describes how to combine power-to-fuel systems in power-to-fuel processes.
alternative label: p2x technology
alternative label: power-to-x technology
alternative label: ptx technology
term tracker annotation: issue: https://github.com/OpenEnergyPlatform/ontology/issues/1572 pull request: https://github.com/OpenEnergyPlatform/ontology/pull/1647

power-to-gas technology
type: Class
subclass of: power-to-fuel technology
subclass of: Restriction
  on property: is about
  some values from: Class
    intersection of: power-to-gas system
    intersection of: Restriction
      on property: participates in
      some values from: power-to-gas process
definition: A power-to-gas technology is a power-to-fuel technology that describes how to combine power-to-gas systems in power-to-gas processes.
term tracker annotation: issue: https://github.com/OpenEnergyPlatform/ontology/issues/1572 pull request: https://github.com/OpenEnergyPlatform/ontology/pull/1647

power-to-ammonia technology
type: Class
subclass of: power-to-gas technology
subclass of: Restriction
  on property: is about
  some values from: Class
    intersection of: OEO_00330010
    intersection of: Restriction
      on property: participates in
      some values from: power-to-ammonia process
definition: A power-to-ammonia technology is an power-to-gas technology that describes how to combine power-to-ammonia systems in power-to-ammonia processes.
term tracker annotation: issue: https://github.com/OpenEnergyPlatform/ontology/issues/1572 pull request: https://github.com/OpenEnergyPlatform/ontology/pull/1647

power-to-methane technology
type: Class
subclass of: power-to-gas technology
subclass of: Restriction
  on property: is about
  some values from: Class
    intersection of: power-to-methane system
    intersection of: Restriction
      on property: participates in
      some values from: power-to-methane process
definition: A power-to-methane technology is an power-to-gas technology that describes how to combine power-to-methane systems in power-to-methane processes.
term tracker annotation: issue: https://github.com/OpenEnergyPlatform/ontology/issues/1572 pull request: https://github.com/OpenEnergyPlatform/ontology/pull/1647

power-to-liquid technology
type: Class
subclass of: power-to-fuel technology
subclass of: Restriction
  on property: is about
  some values from: Class
    intersection of: power-to-liquid system
    intersection of: Restriction
      on property: participates in
      some values from: OEO_00330008
definition: A power-to-liquid technology is an power-to-fuel technology that describes how to combine power-to-liquid systems in power-to-liquid processes.
term tracker annotation: issue: https://github.com/OpenEnergyPlatform/ontology/issues/1572 pull request: https://github.com/OpenEnergyPlatform/ontology/pull/1647

model
type: Class
equivalent class: Class
  intersection of: continuant
  intersection of: Restriction
    on property: has role
    some values from: model role
subclass of: continuant
subclass of: Restriction
  on property: models
  some values from: process
subclass of: Restriction
  on property: models
  some values from: system
definition: A model is a continuant to represent a system and its behaviours in a simplified or idealised way.
alternative label: Modell @de
term tracker annotation: issue:https://github.com/OpenEnergyPlatform/ontology/issues/1444 pull request: https://github.com/OpenEnergyPlatform/ontology/pull/1707 Add axioms issue:https://github.com/OpenEnergyPlatform/ontology/issues/1060 pull request: https://github.com/OpenEnergyPlatform/ontology/pull/2007 Remove uncertainty axiom and add inverse to uncertainty instead issue:https://github.com/OpenEnergyPlatform/ontology/issues/1989 pull request: https://github.com/OpenEnergyPlatform/ontology/pull/2012

model role
type: Class
subclass of: role
subclass of: Restriction
  on property: role of
  some values from: model
definition: A model role is a a role of a continuant for representing a system and its behaviours in a simplified or idealised way.
term tracker annotation: issue: https://github.com/OpenEnergyPlatform/ontology/issues/1444 pull request: https://github.com/OpenEnergyPlatform/ontology/pull/1707 add axiom: issue: https://github.com/OpenEnergyPlatform/ontology/issues/1844 pull request: https://github.com/OpenEnergyPlatform/ontology/pull/1852

mathematical model
type: Class
subclass of: information content entity
subclass of: Restriction
  on property: has role
  some values from: model role
definition: A mathematical model is a information content artifact that represents a system and its behaviours mathematically.
term tracker annotation: issue:https://github.com/OpenEnergyPlatform/ontology/issues/1444 pull request: https://github.com/OpenEnergyPlatform/ontology/pull/1707

scale model
type: Class
subclass of: model
definition: A scale model is model comprising of a spatial pattern of components arranged in such a way for them to represent a system.
term tracker annotation: issue:https://github.com/OpenEnergyPlatform/ontology/issues/1444 pull request: https://github.com/OpenEnergyPlatform/ontology/pull/1707

electrical energy storage object
type: Class
equivalent class: Class
  intersection of: energy storage object
  intersection of: Restriction
    on property: has function
    some values from: electrical energy storage function
subclass of: energy storage object
definition: An electrical energy storage object is an energy storage object that has the function to store electrical energy.
comment: The electrical energy storage object is being charged with electrical energy and releases electrical energy during the decharging process. The stored energy within the object may appear in a different form of energy, though.
term tracker annotation: issue: https://github.com/OpenEnergyPlatform/ontology/issues/1572 pull request: https://github.com/OpenEnergyPlatform/ontology/pull/1728

chemical energy storage object
type: Class
equivalent class: Class
  intersection of: energy storage object
  intersection of: Restriction
    on property: has function
    some values from: chemical energy storage function
subclass of: energy storage object
definition: A chemical energy storage object is an energy storage object that has the function to store chemical energy.
term tracker annotation: issue: https://github.com/OpenEnergyPlatform/ontology/issues/1572 pull request: https://github.com/OpenEnergyPlatform/ontology/pull/1728

kinetic energy storage object
type: Class
equivalent class: Class
  intersection of: energy storage object
  intersection of: Restriction
    on property: has function
    some values from: kinetic energy storage function
subclass of: energy storage object
definition: A kinetic energy storage object is an energy storage object that has the function to store kinetic energy.
comment: The kinetic energy storage object is being charged with kinetic energy and releases kinetic energy during the decharging process. The stored energy within the object may appear in a different form of energy, though.
term tracker annotation: issue: https://github.com/OpenEnergyPlatform/ontology/issues/1572 pull request: https://github.com/OpenEnergyPlatform/ontology/pull/1728

thermal energy storage object
type: Class
equivalent class: Class
  intersection of: energy storage object
  intersection of: Restriction
    on property: has function
    some values from: thermal energy storage function
subclass of: energy storage object
definition: A thermal energy storage object is an energy storage object that has the function to store thermal energy.
comment: The thermal energy storage object is being charged with thermal energy and releases thermal energy during the decharging process. The stored energy within the object may appear in a different form of energy, though.
term tracker annotation: issue: https://github.com/OpenEnergyPlatform/ontology/issues/1572 pull request: https://github.com/OpenEnergyPlatform/ontology/pull/1728

energy storage technology
type: Class
subclass of: energy technology
subclass of: Restriction
  on property: is about
  some values from: Class
    intersection of: energy storage object
    intersection of: Restriction
      on property: participates in
      some values from: OEO_00320064
definition: An energy storage technology is an energy technology that describes how to combine energy storage objects and energy carriers in charging and decharging processes for the purpose of temporarily storing energy.
term tracker annotation: issue: https://github.com/OpenEnergyPlatform/ontology/issues/1572 pull request: https://github.com/OpenEnergyPlatform/ontology/pull/1728

electrical energy storage technology
type: Class
subclass of: energy storage technology
subclass of: Restriction
  on property: is about
  some values from: Class
    intersection of: electrical energy storage object
    intersection of: Restriction
      on property: participates in
      some values from: OEO_00320064
definition: An electrical energy storage technology is an energy storage technology that describes how to combine electrical energy storage objects and electrical energy in charging and decharging processes.
term tracker annotation: issue: https://github.com/OpenEnergyPlatform/ontology/issues/1572 pull request: https://github.com/OpenEnergyPlatform/ontology/pull/1728

kinetic energy storage technology
type: Class
subclass of: energy storage technology
subclass of: Restriction
  on property: is about
  some values from: Class
    intersection of: kinetic energy storage object
    intersection of: Restriction
      on property: participates in
      some values from: OEO_00320064
definition: An kinetic energy storage technology is an energy storage technology that describes how to combine kinetic energy storage objects and kinetic energy in charging and decharging processes.
term tracker annotation: issue: https://github.com/OpenEnergyPlatform/ontology/issues/1572 pull request: https://github.com/OpenEnergyPlatform/ontology/pull/1728

thermal energy storage technology
type: Class
subclass of: energy storage technology
subclass of: Restriction
  on property: is about
  some values from: Class
    intersection of: thermal energy storage object
    intersection of: Restriction
      on property: participates in
      some values from: OEO_00320064
definition: An thermal energy storage technology is an energy storage technology that describes how to combine thermal energy storage objects and thermal energy in charging and decharging processes.
term tracker annotation: issue: https://github.com/OpenEnergyPlatform/ontology/issues/1572 pull request: https://github.com/OpenEnergyPlatform/ontology/pull/1728

chemical energy storage technology
type: Class
subclass of: energy storage technology
subclass of: Restriction
  on property: is about
  some values from: Class
    intersection of: chemical energy storage object
    intersection of: Restriction
      on property: participates in
      some values from: OEO_00320064
definition: An chemical energy storage technology is an energy storage technology that describes how to combine chemical energy storage objects and chemical energy in charging and decharging processes.
term tracker annotation: issue: https://github.com/OpenEnergyPlatform/ontology/issues/1572 pull request: https://github.com/OpenEnergyPlatform/ontology/pull/1728

potential energy storage object
type: Class
equivalent class: Class
  intersection of: energy storage object
  intersection of: Restriction
    on property: has function
    some values from: potential energy storage function
subclass of: energy storage object
definition: A potential energy storage object is an energy storage object that has the function to store potential energy.
editor note: This object was introduce for the sake of completeness, but there is no actual use case seen at the moment.
term tracker annotation: issue: https://github.com/OpenEnergyPlatform/ontology/issues/1572 pull request: https://github.com/OpenEnergyPlatform/ontology/pull/1728

potential energy storage technology
type: Class
subclass of: energy storage technology
subclass of: Restriction
  on property: is about
  some values from: Class
    intersection of: potential energy storage object
    intersection of: Restriction
      on property: participates in
      some values from: OEO_00320064
definition: An potential energy storage technology is an energy storage technology that describes how to combine potential energy storage objects and potential energy in charging and decharging processes.
editor note: This technology was introduce for the sake of completeness, but there is no actual use case seen at the moment.
term tracker annotation: issue: https://github.com/OpenEnergyPlatform/ontology/issues/1572 pull request: https://github.com/OpenEnergyPlatform/ontology/pull/1728

study report due to legal obligation
type: Class
subclass of: study report
definition: A study report due to legal obligation is a study report that is created beacause of a legal obligation.
alternative label: legally mandatory study report
oekg annotation: study descriptor
term tracker annotation: issue: https://github.com/OpenEnergyPlatform/ontology/issues/1641 pull request: https://github.com/OpenEnergyPlatform/ontology/pull/1777 add oekg annotation issue: https://github.com/OpenEnergyPlatform/ontology/issues/1529 pull request: https://github.com/OpenEnergyPlatform/ontology/pull/1897

model coupling
type: Class
subclass of: model calculation
definition: Model coupling is a model calculation in which output data from one or more numerical computer models is used as input data for one or more other models.
oekg annotation: study descriptor
term tracker annotation: issue: https://github.com/OpenEnergyPlatform/ontology/issues/1521 pull request: https://github.com/OpenEnergyPlatform/ontology/pull/1842 add oekg annotation issue: https://github.com/OpenEnergyPlatform/ontology/issues/1529 pull request: https://github.com/OpenEnergyPlatform/ontology/pull/1897

sector coupling technology
type: Class
subclass of: technology
subclass of: Restriction
  on property: is about
  some values from: Class
    intersection of: artificial object
    intersection of: Restriction
      on property: participates in
      some values from: sector coupling
definition: A sector coupling technology is a technology that intends to connect processes from the electricity, heat, mobility or industrial sectors, as well as their infrastructures.
elucidation: The aim of sector coupling is usually an optimisation of an energy system (e.g. with respect to cost, environmental impact, sustainability and decarbonisation) by establishing energy flows across sectorial borders
term tracker annotation: issue: https://github.com/OpenEnergyPlatform/ontology/issues/1521 pull request: https://github.com/OpenEnergyPlatform/ontology/pull/1842

sector coupling
type: Class
subclass of: process
definition: Sector coupling is a process of connecting processes from the electricity, heat, mobility or industrial sectors as well as their infrastructures.
elucidation: The aim of sector coupling is usually an optimisation of an energy system (e.g. with respect to cost, environmental impact, sustainability and decarbonisation) by establishing energy flows across sectorial borders
oekg annotation: study descriptor
term tracker annotation: issue: https://github.com/OpenEnergyPlatform/ontology/issues/1521 pull request: https://github.com/OpenEnergyPlatform/ontology/pull/1842 add oekg annotation issue: https://github.com/OpenEnergyPlatform/ontology/issues/1529 pull request: https://github.com/OpenEnergyPlatform/ontology/pull/1897

system robustness
type: Class
subclass of: disposition
definition: System robustness is a disposition of a system that is designed or evolved in such a way as to be resistant to total failure despite partial damage or external changes.
term tracker annotation: issue: https://github.com/OpenEnergyPlatform/ontology/issues/1683 pull request: https://github.com/OpenEnergyPlatform/ontology/pull/1843

robust system scenario
type: Class
equivalent class: Class
  intersection of: explorative scenario
  intersection of: Restriction
    on property: is about
    some values from: Class
      intersection of: energy system
      intersection of: Restriction
        on property: has disposition
        some values from: system robustness
subclass of: explorative scenario
definition: A robust system scenario is an explorative scenario that describes an energy system that is designed to evolve in a robust way.
alternative label: issue: https://github.com/OpenEnergyPlatform/ontology/issues/1683 pull request: https://github.com/OpenEnergyPlatform/ontology/pull/1843
alternative label: robust investment decision
alternative label: robust transformation pathway

statistically robust scenario
type: Class
equivalent class: Class
  intersection of: scenario
  intersection of: Restriction
    on property: has role
    some values from: statistically robust
subclass of: scenario
description: A statistically robust scenario is a scenario that is the basis for statistically robust projection data.
term tracker annotation: issue: https://github.com/OpenEnergyPlatform/ontology/issues/1683 pull request: https://github.com/OpenEnergyPlatform/ontology/pull/1843

statistically robust
type: Class
subclass of: role
description: Statistically robust is a role of a scenario that is realized in scenario projections, model calculations or sensitivity analyses resulting in output data that is not greatly influenced by uncertainties in assumptions about the distribution of sample errors with respect to a (couple of) specific parameter(s).
term tracker annotation: issue: https://github.com/OpenEnergyPlatform/ontology/issues/1683 pull request: https://github.com/OpenEnergyPlatform/ontology/pull/1843

commissioning start
type: Class
subclass of: start time
definition: A commissioning start is a start time that indicates the beginning of a commissioning time.
term tracker annotation: issue: https://github.com/OpenEnergyPlatform/ontology/issues/1536 pull request: https://github.com/OpenEnergyPlatform/ontology/pull/1853

decommissioning start
type: Class
subclass of: start time
definition: A decommissioning start is a start time that indicates the beginning of a decommissioning time.
term tracker annotation: issue: https://github.com/OpenEnergyPlatform/ontology/issues/1536 pull request: https://github.com/OpenEnergyPlatform/ontology/pull/1853

decommissioning end
type: Class
subclass of: ending time
definition: A decommissioning end is an end time that indicates the beginning of a decommissioning time.
alternative label: decommissioning date
term tracker annotation: issue: https://github.com/OpenEnergyPlatform/ontology/issues/1536 pull request: https://github.com/OpenEnergyPlatform/ontology/pull/1853

commissioning end
type: Class
subclass of: ending time
definition: A commissioning end is an end time that indicates the beginning of a commissioning time.
alternative label: commissioning date
term tracker annotation: issue: https://github.com/OpenEnergyPlatform/ontology/issues/1536 pull request: https://github.com/OpenEnergyPlatform/ontology/pull/1853

relational quantity value
type: Class
subclass of: quantity value
definition: A relational quantity value is a quantity value that quantifies two or more quantities in relation to each other.
term tracker annotation: issue: https://github.com/OpenEnergyPlatform/ontology/issues/1875 pull request: https://github.com/OpenEnergyPlatform/ontology/pull/1878

monetary price
type: Class
subclass of: quality
subclass of: Restriction
  on property: quality of
  some values from: product
subclass of: Restriction
  on property: has quantity value
  some values from: monetary value
definition: A monetary price is a quality of a product that indicates the value in terms of the amount of money requested, expected, required or given in exchange for something else.
term tracker annotation: issue: https://github.com/OpenEnergyPlatform/ontology/issues/1902 pull request: https://github.com/OpenEnergyPlatform/ontology/pull/1915

translational energy
type: Class
subclass of: OEO_00230020
definition: Translational energy is the kinetic energy that a material entity possesses due to its translational motion.
alternative label: Translationsenergie @de
alternative label: translational kinetic energy
term tracker annotation: issue: https://github.com/OpenEnergyPlatform/ontology/issues/2136 pull request: https://github.com/OpenEnergyPlatform/ontology/pull/2145

motion
type: Class
subclass of: transformation
definition: Motion is an energy transformation where some kind of energy is transformed into kinetic energy, and the bearer of the kinetic energy changes its position or location.
alternative label: Bewegung @de
term tracker annotation: issue: https://github.com/OpenEnergyPlatform/ontology/issues/2136 pull request: https://github.com/OpenEnergyPlatform/ontology/pull/2145

power line support structure
type: Class
subclass of: material entity
definition: A power line support structure is an artificial object with the function of holding overhead power lines above the ground surface.
term tracker annotation: issue: https://github.com/OpenEnergyPlatform/ontology/issues/2154 pull request: https://github.com/OpenEnergyPlatform/ontology/pull/2191

electricity pylon
type: Class
subclass of: power line support structure
definition: An electricity pylon is a power line support structure that is designed to carry one or more overhead power lines, typically constructed as lattice or tubular tower made of steel.
alternative label: pylon
alternative label: transmission tower
definition source: https://en.wikipedia.org/wiki/Transmission_tower
term tracker annotation: issue: https://github.com/OpenEnergyPlatform/ontology/issues/2154 pull request: https://github.com/OpenEnergyPlatform/ontology/pull/2191

utility pole
type: Class
subclass of: power line support structure
definition: A utility pole is a power line support structure used to support one or more overhead power lines, typically constructed from wood, metal, concrete, or composite materials.
alternative label: power pole
alternative label: transmission pole
definition source: https://en.wikipedia.org/wiki/Utility_pole
term tracker annotation: issue: https://github.com/OpenEnergyPlatform/ontology/issues/2154 pull request: https://github.com/OpenEnergyPlatform/ontology/pull/2191

anthropogenic
type: Class
subclass of: origin
subclass of: Restriction
  on property: characteristic of
  some values from: Class
    union of: energy
    union of: portion of matter
definition: Anthropogenic is an origin of portions of matter or energies created by human activity.
alternative label: anthropogen @de
term tracker annotation: issue: https://github.com/OpenEnergyPlatform/ontology/issues/56 pull request: https://github.com/OpenEnergyPlatform/ontology/pull/234 include "or energies" issue: https://github.com/OpenEnergyPlatform/ontology/issues/728 pull request: https://github.com/OpenEnergyPlatform/ontology/pull/742 Axiomatise relations between origin, energy and portion of matter: issue: https://github.com/OpenEnergyPlatform/ontology/issues/1183 pull request: https://github.com/OpenEnergyPlatform/ontology/pull/1192 replaced 'has bearer' with 'characteristic of' issue: https://github.com/OpenEnergyPlatform/ontology/issues/1907 pull request: https://github.com/OpenEnergyPlatform/ontology/pull/1928

biogenic
type: Class
subclass of: origin
subclass of: Restriction
  on property: characteristic of
  some values from: portion of matter
disjoint with: fossil
definition: Biogenic is an origin of portions of matter made by or produced from life forms.
alternative label: biogen @de
term tracker annotation: issue: https://github.com/OpenEnergyPlatform/ontology/issues/108 pull request: https://github.com/OpenEnergyPlatform/ontology/pull/130 Axiomatise relations between origin, energy and portion of matter: issue: https://github.com/OpenEnergyPlatform/ontology/issues/1183 pull request: https://github.com/OpenEnergyPlatform/ontology/pull/1192 replaced 'has bearer' with 'characteristic of' issue: https://github.com/OpenEnergyPlatform/ontology/issues/1907 pull request: https://github.com/OpenEnergyPlatform/ontology/pull/1928

fossil
type: Class
subclass of: geogenic
subclass of: Restriction
  on property: characteristic of
  some values from: portion of matter
definition: Fossil is a geogenic origin of portions of matter created from organic material by geological processes lasting thousands or millions of years.
editor note: In real world, fossils are from biogenic origin some thousands or millions of years ago. However, this is irrelevant in the energy modelling domain.
alternative label: fossil @de
term tracker annotation: issue: https://github.com/OpenEnergyPlatform/ontology/issues/108 pull request: https://github.com/OpenEnergyPlatform/ontology/pull/130 Update definition and add disjoint: https://github.com/OpenEnergyPlatform/ontology/issues/872 https://github.com/OpenEnergyPlatform/ontology/pull/1048 Shift part of the definition into an editor note: Issue: https://github.com/OpenEnergyPlatform/ontology/issues/1180 Pull request: https://github.com/OpenEnergyPlatform/ontology/pull/1181 Axiomatise relations between origin, energy and portion of matter: issue: https://github.com/OpenEnergyPlatform/ontology/issues/1183 pull request: https://github.com/OpenEnergyPlatform/ontology/pull/1192 move to oeo-shared: issue: https://github.com/OpenEnergyPlatform/ontology/issues/1384 pull request: https://github.com/OpenEnergyPlatform/ontology/pull/1390 rework module structure issue: https://github.com/OpenEnergyPlatform/ontology/issues/1592 pull request: https://github.com/OpenEnergyPlatform/ontology/pull/1652 replaced 'has bearer' with 'characteristic of' issue: https://github.com/OpenEnergyPlatform/ontology/issues/1907 pull request: https://github.com/OpenEnergyPlatform/ontology/pull/1928

geogenic
type: Class
subclass of: origin
subclass of: Restriction
  on property: characteristic of
  some values from: Class
    union of: energy
    union of: portion of matter
definition: Geogenic is an origin of portions of matter or energies that are the result of geological processes.
alternative label: geogen @de
term tracker annotation: issue: https://github.com/OpenEnergyPlatform/ontology/issues/182 pull request: https://github.com/OpenEnergyPlatform/ontology/pull/237 Update definition: issue: https://github.com/OpenEnergyPlatform/ontology/issues/872 pull request: https://github.com/OpenEnergyPlatform/ontology/pull/1048 Axiomatise relations between origin, energy and portion of matter: issue: https://github.com/OpenEnergyPlatform/ontology/issues/1183 pull request: https://github.com/OpenEnergyPlatform/ontology/pull/1192 move to oeo-shared: issue: https://github.com/OpenEnergyPlatform/ontology/issues/1384 pull request: https://github.com/OpenEnergyPlatform/ontology/pull/1390 rework module structure issue: https://github.com/OpenEnergyPlatform/ontology/issues/1592 pull request: https://github.com/OpenEnergyPlatform/ontology/pull/1652 replaced 'has bearer' with 'characteristic of' issue: https://github.com/OpenEnergyPlatform/ontology/issues/1907 pull request: https://github.com/OpenEnergyPlatform/ontology/pull/1928

renewable
type: Class
subclass of: origin
subclass of: Restriction
  on property: characteristic of
  some values from: energy
definition: Renewable is an origin of energies that replenish on a human time scale.
alternative label: erneuerbar @de
term tracker annotation: issue: https://github.com/OpenEnergyPlatform/ontology/issues/108 pull request: https://github.com/OpenEnergyPlatform/ontology/pull/130 issue: https://github.com/OpenEnergyPlatform/ontology/issues/397 pull request: https://github.com/OpenEnergyPlatform/ontology/pull/398 include "or energies" issue: https://github.com/OpenEnergyPlatform/ontology/issues/728 pull request: https://github.com/OpenEnergyPlatform/ontology/pull/742 change def issue: https://github.com/OpenEnergyPlatform/ontology/issues/741 pull request: https://github.com/OpenEnergyPlatform/ontology/pull/861 Axiomatise relations between origin, energy and portion of matter: issue: https://github.com/OpenEnergyPlatform/ontology/issues/1183 pull request: https://github.com/OpenEnergyPlatform/ontology/pull/1192 Move to oeo-shared: issue:https://github.com/OpenEnergyPlatform/ontology/issues/1423 pull request: https://github.com/OpenEnergyPlatform/ontology/pull/1437 rework module structure issue: https://github.com/OpenEnergyPlatform/ontology/issues/1592 pull request: https://github.com/OpenEnergyPlatform/ontology/pull/1652 replaced 'has bearer' with 'characteristic of' issue: https://github.com/OpenEnergyPlatform/ontology/issues/1907 pull request: https://github.com/OpenEnergyPlatform/ontology/pull/1928

synthetic
type: Class
subclass of: anthropogenic
subclass of: Restriction
  on property: characteristic of
  some values from: portion of matter
definition: Synthetic is an anthropogenic origin of portions of matter created artificially by a chemical process.
alternative label: synthetisch @de
term tracker annotation: issue: https://github.com/OpenEnergyPlatform/ontology/issues/108 pull request: https://github.com/OpenEnergyPlatform/ontology/pull/130 Make subclass of anthropogenic: https://github.com/OpenEnergyPlatform/ontology/issues/872 https://github.com/OpenEnergyPlatform/ontology/pull/1048 Axiomatise relations between origin, energy and portion of matter: issue: https://github.com/OpenEnergyPlatform/ontology/issues/1183 pull request: https://github.com/OpenEnergyPlatform/ontology/pull/1192 replaced 'has bearer' with 'characteristic of' issue: https://github.com/OpenEnergyPlatform/ontology/issues/1907 pull request: https://github.com/OpenEnergyPlatform/ontology/pull/1928

climate scenario
type: Class
equivalent class: Class
  intersection of: scenario
  intersection of: Restriction
    on property: is about
    some values from: climate system
subclass of: scenario
definition: A climate scenario is a scenario that describes a possible future state of a climate system.
alternative label: Klimaszenario @de
term tracker annotation: issue: https://github.com/OpenEnergyPlatform/ontology/issues/328 pull request: https://github.com/OpenEnergyPlatform/ontology/pull/344 issue: https://github.com/OpenEnergyPlatform/ontology/issues/1329 pull request: https://github.com/OpenEnergyPlatform/ontology/pull/1615 move axiom to shared-axioms issue: https://github.com/OpenEnergyPlatform/ontology/issues/1703 pull request: https://github.com/OpenEnergyPlatform/ontology/pull/1706

economic scenario
type: Class
equivalent class: Class
  intersection of: scenario
  intersection of: Restriction
    on property: is about
    some values from: economy
subclass of: scenario
definition: An economic scenario is a scenario that describes a possible future state of economic systems.
alternative label: Wirtschaftsszenario @de
term tracker annotation: issue: https://github.com/OpenEnergyPlatform/ontology/issues/328 pull request: https://github.com/OpenEnergyPlatform/ontology/pull/344 make equivalent issue: https://github.com/OpenEnergyPlatform/ontology/issues/1329 pull request: https://github.com/OpenEnergyPlatform/ontology/pull/1642

emission scenario
type: Class
equivalent class: Class
  intersection of: scenario
  intersection of: Restriction
    on property: is about
    some values from: emission
subclass of: scenario
definition: An emission scenario is a scenario that describes a possible emission trajectory.
alternative label: Emissionsszenario @de
term tracker annotation: issue: https://github.com/OpenEnergyPlatform/ontology/issues/328 pull request: https://github.com/OpenEnergyPlatform/ontology/pull/344 move to oeo-share issue: https://github.com/OpenEnergyPlatform/ontology/issues/1329 pull request: https://github.com/OpenEnergyPlatform/ontology/pull/1615 rework module structure issue: https://github.com/OpenEnergyPlatform/ontology/issues/1592 pull request: https://github.com/OpenEnergyPlatform/ontology/pull/1652

energy scenario
type: Class
equivalent class: Class
  intersection of: scenario
  intersection of: Restriction
    on property: is about
    some values from: energy system
subclass of: scenario
definition: An energy scenario is a scenario that describes a possible future state of an energy system.
alternative label: Energieszenario @de
term tracker annotation: issue: https://github.com/OpenEnergyPlatform/ontology/issues/328 pull request: https://github.com/OpenEnergyPlatform/ontology/pull/344 make equivalent issue: https://github.com/OpenEnergyPlatform/ontology/issues/1329 pull request: https://github.com/OpenEnergyPlatform/ontology/pull/1615 move axiom to shared-axioms issue: https://github.com/OpenEnergyPlatform/ontology/issues/1703 pull request: https://github.com/OpenEnergyPlatform/ontology/pull/1706

energy system model
type: Class
subclass of: numerical computer model
subclass of: Restriction
  on property: models
  some values from: energy system
definition: An energy system model is a model of an energy system.
alternative label: Energiesystemmodell @de
term tracker annotation: issue: https://github.com/OpenEnergyPlatform/ontology/issues/337 pull request: https://github.com/OpenEnergyPlatform/ontology/pull/358 rework module structure issue: https://github.com/OpenEnergyPlatform/ontology/issues/1592 pull request: https://github.com/OpenEnergyPlatform/ontology/pull/1652

organisational energy producer
type: Class
subclass of: organisation
subclass of: Restriction
  on property: has role
  some values from: producer
definition: An organisational energy producer is an organisation that undertakes the generation of electricity and/or heat."
alternative label: organisational energy producer
definition source: inspired by https://ec.europa.eu/eurostat/documents/38154/41386/Ele_AQ_documentation.pdf/a06bf650-1830-4fcb-9376-7be1f8ab080c
term tracker annotation: issue: https://github.com/OpenEnergyPlatform/ontology/issues/314 pull request: https://github.com/OpenEnergyPlatform/ontology/pull/370

energy autoproducer
type: Class
subclass of: organisational energy producer
definition: An energy autoproducer is an organisational energy producer who produces electrical energy and/or heat wholly or partly for their own use as an activity which supports their primary activity.
definition source: inspired by https://ec.europa.eu/eurostat/documents/38154/41386/Ele_AQ_documentation.pdf/a06bf650-1830-4fcb-9376-7be1f8ab080c
comment: They may be privately or publicly owned.
term tracker annotation: issue: https://github.com/OpenEnergyPlatform/ontology/issues/314 pull request: https://github.com/OpenEnergyPlatform/ontology/pull/370

main activity energy producer
type: Class
subclass of: organisational energy producer
definition: A main activity energy producer is an organisational energy producer whose primary activity is electrical energy and/or heat production.
definition source: inspired by https://ec.europa.eu/eurostat/documents/38154/41386/Ele_AQ_documentation.pdf/a06bf650-1830-4fcb-9376-7be1f8ab080c
comment: They may be privately or publicly owned. Note that the sale need not take place through the public grid.
term tracker annotation: issue: https://github.com/OpenEnergyPlatform/ontology/issues/314 pull request: https://github.com/OpenEnergyPlatform/ontology/pull/370

process attribute
type: Class
subclass of: occurrent
definition: A process attribute is a dependent occurrent that existentially depends on a process.
alternative label: Prozessattribut @de
term tracker annotation: issue: https://github.com/OpenEnergyPlatform/ontology/issues/205 pull request: https://github.com/OpenEnergyPlatform/ontology/pull/386 rework module structure issue: https://github.com/OpenEnergyPlatform/ontology/issues/1592 pull request: https://github.com/OpenEnergyPlatform/ontology/pull/1652

organisation
type: Class
subclass of: immaterial entity
subclass of: Restriction
  on property: has role
  some values from: organisation role
definition: An organisation is an immaterial entity that has the organisation role and there exists some sort of legal framework that recognises the entity and its continued existence.
alternative label: Organisation @de
alternative label: organization
term tracker annotation: issue: https://github.com/OpenEnergyPlatform/ontology/issues/416 pull request: https://github.com/OpenEnergyPlatform/ontology/pull/421 added term in oeo-shared: pull request: https://github.com/OpenEnergyPlatform/ontology/pull/871 deleted term in oeo-social: issue: https://github.com/OpenEnergyPlatform/ontology/issues/983 pull request: https://github.com/OpenEnergyPlatform/ontology/pull/992 rework module structure issue: https://github.com/OpenEnergyPlatform/ontology/issues/1592 pull request: https://github.com/OpenEnergyPlatform/ontology/pull/1652 added disjointness issue: https://github.com/OpenEnergyPlatform/ontology/issues/1702 pull request: https://github.com/OpenEnergyPlatform/ontology/pull/1716

energy system
type: Class
subclass of: supply system
definition: An energy system is a supply system of spatially extended linked energy sources and sinks.
alternative label: Energiesystem @de
alternative label: energy supply system
term tracker annotation: issue: https://github.com/OpenEnergyPlatform/ontology/issues/432 pull request: https://github.com/OpenEnergyPlatform/ontology/pull/493 make subclass of supply system: issue: https://github.com/OpenEnergyPlatform/ontology/issues/1071 pull request: https://github.com/OpenEnergyPlatform/ontology/pull/1123 move to oeo-shared issue: https://github.com/OpenEnergyPlatform/ontology/issues/1329 pull request: https://github.com/OpenEnergyPlatform/ontology/pull/1615 rework module structure issue: https://github.com/OpenEnergyPlatform/ontology/issues/1592 pull request: https://github.com/OpenEnergyPlatform/ontology/pull/1652

supply system
type: Class
subclass of: system
definition: A supply system is a system that connects producers and consumers.
alternative label: Versorgungssystem @de
term tracker annotation: issue: https://github.com/OpenEnergyPlatform/ontology/issues/432 pull request: https://github.com/OpenEnergyPlatform/ontology/pull/493 move to oeo-shared issue: https://github.com/OpenEnergyPlatform/ontology/issues/1329 pull request: https://github.com/OpenEnergyPlatform/ontology/pull/1615 rework module structure issue: https://github.com/OpenEnergyPlatform/ontology/issues/1592 pull request: https://github.com/OpenEnergyPlatform/ontology/pull/1652

primary energy production
type: Class
subclass of: OEO_00240003
subclass of: Restriction
  on property: has physical output
  some values from: primary energy carrier
subclass of: Restriction
  on property: has quantity value
  some values from: energy value
definition: Primary energy production is a production that prepares raw material for its use as primary energy carrier.
alternative label: primary production of energy
term tracker annotation: add eurostat alternative term: issue: https://github.com/OpenEnergyPlatform/ontology/issues/920 pull: https://github.com/OpenEnergyPlatform/ontology/pull/924 add axioms: issue: https://github.com/OpenEnergyPlatform/ontology/issues/860 pull: https://github.com/OpenEnergyPlatform/ontology/pull/865 issue: https://github.com/OpenEnergyPlatform/ontology/issues/835 pull request: https://github.com/OpenEnergyPlatform/ontology/pull/845 issue: https://github.com/OpenEnergyPlatform/ontology/issues/77 pull request: https://github.com/OpenEnergyPlatform/ontology/pull/498

primary energy carrier mining
type: Class
subclass of: primary energy production
definition: Primary energy carrier mining is a primary energy production that recovers non-renewable energy carriers from its natural site.
term tracker annotation: issue: https://github.com/OpenEnergyPlatform/ontology/issues/835 pull request: https://github.com/OpenEnergyPlatform/ontology/pull/845 issue: https://github.com/OpenEnergyPlatform/ontology/issues/77 pull request: https://github.com/OpenEnergyPlatform/ontology/pull/498

primary energy carrier harvest
type: Class
subclass of: primary energy production
definition: Primary energy carrier harvest is a primary energy production that collects solid biomass from its natural site.
term tracker annotation: issue: https://github.com/OpenEnergyPlatform/ontology/issues/835 pull request: https://github.com/OpenEnergyPlatform/ontology/pull/845 issue: https://github.com/OpenEnergyPlatform/ontology/issues/77 pull request: https://github.com/OpenEnergyPlatform/ontology/pull/498

exogenous data
type: Class
equivalent class: Class
  intersection of: data item
  intersection of: Restriction
    on property: information input of
    some values from: model calculation
subclass of: data item
subclass of: Restriction
  on property: is about
  some values from: quantity value
subclass of: Restriction
  on property: has role
  some values from: OEO_00400022
definition: Exogenous data is a data item whose quantity value is determined outside of a model and is imposed on a model.
alternative label: input data
term tracker annotation: issue: https://github.com/OpenEnergyPlatform/ontology/issues/482 pull request: https://github.com/OpenEnergyPlatform/ontology/pull/500 make equivalent class pull request: https://github.com/OpenEnergyPlatform/ontology/pull/1113 add relation to quantity value: pull request: https://github.com/OpenEnergyPlatform/ontology/pull/1216 rework module structure issue: https://github.com/OpenEnergyPlatform/ontology/issues/1592 pull request: https://github.com/OpenEnergyPlatform/ontology/pull/1652 Add 'model uncertainty location axiom' issue:https://github.com/OpenEnergyPlatform/ontology/issues/1829 pull request: https://github.com/OpenEnergyPlatform/ontology/pull/1990

endogenous data
type: Class
equivalent class: Class
  intersection of: data item
  intersection of: Restriction
    on property: information output of
    some values from: model calculation
subclass of: data item
subclass of: Restriction
  on property: is about
  some values from: quantity value
definition: Endogenous data is a data item whose quantity value is determined by a model.
term tracker annotation: issue: https://github.com/OpenEnergyPlatform/ontology/issues/482 pull request: https://github.com/OpenEnergyPlatform/ontology/pull/500 make equivalent class pull request: https://github.com/OpenEnergyPlatform/ontology/pull/1113 add relation to quantity value: pull request: https://github.com/OpenEnergyPlatform/ontology/pull/1216 rework module structure issue: https://github.com/OpenEnergyPlatform/ontology/issues/1592 pull request: https://github.com/OpenEnergyPlatform/ontology/pull/1652

start time
type: Class
subclass of: zero-dimensional temporal region
definition: A start time is a zero-dimensional temporal region that indicates the beginning of a one-dimensional temporal region.
alternative label: Startzeit @de
term tracker annotation: issue: https://github.com/OpenEnergyPlatform/ontology/issues/267 pull request: https://github.com/OpenEnergyPlatform/ontology/pull/538 rework module structure issue: https://github.com/OpenEnergyPlatform/ontology/issues/1592 pull request: https://github.com/OpenEnergyPlatform/ontology/pull/1652

ending time
type: Class
subclass of: zero-dimensional temporal region
definition: An ending time is a zero-dimensional temporal region that indicates the end of a one-dimensional temporal region.
alternative label: Endzeit @de
term tracker annotation: issue: https://github.com/OpenEnergyPlatform/ontology/issues/267 pull request: https://github.com/OpenEnergyPlatform/ontology/pull/538 rework module structure issue: https://github.com/OpenEnergyPlatform/ontology/issues/1592 pull request: https://github.com/OpenEnergyPlatform/ontology/pull/1652

time step
type: Class
subclass of: one-dimensional temporal region
subclass of: Class
  union of: Class
    intersection of: Restriction
      on property: has part
      some values from: start time
    intersection of: Restriction
      on property: has part
      some values from: ending time
  union of: Class
    intersection of: Restriction
      on property: has part
      some values from: time span
    intersection of: Restriction
      on property: has part
      some values from: time stamp
    intersection of: Restriction
      on property: has part
      some values from: time stamp alignment
definition: A time step is a one-dimensional temporal region that has a start time and an ending time and thus a finite duration.
alternative label: Zeitschritt @de
term tracker annotation: issue: https://github.com/OpenEnergyPlatform/ontology/issues/267 pull request: https://github.com/OpenEnergyPlatform/ontology/pull/538 pull request: https://github.com/OpenEnergyPlatform/ontology/pull/570 move to oeo-shared: issue: https://github.com/OpenEnergyPlatform/ontology/issues/1384 pull request: https://github.com/OpenEnergyPlatform/ontology/pull/1390 rework module structure issue: https://github.com/OpenEnergyPlatform/ontology/issues/1592 pull request: https://github.com/OpenEnergyPlatform/ontology/pull/1652

time series
type: Class
subclass of: data set
subclass of: Restriction
  on property: has part
  some values from: start time
subclass of: Restriction
  on property: has part
  some values from: ending time
subclass of: Restriction
  on property: has part
  some values from: time span
subclass of: Restriction
  on property: is about
  some values from: Class
    union of: zero-dimensional temporal region
    union of: time step
definition: A time series is a data set that references to a set of time steps or zero-dimensional temporal regions.
alternative label: Zeitreihe @de
may be identical to: http://purl.obolibrary.org/obo/IAO_0000584
term tracker annotation: issue: https://github.com/OpenEnergyPlatform/ontology/issues/267 pull request: https://github.com/OpenEnergyPlatform/ontology/pull/538 move to oeo-shared: issue: https://github.com/OpenEnergyPlatform/ontology/issues/1384 pull request: https://github.com/OpenEnergyPlatform/ontology/pull/1390 rework module structure issue: https://github.com/OpenEnergyPlatform/ontology/issues/1592 pull request: https://github.com/OpenEnergyPlatform/ontology/pull/1652

Axiom
annotated source: time series
annotated property: may be identical to
annotated target: http://purl.obolibrary.org/obo/IAO_0000584
term tracker annotation: issue: https://github.com/OpenEnergyPlatform/ontology/issues/636 pull request: https://github.com/OpenEnergyPlatform/ontology/pull/810

time span
type: Class
subclass of: quantity value
subclass of: Restriction
  on property: quantity value of
  some values from: one-dimensional temporal region
subclass of: Restriction
  on property: has unit
  some values from: time unit
definition: A time span is a quantity value indicating the duration of a one-dimensional temporal region, measured in a time unit.
alternative label: Zeitspanne @de
alternative label: duration
term tracker annotation: issue: https://github.com/OpenEnergyPlatform/ontology/issues/267 pull request: https://github.com/OpenEnergyPlatform/ontology/pull/538 change duration to time span (def, label, alternative term) pull request: https://github.com/OpenEnergyPlatform/ontology/pull/1017 rework module structure issue: https://github.com/OpenEnergyPlatform/ontology/issues/1592 pull request: https://github.com/OpenEnergyPlatform/ontology/pull/1652

market exchange role
type: Class
subclass of: role
definition: A role of an organisation, association, or group of persons, whether incorporated or unincorporated, which constitutes, maintains, or provides a facility for bringing together purchasers and sellers of financial instruments, commodities, or other products, services, or goods, and includes the market place and facilities maintained by the exchange
alternative label: exchange
alternative label: market
definition source: fibo-fbc-fct-mkt:Exchange
term tracker annotation: https://github.com/OpenEnergyPlatform/ontology/issues/341 https://github.com/OpenEnergyPlatform/ontology/pull/639 https://github.com/OpenEnergyPlatform/ontology/issues/677 https://github.com/OpenEnergyPlatform/ontology/pull/740 change label to market exchange role https://github.com/OpenEnergyPlatform/ontology/pull/748 Move to oeo-shared: issue: https://github.com/OpenEnergyPlatform/ontology/issues/1458 pull request: https://github.com/OpenEnergyPlatform/ontology/pull/1478 rework module structure issue: https://github.com/OpenEnergyPlatform/ontology/issues/1592 pull request: https://github.com/OpenEnergyPlatform/ontology/pull/1652

monetary value
type: Class
subclass of: quantity value
subclass of: Restriction
  on property: quantity value of
  some values from: good
subclass of: Restriction
  on property: has unit
  some values from: currency
definition: A monetary value is a quantity value that states the amount of money specified in monetary units.
alternative label: Geldwert @de
alternative label: amount of money
definition source: fibo-fnd-acc-cur:MonetaryPrice
term tracker annotation: issue: https://github.com/OpenEnergyPlatform/ontology/issues/331 pull request: https://github.com/OpenEnergyPlatform/ontology/pull/640 move to oeo-shared pull request: https://github.com/OpenEnergyPlatform/ontology/pull/956 add relation to good pull request: https://github.com/OpenEnergyPlatform/ontology/pull/1034 rework module structure issue: https://github.com/OpenEnergyPlatform/ontology/issues/1592 pull request: https://github.com/OpenEnergyPlatform/ontology/pull/1652 relabel as monetary value issue: https://github.com/OpenEnergyPlatform/ontology/issues/1902 pull request: https://github.com/OpenEnergyPlatform/ontology/pull/1915 make subclass of quantity value issue: https://github.com/OpenEnergyPlatform/ontology/issues/1917 pull request: https://github.com/OpenEnergyPlatform/ontology/pull/1931 change axiom to good (role) issue: https://github.com/OpenEnergyPlatform/ontology/issues/2144 pull request: https://github.com/OpenEnergyPlatform/ontology/pull/2161

currency
type: Class
subclass of: unit
example of usage: The currency used in France in 2020 was Euro.
definition: A unit which is a measure of the medium of an exchange value, defined by reference to the geographical location of the monetary authorities responsible for it.
alternative label: Währung @de
definition source: fibo-fnd-acc-cur:Currency
comment: Currency is the unit of monetary value as defined by each country.
term tracker annotation: https://github.com/OpenEnergyPlatform/ontology/issues/331 https://github.com/OpenEnergyPlatform/ontology/pull/640 add comment and example https://github.com/OpenEnergyPlatform/ontology/pull/910 moved to oeo-shared https://github.com/OpenEnergyPlatform/ontology/pull/956 rework module structure issue: https://github.com/OpenEnergyPlatform/ontology/issues/1592 pull request: https://github.com/OpenEnergyPlatform/ontology/pull/1652

trader
type: Class
subclass of: market participant
definition: A trader is a market participant that engages in the transfer of financial assets in any financial market on behalf of a client or a financial services provider.
alternative label: Händler @de
alternative label: Händlerin @de
definition source: fibo-fbc-pas-fpas:Trader
term tracker annotation: Implement in line with FIBO: issue: https://github.com/OpenEnergyPlatform/ontology/issues/377 pull request: https://github.com/OpenEnergyPlatform/ontology/pull/641 Make trader subclass of market participant: issue: https://github.com/OpenEnergyPlatform/ontology/issues/330 https://github.com/OpenEnergyPlatform/ontology/pull/745

request
type: Class
subclass of: process
subclass of: Restriction
  on property: has participant
  min qualified cardinality: 2
  on class: agent
definition: A request is a process whereby an agent asks another agent for something or to do something.
alternative label: Anfrage @de
definition source: https://spec.edmcouncil.org/fibo/ontology/FND/Arrangements/Communications/Request
term tracker annotation: issue: https://github.com/OpenEnergyPlatform/ontology/issues/376 pull request: https://github.com/OpenEnergyPlatform/ontology/pull/642 add 'has participant axiom': issue: https://github.com/OpenEnergyPlatform/ontology/issues/1327 pull request: https://github.com/OpenEnergyPlatform/ontology/pull/1395

price request
type: Class
subclass of: request
definition: A price request is a request in which an agent asks another agent for a price.
term tracker annotation: https://github.com/OpenEnergyPlatform/ontology/issues/376 https://github.com/OpenEnergyPlatform/ontology/pull/642

marginal cost
type: Class
subclass of: quantity value
definition: Marginal cost is the quantity value that corresponds to the change in the total cost that arises when the quantity produced is incremented by one unit; that is, it is the cost of producing one more unit of a good.
alternative label: Grenzkosten @de
definition source: O'Sullivan, Arthur; Sheffrin, Steven M. (2003). Economics: Principles in Action.
term tracker annotation: issue: https://github.com/OpenEnergyPlatform/ontology/issues/376 pull request: https://github.com/OpenEnergyPlatform/ontology/pull/642 make subclass of quantity value issue: https://github.com/OpenEnergyPlatform/ontology/issues/1917 pull request: https://github.com/OpenEnergyPlatform/ontology/pull/1931

cost
type: Class
subclass of: process attribute
subclass of: Restriction
  on property: has quantity value
  some values from: monetary value
definition: Cost is a process attribute that describes the amount of money needed to buy, make, or do a thing.
alternative label: Kosten @de
definition source: https://dictionary.cambridge.org/dictionary/english/cost
term tracker annotation: issue: https://github.com/OpenEnergyPlatform/ontology/issues/268 pull request: https://github.com/OpenEnergyPlatform/ontology/pull/643 move to oeo-shared pull request: https://github.com/OpenEnergyPlatform/ontology/pull/956 delete cost in oeo-social issue: https://github.com/OpenEnergyPlatform/ontology/issues/975 pull request: https://github.com/OpenEnergyPlatform/ontology/pull/977 rework module structure issue: https://github.com/OpenEnergyPlatform/ontology/issues/1592 pull request: https://github.com/OpenEnergyPlatform/ontology/pull/1652 make subclass of quantity value issue: https://github.com/OpenEnergyPlatform/ontology/issues/1917 pull request: https://github.com/OpenEnergyPlatform/ontology/pull/1931 make subclass of process attribute issue: https://github.com/OpenEnergyPlatform/ontology/issues/1914 pull request: https://github.com/OpenEnergyPlatform/ontology/pull/1999

commodity role
type: Class
subclass of: good role
definition: A commodity role is a good role that inheres in something that is used in commerce and is exchangeable with other commodities of the same type.
definition source: fibo-fnd-pas-pas:Commodity
term tracker annotation: https://github.com/OpenEnergyPlatform/ontology/issues/339 https://github.com/OpenEnergyPlatform/ontology/pull/644 moved to oeo-shared and renamed https://github.com/OpenEnergyPlatform/ontology/pull/748 made subclass of good role pull request: https://github.com/OpenEnergyPlatform/ontology/pull/843 rework module structure issue: https://github.com/OpenEnergyPlatform/ontology/issues/1592 pull request: https://github.com/OpenEnergyPlatform/ontology/pull/1652

manufacturing process
type: Class
subclass of: process
subclass of: Class
  intersection of: Restriction
    on property: has part
    some values from: energy transformation
  intersection of: Restriction
    on property: has part
    some values from: material transformation
subclass of: Restriction
  on property: has output
  some values from: Class
    intersection of: Class
      union of: object aggregate
      union of: artificial object
    intersection of: Restriction
      on property: has role
      some values from: good role
definition: A manufacturing process is a process that produces artificial objects or object aggregates that are economic goods. It involves several subprocesses, which are energy transformations and material transformations amongst others.
alternative label: Herstellungsprozess @de
alternative label: industrial process
alternative label: industrieller Prozess @de
term tracker annotation: issue: https://github.com/OpenEnergyPlatform/ontology/issues/534 pull request: https://github.com/OpenEnergyPlatform/ontology/pull/589 Relabel and redefine: issue: https://github.com/OpenEnergyPlatform/ontology/issues/1726 pull request: https://github.com/OpenEnergyPlatform/ontology/pull/1840

fuel-powered electricity generation process
type: Class
equivalent class: Class
  intersection of: OEO_00240014
  intersection of: Restriction
    on property: has physical input
    some values from: combustion fuel
subclass of: Class
  intersection of: Restriction
    on property: has occurrent part
    some values from: Class
      intersection of: MENO_01013
      intersection of: Restriction
        on property: negatively regulates characteristic
        some values from: chemical energy
  intersection of: Restriction
    on property: has occurrent part
    some values from: Class
      intersection of: MENO_01014
      intersection of: Restriction
        on property: positively regulates characteristic
        some values from: electrical energy
subclass of: Restriction
  on property: has participant
  some values from: fueled power plant
subclass of: Restriction
  on property: has participant
  some values from: fueled power unit
subclass of: Restriction
  on property: causally upstream of or within
  some values from: emission
subclass of: Restriction
  on property: has process attribute
  some values from: emission factor
definition: A fuel-powered electricity generation process is an electricity generation process that converts chemical energy from a combustion fuel to electrical energy. It causes some emission.
alternative label: fuel-powered electricity generation
term tracker annotation: issue: https://github.com/OpenEnergyPlatform/ontology/issues/582 pull request: https://github.com/OpenEnergyPlatform/ontology/pull/592 Update definition and axioms: issue: https://github.com/OpenEnergyPlatform/ontology/issues/936 pull request: https://github.com/OpenEnergyPlatform/ontology/pull/1240 Relabel and add old label as alternative term: issue: https://github.com/OpenEnergyPlatform/ontology/issues/1455 pull request: https://github.com/OpenEnergyPlatform/ontology/pull/1562 replace energy-participant axioms issue: https://github.com/OpenEnergyPlatform/ontology/issues/2053 pull request: https://github.com/OpenEnergyPlatform/ontology/pull/2120

kilojoule
type: Class
subclass of: energy unit
definition: An energy unit which is equal to 1,000 joules.
alternative label: Kilojoule @de
has exact synonym: kJ
term tracker annotation: issue: https://github.com/OpenEnergyPlatform/ontology/issues/606 pull request: https://github.com/OpenEnergyPlatform/ontology/pull/608

megajoule
type: Class
subclass of: energy unit
definition: An energy unit which is equal to 1,000,000 joules.
alternative label: Megajoule @de
has exact synonym: MJ
term tracker annotation: issue: https://github.com/OpenEnergyPlatform/ontology/issues/606 pull request: https://github.com/OpenEnergyPlatform/ontology/pull/608

gigajoule
type: Class
subclass of: energy unit
definition: An energy unit which is equal to 10^9 joules.
alternative label: Gigajoule @de
has exact synonym: GJ
term tracker annotation: issue: https://github.com/OpenEnergyPlatform/ontology/issues/606 pull request: https://github.com/OpenEnergyPlatform/ontology/pull/608

terajoule
type: Class
subclass of: energy unit
definition: An energy unit which is equal to 10^12 joules.
alternative label: Terajoule @de
has exact synonym: TJ
term tracker annotation: issue: https://github.com/OpenEnergyPlatform/ontology/issues/606 pull request: https://github.com/OpenEnergyPlatform/ontology/pull/608

petajoule
type: Class
subclass of: energy unit
definition: An energy unit which is equal to 10^15 joules.
alternative label: Petajoule @de
has exact synonym: PJ
term tracker annotation: issue: https://github.com/OpenEnergyPlatform/ontology/issues/606 pull request: https://github.com/OpenEnergyPlatform/ontology/pull/608

exajoule
type: Class
subclass of: energy unit
definition: An energy unit which is equal to 10^18 joules.
alternative label: Exajoule @de
has exact synonym: EJ
term tracker annotation: issue: https://github.com/OpenEnergyPlatform/ontology/issues/606 pull request: https://github.com/OpenEnergyPlatform/ontology/pull/608

megawatt-hour
type: Class
equivalent class: Class
  intersection of: watt-hour based unit
  intersection of: Restriction
    on property: has linear unit numerator
    some values from: watt-hour
  intersection of: Restriction
    on property: has prefix
    some values from: mega
subclass of: watt-hour based unit
definition: A megawatt-hour is a watt-hour based unit which is equal to 10^6 watt-hours.
alternative label: Megawattstunde @de
alternative label: megawatt hours
has exact synonym: MWh
term tracker annotation: issue: https://github.com/OpenEnergyPlatform/ontology/issues/606 pull request: https://github.com/OpenEnergyPlatform/ontology/pull/608 issue: https://github.com/OpenEnergyPlatform/ontology/issues/1830 pull request: https://github.com/OpenEnergyPlatform/ontology/pull/1845

terawatt-hour
type: Class
equivalent class: Class
  intersection of: watt-hour based unit
  intersection of: Restriction
    on property: has linear unit numerator
    some values from: watt-hour
  intersection of: Restriction
    on property: has prefix
    some values from: tera
subclass of: watt-hour based unit
definition: A terawatt-hour is a watt-hour based unit which is equal to 10^12 watt-hours.
alternative label: Terawatstunde @de
alternative label: terawatt hours
has exact synonym: TWh
term tracker annotation: issue: https://github.com/OpenEnergyPlatform/ontology/issues/606 pull request: https://github.com/OpenEnergyPlatform/ontology/pull/608 issue: https://github.com/OpenEnergyPlatform/ontology/issues/1830 pull request: https://github.com/OpenEnergyPlatform/ontology/pull/1845

petawatt-hour
type: Class
equivalent class: Class
  intersection of: watt-hour based unit
  intersection of: Restriction
    on property: has linear unit numerator
    some values from: watt-hour
  intersection of: Restriction
    on property: has prefix
    some values from: peta
subclass of: watt-hour based unit
definition: A petawatt-hour is a watt-hour based unit which is equal to 10^15 watt-hours.
alternative label: Petawattstunde @de
alternative label: petawatt hours
has exact synonym: PWh
term tracker annotation: issue: https://github.com/OpenEnergyPlatform/ontology/issues/606 pull request: https://github.com/OpenEnergyPlatform/ontology/pull/608 issue: https://github.com/OpenEnergyPlatform/ontology/issues/1830 pull request: https://github.com/OpenEnergyPlatform/ontology/pull/1845

gigawatt-hour
type: Class
equivalent class: Class
  intersection of: watt-hour based unit
  intersection of: Restriction
    on property: has linear unit numerator
    some values from: watt-hour
  intersection of: Restriction
    on property: has prefix
    some values from: giga
subclass of: watt-hour based unit
definition: A gigawatt-hour is a watt-hour based unit which is equal to 10^9 watt-hours.
alternative label: Gigawattstunde @de
alternative label: gigawatt hours
has exact synonym: GWh
term tracker annotation: add eurostat alternative term: issue: https://github.com/OpenEnergyPlatform/ontology/issues/920 pull: https://github.com/OpenEnergyPlatform/ontology/pull/924 issue: https://github.com/OpenEnergyPlatform/ontology/issues/606 pull request: https://github.com/OpenEnergyPlatform/ontology/pull/608 issue: https://github.com/OpenEnergyPlatform/ontology/issues/1830 pull request: https://github.com/OpenEnergyPlatform/ontology/pull/1845

final energy consumption value
type: Class
equivalent class: Class
  intersection of: OEO_00240019
  intersection of: Restriction
    on property: is about
    some values from: Restriction
      on property: has participant
      some values from: final energy carrier
subclass of: OEO_00240019
definition: A final energy consumption value is an energy consumption value expressing the magnitude of the energy delivered to and consumed by end users.
alternative label: Endenergieverbrauch @de
alternative label: final energy consumption
oekg annotation: study descriptor tag
term tracker annotation: issue: https://github.com/OpenEnergyPlatform/ontology/issues/576 pull request: https://github.com/OpenEnergyPlatform/ontology/pull/613 Make 'energy consumption value' issue: https://github.com/OpenEnergyPlatform/ontology/issues/1322 pull request: https://github.com/OpenEnergyPlatform/ontology/pull/1340 Add axiom issue: https://github.com/OpenEnergyPlatform/ontology/issues/1832 pull request: https://github.com/OpenEnergyPlatform/ontology/pull/1841 add oekg annotation issue: https://github.com/OpenEnergyPlatform/ontology/issues/2063 pull request: https://github.com/OpenEnergyPlatform/ontology/pull/2065

gross inland energy consumption value
type: Class
subclass of: OEO_00240019
subclass of: Restriction
  on property: is about
  some values from: non-energy use
definition: A gross inland energy consumption value is an energy consumption value expressing the magnitude of the total consumption of energy in a spatial region (e.g. a country).
editor note: Gross inland energy consumption represents the quantity of energy necessary to satisfy inland consumption of the spatial region (e.g. a country) under consideration. Gross inland energy consumption covers: - consumption by the energy sector itself; - distribution and transformation losses; - final energy consumption by end users; - 'statistical differences' (not already captured in the figures on primary energy consumption and final energy consumption). Gross inland energy consumption does not include energy (fuel oil) provided to international maritime bunkers.
alternative label: Bruttoinlandsverbrauch @de
alternative label: gross inland consumption
alternative label: primary energy consumption including non-energy use of energy carriers
definition source: Eurostat Energy Glossary https://ec.europa.eu/eurostat/statistics-explained/index.php/Glossary:Gross_inland_energy_consumption
term tracker annotation: become a subclass of quantity value: issue: https://github.com/OpenEnergyPlatform/ontology/issues/916 pull request: https://github.com/OpenEnergyPlatform/ontology/pull/997 issue: https://github.com/OpenEnergyPlatform/ontology/issues/709 pull request: https://github.com/OpenEnergyPlatform/ontology/pull/719 issue: https://github.com/OpenEnergyPlatform/ontology/issues/576 pull request: https://github.com/OpenEnergyPlatform/ontology/pull/613 improve definition: issue: https://github.com/OpenEnergyPlatform/ontology/issues/1129 pull request: https://github.com/OpenEnergyPlatform/ontology/pull/1306

primary energy consumption value
type: Class
subclass of: OEO_00240019
subclass of: Class
  complement of: Restriction
    on property: is about
    some values from: non-energy use
definition: A primary energy consumption value is an energy consumption value expressing the magnitude of the total consumption of energy in a spatial region excluding the non-energetic use of fuels.
editor note: Primary energy consumption covers consumption of the energy sector itself, losses during transformation (for example, from oil or gas into electricity) and distribution of energy, and the final consumption by end users. It excludes energy carriers used for non-energy purposes (such as petroleum not used not for combustion but for producing plastics).
alternative label: Primary energy consumption excluding non-energy use of energy carriers.
alternative label: Primärenergieverbrauch @de
definition source: Eurostat Energy Glossary https://ec.europa.eu/eurostat/statistics-explained/index.php?title=Glossary:Primary_energy_consumption
oekg annotation: study descriptor tag
term tracker annotation: issue: https://github.com/OpenEnergyPlatform/ontology/issues/709 pull request: https://github.com/OpenEnergyPlatform/ontology/pull/719 issue: https://github.com/OpenEnergyPlatform/ontology/issues/576 pull request: https://github.com/OpenEnergyPlatform/ontology/pull/613 make energy consumption value: issue: https://github.com/OpenEnergyPlatform/ontology/issues/1129 pull request: https://github.com/OpenEnergyPlatform/ontology/pull/1306 Move to oeo-shared: https://github.com/OpenEnergyPlatform/ontology/pull/1463 rework module structure issue: https://github.com/OpenEnergyPlatform/ontology/issues/1592 pull request: https://github.com/OpenEnergyPlatform/ontology/pull/1652 add oekg annotation issue: https://github.com/OpenEnergyPlatform/ontology/issues/2063 pull request: https://github.com/OpenEnergyPlatform/ontology/pull/2065

energy value
type: Class
subclass of: quantity value
subclass of: Restriction
  on property: has unit
  some values from: energy unit
definition: An energy value is a quantity value that has an energy unit as unit.
alternative label: Energiemenge @de
alternative label: energy amount value
alternative label: energy quantity value
term tracker annotation: issue: https://github.com/OpenEnergyPlatform/ontology/issues/576 pull request: https://github.com/OpenEnergyPlatform/ontology/pull/613 moved to oeo-shared issue: https://github.com/OpenEnergyPlatform/ontology/issues/998 pull request: https://github.com/OpenEnergyPlatform/ontology/pull/1221 rework module structure issue: https://github.com/OpenEnergyPlatform/ontology/issues/1592 pull request: https://github.com/OpenEnergyPlatform/ontology/pull/1652 change label and add alternative label issue: https://github.com/OpenEnergyPlatform/ontology/issues/1865 pull request: https://github.com/OpenEnergyPlatform/ontology/pull/1941

steam-electric process
type: Class
subclass of: energy transformation
subclass of: Restriction
  on property: has participant
  some values from: electromotive generator
subclass of: Restriction
  on property: has participant
  some values from: steam turbine
subclass of: Restriction
  on property: has energy input
  some values from: thermal energy
definition: A steam-electric process is an energy transformation that converts thermal energy to electrical energy. A steam turbine and an electro motive generator are participating in a steam-electric process.
term tracker annotation: issue: https://github.com/OpenEnergyPlatform/ontology/issues/659 pull request: https://github.com/OpenEnergyPlatform/ontology/pull/691 pull request: https://github.com/OpenEnergyPlatform/ontology/pull/702 change 'has physical input / output' axioms to 'has energy input / output': https://github.com/OpenEnergyPlatform/ontology/issues/994 https://github.com/OpenEnergyPlatform/ontology/pull/1041 replace energy-participant axioms issue: https://github.com/OpenEnergyPlatform/ontology/issues/2053 pull request: https://github.com/OpenEnergyPlatform/ontology/pull/2120

Axiom
annotated source: steam-electric process
annotated property: subClassOf
annotated target: Restriction
term tracker annotation: issue: https://github.com/OpenEnergyPlatform/ontology/issues/736 pull request: https://github.com/OpenEnergyPlatform/ontology/pull/766

volumetric flow rate value
type: Class
subclass of: quantity value
subclass of: Restriction
  on property: has unit
  some values from: volumetric flow rate unit
definition: A volumetric flow rate value is a quantity value that has a volumetric flow rate unit as unit.
term tracker annotation: Issue: https://github.com/OpenEnergyPlatform/ontology/pull/693 Pull Request: https://github.com/OpenEnergyPlatform/ontology/pull/693

funder
type: Class
subclass of: sponsor
definition: A funder is a sponsor that supports by giving money.
alternative label: Förderer @de
term tracker annotation: issue: https://github.com/OpenEnergyPlatform/ontology/issues/246 pull request: https://github.com/OpenEnergyPlatform/ontology/pull/776 rework module structure issue: https://github.com/OpenEnergyPlatform/ontology/issues/1592 pull request: https://github.com/OpenEnergyPlatform/ontology/pull/1652

public funder
type: Class
subclass of: funder
definition: A public funder is a funder that gives public money.
alternative label: öffentlicher Förderer @de
term tracker annotation: issue: https://github.com/OpenEnergyPlatform/ontology/issues/246 pull request: https://github.com/OpenEnergyPlatform/ontology/pull/776

private funder
type: Class
subclass of: funder
definition: A private funder is a funder that gives private money.
alternative label: privater Förderer @de
term tracker annotation: issue: https://github.com/OpenEnergyPlatform/ontology/issues/246 pull request: https://github.com/OpenEnergyPlatform/ontology/pull/776

liquid water
type: Class
subclass of: water
subclass of: Restriction
  on property: has quality
  some values from: hydro energy
subclass of: Restriction
  on property: has state of matter
  has value: OEO_00000256
definition: Liquid water is water that has a liquid state of matter.
alternative label: flüssiges Wasser @de
term tracker annotation: issue: https://github.com/OpenEnergyPlatform/ontology/issues/679 pull request: https://github.com/OpenEnergyPlatform/ontology/pull/682

steam
type: Class
subclass of: water
subclass of: Restriction
  on property: has disposition
  some values from: secondary energy carrier disposition
subclass of: Restriction
  on property: has state of matter
  has value: OEO_00000182
definition: Steam is water that has a gaseous state of matter.
alternative label: Dampf @de
term tracker annotation: issue: https://github.com/OpenEnergyPlatform/ontology/issues/679 pull request: https://github.com/OpenEnergyPlatform/ontology/pull/682 add axiom to secondary energy carrier disposition issue:https://github.com/OpenEnergyPlatform/ontology/issues/1222 pull request: https://github.com/OpenEnergyPlatform/ontology/pull/1243

water flow
type: Class
subclass of: process
subclass of: Restriction
  on property: has participant
  some values from: liquid water
subclass of: Restriction
  on property: has process attribute
  some values from: water flow rate
definition: Water flow is a process of liquid water moving.
alternative label: Wasserfluss @de
term tracker annotation: issue: https://github.com/OpenEnergyPlatform/ontology/issues/679 pull request: https://github.com/OpenEnergyPlatform/ontology/pull/682

water flow rate
type: Class
subclass of: process attribute
subclass of: Restriction
  on property: has quantity value
  some values from: volumetric flow rate value
definition: Water flow rate is the process attribute of water flow that quantifies the water volume per time unit.
alternative label: Wasserdurchflussrate @de
term tracker annotation: issue: https://github.com/OpenEnergyPlatform/ontology/issues/679 pull request: https://github.com/OpenEnergyPlatform/ontology/pull/682

hydro energy transformation
type: Class
subclass of: energy transformation
subclass of: Class
  intersection of: Restriction
    on property: has occurrent part
    some values from: Class
      intersection of: MENO_01013
      intersection of: Restriction
        on property: negatively regulates characteristic
        some values from: hydro energy
  intersection of: Restriction
    on property: has occurrent part
    some values from: Class
      intersection of: MENO_01014
      intersection of: Restriction
        on property: positively regulates characteristic
        some values from: energy
definition: Hydro energy transformation is an energy transformation that converts hydro energy.
term tracker annotation: issue: https://github.com/OpenEnergyPlatform/ontology/issues/679 pull request: https://github.com/OpenEnergyPlatform/ontology/pull/682 pull request: https://github.com/OpenEnergyPlatform/ontology/pull/702 change 'has physical input / output' axioms to 'has energy input / output': https://github.com/OpenEnergyPlatform/ontology/issues/994 https://github.com/OpenEnergyPlatform/ontology/pull/1041 replace energy-participant axioms issue: https://github.com/OpenEnergyPlatform/ontology/issues/2053 pull request: https://github.com/OpenEnergyPlatform/ontology/pull/2120

hydroelectric energy transformation
type: Class
subclass of: hydro energy transformation
subclass of: Class
  intersection of: Restriction
    on property: has occurrent part
    some values from: Class
      intersection of: MENO_01013
      intersection of: Restriction
        on property: negatively regulates characteristic
        some values from: hydro energy
  intersection of: Restriction
    on property: has occurrent part
    some values from: Class
      intersection of: MENO_01014
      intersection of: Restriction
        on property: positively regulates characteristic
        some values from: electrical energy
definition: Hydroelectric energy transformation is a hydro energy transformation that converts hydro energy to electrical energy.
term tracker annotation: issue: https://github.com/OpenEnergyPlatform/ontology/issues/679 pull request: https://github.com/OpenEnergyPlatform/ontology/pull/682 change 'has physical input / output' axioms to 'has energy input / output': https://github.com/OpenEnergyPlatform/ontology/issues/994 https://github.com/OpenEnergyPlatform/ontology/pull/1041 replace energy-participant axioms issue: https://github.com/OpenEnergyPlatform/ontology/issues/2053 pull request: https://github.com/OpenEnergyPlatform/ontology/pull/2120

transmission grid
type: Class
subclass of: electricity grid
subclass of: Restriction
  on property: has function
  some values from: OEO_00410056
definition: A transmission grid is an electricity grid that is able to transport electrical energy over long distances.
alternative label: Übertragsnetz @de
comment: Transmission grids transfer electricity for example from large generation plants to regional or local distribution networks. They operate at high rated voltage or extra high rated voltage.
term tracker annotation: issue: https://github.com/OpenEnergyPlatform/ontology/issues/2162 pull request: https://github.com/OpenEnergyPlatform/ontology/pull/2197

distribution grid
type: Class
subclass of: electricity grid
subclass of: Restriction
  on property: has function
  some values from: OEO_00410057
definition: A distribution grid is an electricity grid that distributes electrical energy from the transmission grid or distributed sources to end users or storages.
alternative label: Verteilnetz @de
comment: Distribution grids usually operate at medium rated voltage or low rated voltage.
term tracker annotation: issue: https://github.com/OpenEnergyPlatform/ontology/issues/2162 pull request: https://github.com/OpenEnergyPlatform/ontology/pull/2197

hub height
type: Class
subclass of: quality
subclass of: Restriction
  on property: characteristic of
  some values from: wind energy converting unit
subclass of: Restriction
  on property: has quantity value
  some values from: length value
definition: Hub height is a quality of a wind energy converting unit that measures the distance between surface and centre-line of the wind rotor.
alternative label: Nabenhöhe @de
term tracker annotation: issue: https://github.com/OpenEnergyPlatform/ontology/issues/505 pull request: https://github.com/OpenEnergyPlatform/ontology/pull/509 add 'has bearer' axiom issue: https://github.com/OpenEnergyPlatform/ontology/issues/1305 pull request: https://github.com/OpenEnergyPlatform/ontology/pull/1310 replaced 'has bearer' with 'characteristic of' issue: https://github.com/OpenEnergyPlatform/ontology/issues/1907 pull request: https://github.com/OpenEnergyPlatform/ontology/pull/1928

length value
type: Class
subclass of: quantity value
subclass of: Restriction
  on property: has part
  some values from: length unit
definition: Length value is a quantity value that has a length unit as unit.
term tracker annotation: issue: https://github.com/OpenEnergyPlatform/ontology/issues/505 pull request: https://github.com/OpenEnergyPlatform/ontology/pull/509

transport
type: Class
subclass of: process
subclass of: Restriction
  on property: has participant
  some values from: Class
    union of: person
    union of: good
subclass of: Restriction
  on property: has quantity value
  some values from: OEO_00320000
definition: Transport is the process of moving people or goods from one place to another.
alternative label: Transport @de
term tracker annotation: issue: https://github.com/OpenEnergyPlatform/ontology/issues/503 pull request: https://github.com/OpenEnergyPlatform/ontology/pull/517 add performance axiom issue: https://github.com/OpenEnergyPlatform/ontology/issues/1272 pull-request: https://github.com/OpenEnergyPlatform/ontology/pull/1289 add has participant axiom issue: https://github.com/OpenEnergyPlatform/ontology/issues/1271 pull request: https://github.com/OpenEnergyPlatform/ontology/pull/1309 rework module structure issue: https://github.com/OpenEnergyPlatform/ontology/issues/1592 pull request: https://github.com/OpenEnergyPlatform/ontology/pull/1652

Axiom
annotated source: transport
annotated property: closeMatch
annotated target: ENVO_02000125
term tracker annotation: issue: https://github.com/OpenEnergyPlatform/ontology/issues/636 pull request: https://github.com/OpenEnergyPlatform/ontology/pull/810 Convert to skos:closeMatch issue: https://github.com/OpenEnergyPlatform/ontology/issues/636 pull request: https://github.com/OpenEnergyPlatform/ontology/pull/1879

international transport
type: Class
subclass of: transport
definition: International transport is a transport process between different countries or within the same country via another country.
alternative label: internationaler Verkehr @de
term tracker annotation: issue: https://github.com/OpenEnergyPlatform/ontology/issues/503 pull request: https://github.com/OpenEnergyPlatform/ontology/pull/517 rework module structure issue: https://github.com/OpenEnergyPlatform/ontology/issues/1592 pull request: https://github.com/OpenEnergyPlatform/ontology/pull/1652

freight transport
type: Class
subclass of: transport
subclass of: Restriction
  on property: has participant
  some values from: good
definition: Freight transport is a transport process which moves goods from one place to another.
alternative label: Frachttransport @de
alternative label: Gütertransport @de
term tracker annotation: issue: https://github.com/OpenEnergyPlatform/ontology/issues/503 pull request: https://github.com/OpenEnergyPlatform/ontology/pull/517 Add axiom for goods as participant: issue: https://github.com/OpenEnergyPlatform/ontology/issues/1269 pull request: https://github.com/OpenEnergyPlatform/ontology/pull/1299 rework module structure issue: https://github.com/OpenEnergyPlatform/ontology/issues/1592 pull request: https://github.com/OpenEnergyPlatform/ontology/pull/1652

private transport
type: Class
subclass of: passenger transport
definition: A private transport is a passenger transport in which people use their own vehicle for movement e.g. bicycle, motorcycle and cars.
alternative label: Individualverkehr @de
term tracker annotation: issue: https://github.com/OpenEnergyPlatform/ontology/issues/503 pull request: https://github.com/OpenEnergyPlatform/ontology/pull/517 Make subclass of 'passenger transport' issue: https://github.com/OpenEnergyPlatform/ontology/issues/1055 pull request: https://github.com/OpenEnergyPlatform/ontology/pull/1234 rework module structure issue: https://github.com/OpenEnergyPlatform/ontology/issues/1592 pull request: https://github.com/OpenEnergyPlatform/ontology/pull/1652

public transport
type: Class
subclass of: passenger transport
definition: A public transport is a passenger transport in which a number of passengers share a common vehicle.
alternative label: öffentlicher Verkehr @de
term tracker annotation: issue: https://github.com/OpenEnergyPlatform/ontology/issues/503 pull request: https://github.com/OpenEnergyPlatform/ontology/pull/517 Make subclass of 'passenger transport' issue: https://github.com/OpenEnergyPlatform/ontology/issues/1055 pull request: https://github.com/OpenEnergyPlatform/ontology/pull/1234 rework module structure issue: https://github.com/OpenEnergyPlatform/ontology/issues/1592 pull request: https://github.com/OpenEnergyPlatform/ontology/pull/1652

sponsor
type: Class
subclass of: agent
definition: A sponsor is an agent that supports a person, organisation, or project by giving money, allowance of kind, services or other help.
alternative label: Förderer @de
alternative label: Förderin @de
alternative label: Sponsor @de
alternative label: Sponsorin @de
term tracker annotation: issue: https://github.com/OpenEnergyPlatform/ontology/issues/473 pull request: https://github.com/OpenEnergyPlatform/ontology/pull/557 rework module structure issue: https://github.com/OpenEnergyPlatform/ontology/issues/1592 pull request: https://github.com/OpenEnergyPlatform/ontology/pull/1652

obsolete economic value
type: Class
subclass of: quantity value
definition: OBSOLETE: An economic value is a quantity value that is economically relevant.
alternative label: wirtschaftlicher Wert @de
comment: This term was made obsolete because its definition is rather vague and thus not useful.
deprecated: true
term tracker annotation: issue: https://github.com/OpenEnergyPlatform/ontology/issues/454 pull request: https://github.com/OpenEnergyPlatform/ontology/pull/559 move to oeo-shared pull request: https://github.com/OpenEnergyPlatform/ontology/pull/956 rework module structure issue: https://github.com/OpenEnergyPlatform/ontology/issues/1592 pull request: https://github.com/OpenEnergyPlatform/ontology/pull/1652 obsoletion issue: https://github.com/OpenEnergyPlatform/ontology/issues/1917 pull request: https://github.com/OpenEnergyPlatform/ontology/pull/1931

gross domestic product
type: Class
subclass of: quantity value
subclass of: Restriction
  on property: has unit
  some values from: currency
definition: A gross domestic product is a quantity value that represents the broadest measure of aggregate economic activity, measuring the total unduplicated market value of all final goods and services produced within a statistical area in a period.
alternative label: BIP @de
alternative label: Bruttoinlandsprodukt @de
alternative label: GDP
comment: has unit some currency per time unit
term tracker annotation: issue: https://github.com/OpenEnergyPlatform/ontology/issues/454 pull request: https://github.com/OpenEnergyPlatform/ontology/pull/559 alternative term: https://github.com/OpenEnergyPlatform/ontology/issues/675 https://github.com/OpenEnergyPlatform/ontology/pull/676 issue: https://github.com/OpenEnergyPlatform/ontology/issues/1487 pull request: https://github.com/OpenEnergyPlatform/ontology/pull/1623 make subclass of quantity value issue: https://github.com/OpenEnergyPlatform/ontology/issues/1917 pull request: https://github.com/OpenEnergyPlatform/ontology/pull/1931

gross value added
type: Class
subclass of: quantity value
definition: Gross value added is a quantity value that is the value of goods and services produced in a sector of an economy, measuring that sector's contribution to gross domestic product (GDP). It is calculated as the monetary value of products and services produced, less the value of intermediate consumption.
alternative label: Bruttowertschöpfung @de
alternative label: GVA
term tracker annotation: issue: https://github.com/OpenEnergyPlatform/ontology/issues/455 pull request: https://github.com/OpenEnergyPlatform/ontology/pull/563 alternative term: https://github.com/OpenEnergyPlatform/ontology/issues/675 https://github.com/OpenEnergyPlatform/ontology/pull/676 make subclass of quantity value issue: https://github.com/OpenEnergyPlatform/ontology/issues/1917 pull request: https://github.com/OpenEnergyPlatform/ontology/pull/1931

validation
type: Class
subclass of: process
definition: Validation is the process of checking if something works correctly.
alternative label: Validierung @de
term tracker annotation: issue: https://github.com/OpenEnergyPlatform/ontology/issues/487 pull request: https://github.com/OpenEnergyPlatform/ontology/pull/565

cross-checking against other models
type: Class
subclass of: validation
definition: Cross-checking against other models is a validation where a model gets cross-checked against other models of the domain.
term tracker annotation: issue: https://github.com/OpenEnergyPlatform/ontology/issues/487 pull request: https://github.com/OpenEnergyPlatform/ontology/pull/565

checking against measurements
type: Class
subclass of: validation
definition: Checking against measurements is a validation where something gets checked by using relevant measurements.
alternative label: Abgleich mit Messwerten @de
term tracker annotation: issue: https://github.com/OpenEnergyPlatform/ontology/issues/487 pull request: https://github.com/OpenEnergyPlatform/ontology/pull/565

checking against empirical data
type: Class
subclass of: validation
definition: Checking against empirical data is a validation where something gets checked against empirical data.
alternative label: Abgleich mit empirischen Daten @de
term tracker annotation: issue: https://github.com/OpenEnergyPlatform/ontology/issues/487 pull request: https://github.com/OpenEnergyPlatform/ontology/pull/565

chemical reaction
type: Class
subclass of: transformation
subclass of: Restriction
  on property: has participant
  some values from: material entity
definition: A chemical reaction is a transformation that involves the interconversion of chemical species.
alternative label: chemische Reaktion @de
term tracker annotation: issue: https://github.com/OpenEnergyPlatform/ontology/issues/449 pull request: https://github.com/OpenEnergyPlatform/ontology/pull/568 move to oeo-shared: issue: https://github.com/OpenEnergyPlatform/ontology/issues/1384 pull request: https://github.com/OpenEnergyPlatform/ontology/pull/1390 add 'has participant axiom': issue: https://github.com/OpenEnergyPlatform/ontology/issues/1327 pull request: https://github.com/OpenEnergyPlatform/ontology/pull/1395 rework module structure issue: https://github.com/OpenEnergyPlatform/ontology/issues/1592 pull request: https://github.com/OpenEnergyPlatform/ontology/pull/1652

redox reaction
type: Class
subclass of: chemical reaction
definition: A redox reaction is a chemical reaction in which the oxidation of one reactant is coupled to the reduction of a second reactant.
alternative label: Redoxreaktion @de
alternative label: oxidation
term tracker annotation: issue: https://github.com/OpenEnergyPlatform/ontology/issues/449 pull request: https://github.com/OpenEnergyPlatform/ontology/pull/568

oxidation
type: Class
subclass of: chemical reaction
definition: Oxidation is a chemical reaction that describes the loss of electrons of an atom, an ion, or of certain atoms in a molecule and is a part of a redox reaction.
alternative label: Oxidation @de
term tracker annotation: issue: https://github.com/OpenEnergyPlatform/ontology/issues/449 pull request: https://github.com/OpenEnergyPlatform/ontology/pull/568

reduction
type: Class
subclass of: chemical reaction
definition: Reduction is a chemical reaction that describes the gain of electrons of an atom, an ion, or of certain atoms in a molecule and is a part of a redox reaction.
alternative label: Reduktion @de
term tracker annotation: issue: https://github.com/OpenEnergyPlatform/ontology/issues/449 pull request: https://github.com/OpenEnergyPlatform/ontology/pull/568

electrochemical reaction
type: Class
subclass of: chemical reaction
definition: An electrochemical reaction is a chemical reaction that describes the overall reactions of individual redox reactions being separated but connected by an external electric circuit and an intervening electrolyte.
alternative label: elektrochemische Reaktion @de
term tracker annotation: issue: https://github.com/OpenEnergyPlatform/ontology/issues/449 pull request: https://github.com/OpenEnergyPlatform/ontology/pull/568

combustion
type: Class
subclass of: redox reaction
definition: Combustion is an exothermic redox reaction between a fuel (the reductant) and an oxidant (usually atmospheric oxygen) which is initiated by a ignition source.
alternative label: Verbrennung @de
term tracker annotation: issue: https://github.com/OpenEnergyPlatform/ontology/issues/449 pull request: https://github.com/OpenEnergyPlatform/ontology/pull/568

consumption
type: Class
subclass of: process
definition: Consumption is the process of using something and thereby reducing its amount.
alternative label: Verbrauch @de
term tracker annotation: issue: https://github.com/OpenEnergyPlatform/ontology/issues/140 pull request: https://github.com/OpenEnergyPlatform/ontology/pull/569 rework module structure issue: https://github.com/OpenEnergyPlatform/ontology/issues/1592 pull request: https://github.com/OpenEnergyPlatform/ontology/pull/1652

demand
type: Class
subclass of: realizable entity
subclass of: Restriction
  on property: characteristic of
  some values from: Class
    union of: object
    union of: organisation
definition: A demand is a realizable entity that is characterised by a person, organisation or object needing it for a specific purpose.
alternative label: Bedarf @de
oekg annotation: study descriptor tag
term tracker annotation: issue: https://github.com/OpenEnergyPlatform/ontology/issues/140 pull request: https://github.com/OpenEnergyPlatform/ontology/pull/569 add 'has bearer' axiom issue: https://github.com/OpenEnergyPlatform/ontology/issues/1305 pull request: https://github.com/OpenEnergyPlatform/ontology/pull/1310 pull request: https://github.com/OpenEnergyPlatform/ontology/pull/1485 rework module structure issue: https://github.com/OpenEnergyPlatform/ontology/issues/1592 pull request: https://github.com/OpenEnergyPlatform/ontology/pull/1652 replaced 'has bearer' with 'characteristic of' issue: https://github.com/OpenEnergyPlatform/ontology/issues/1907 pull request: https://github.com/OpenEnergyPlatform/ontology/pull/1928 add oekg annotation issue: https://github.com/OpenEnergyPlatform/ontology/issues/2063 pull request: https://github.com/OpenEnergyPlatform/ontology/pull/2065

time stamp
type: Class
subclass of: data descriptor
subclass of: Restriction
  on property: is about
  some values from: temporal region
subclass of: Restriction
  on property: is about
  some values from: time stamped measurement datum
definition: A time stamp is a data descriptor that is used to describe either a temporal region or a data item that is related to a temporal region, e.g. a time stamped measurement datum. If the time stamp refers to a time step/one-dimensional temporal region, the indication of a time stamp alignment is required
alternative label: Zeitstempel @de
term tracker annotation: issue: https://github.com/OpenEnergyPlatform/ontology/issues/267 pull request: https://github.com/OpenEnergyPlatform/ontology/pull/570 move to oeo-shared: issue: https://github.com/OpenEnergyPlatform/ontology/issues/1384 pull request: https://github.com/OpenEnergyPlatform/ontology/pull/1390 rework module structure issue: https://github.com/OpenEnergyPlatform/ontology/issues/1592 pull request: https://github.com/OpenEnergyPlatform/ontology/pull/1652 reclassify as data descriptor issue: https://github.com/OpenEnergyPlatform/ontology/issues/1536 pull request: https://github.com/OpenEnergyPlatform/ontology/pull/1853 update definition issue: https://github.com/OpenEnergyPlatform/ontology/issues/1901 pull request: https://github.com/OpenEnergyPlatform/ontology/pull/1944

time stamp alignment
type: Class
subclass of: data descriptor
definition: A time stamp alignment is a data descriptor that indicates the position of a time stamp in a time step.
term tracker annotation: issue: https://github.com/OpenEnergyPlatform/ontology/issues/267 pull request: https://github.com/OpenEnergyPlatform/ontology/pull/570 move to oeo-shared: issue: https://github.com/OpenEnergyPlatform/ontology/issues/1384 pull request: https://github.com/OpenEnergyPlatform/ontology/pull/1390 rework module structure issue: https://github.com/OpenEnergyPlatform/ontology/issues/1592 pull request: https://github.com/OpenEnergyPlatform/ontology/pull/1652

energy conversion efficiency
type: Class
subclass of: process attribute
subclass of: Restriction
  on property: process attribute of
  some values from: energy transformation
subclass of: Restriction
  on property: has quantity value
  some values from: efficiency value
definition: Energy conversion efficiency is a process attribute describing the ratio between the input of an energy transformation and the outputs that are used.
alternative label: Energieumwandlungseffizienz @de
alternative label: Wirkungsgrad @de
oekg annotation: study descriptor
term tracker annotation: issue: https://github.com/OpenEnergyPlatform/ontology/issues/434 pull request: https://github.com/OpenEnergyPlatform/ontology/pull/591 moved to oeo-shared: issue: https://github.com/OpenEnergyPlatform/ontology/issues/1543 pull request: https://github.com/OpenEnergyPlatform/ontology/pull/1625 rework module structure issue: https://github.com/OpenEnergyPlatform/ontology/issues/1592 pull request: https://github.com/OpenEnergyPlatform/ontology/pull/1652 add oekg annotation issue: https://github.com/OpenEnergyPlatform/ontology/issues/1529 pull request: https://github.com/OpenEnergyPlatform/ontology/pull/1897

efficiency value
type: Class
subclass of: quantity value
subclass of: Restriction
  on property: has unit
  some values from: ratio
definition: An efficiency value is a quantity value stating the ratio between a process's inputs and the outputs that are used.
alternative label: efficiency
oekg annotation: study descriptor tag
term tracker annotation: issue: https://github.com/OpenEnergyPlatform/ontology/issues/434 pull request: https://github.com/OpenEnergyPlatform/ontology/pull/591 moved to oeo-shared: issue: https://github.com/OpenEnergyPlatform/ontology/issues/1543 pull request: https://github.com/OpenEnergyPlatform/ontology/pull/1625 rework module structure issue: https://github.com/OpenEnergyPlatform/ontology/issues/1592 pull request: https://github.com/OpenEnergyPlatform/ontology/pull/1652 add oekg annotation issue: https://github.com/OpenEnergyPlatform/ontology/issues/2063 pull request: https://github.com/OpenEnergyPlatform/ontology/pull/2065

Axiom
annotated source: efficiency value
annotated property: alternative label
annotated target: efficiency
term tracker annotation: issue: https://github.com/OpenEnergyPlatform/ontology/issues/256 pull request: https://github.com/OpenEnergyPlatform/ontology/pull/779

coefficient of performance value
type: Class
subclass of: quantity value
subclass of: Restriction
  on property: quantity value of
  some values from: energy conversion performance
subclass of: Restriction
  on property: has unit
  some values from: ratio
definition: A coefficient of performance value is a quantity value stating the ratio between the work input and the total output of an energy conversion process.
alternative label: Leistungszahl @de
term tracker annotation: issue: https://github.com/OpenEnergyPlatform/ontology/issues/434 pull request: https://github.com/OpenEnergyPlatform/ontology/pull/591

energy conversion performance
type: Class
subclass of: process attribute
subclass of: Restriction
  on property: process attribute of
  some values from: energy transformation
subclass of: Restriction
  on property: has quantity value
  some values from: coefficient of performance value
definition: Energy conversion performance is a process attribute describing the ratio between the non-heat input of an energy transformation and the outputs that are used.
term tracker annotation: issue: https://github.com/OpenEnergyPlatform/ontology/issues/434 pull request: https://github.com/OpenEnergyPlatform/ontology/pull/591

flow potential
type: Class
subclass of: OEO_00290000
definition: A flow potential is a potential of an input or output of a process, per time unit.
term tracker annotation: issue: https://github.com/OpenEnergyPlatform/ontology/issues/481 pull request: https://github.com/OpenEnergyPlatform/ontology/pull/607 change: adjust definition to be based on parent class issue: https://github.com/OpenEnergyPlatform/ontology/issues/1093 pull request: https://github.com/OpenEnergyPlatform/ontology/pull/1102

theoretical flow potential
type: Class
subclass of: flow potential
definition: A theoretical flow potential is a type of flow potential that identifies the physical upper limit of an input or output of a process in a spatial region of reference per unit time.
term tracker annotation: issue: https://github.com/OpenEnergyPlatform/ontology/issues/481 pull request: https://github.com/OpenEnergyPlatform/ontology/pull/607

technological flow potential
type: Class
subclass of: flow potential
definition: A technological flow potential is a type of a flow potential derived from a theoretical flow potential, taking account of the annual efficiency of the respective conversion technology and the additional restrictions regarding the area that is realistically available for energy generation.
term tracker annotation: issue: https://github.com/OpenEnergyPlatform/ontology/issues/481 pull request: https://github.com/OpenEnergyPlatform/ontology/pull/607

economic flow potential
type: Class
subclass of: flow potential
definition: An economic flow potential is a type of flow potential that identifies the proportion of the technological potential that can be utilised economically (based on economic boundary conditions).
term tracker annotation: issue: https://github.com/OpenEnergyPlatform/ontology/issues/481 pull request: https://github.com/OpenEnergyPlatform/ontology/pull/607

developable flow potential
type: Class
subclass of: flow potential
definition: A developable flow potential is a type of flow potential that describes the fraction of the economic potential that can be developed under realistic conditions (regulations, environmental and social restrictions).
term tracker annotation: issue: https://github.com/OpenEnergyPlatform/ontology/issues/481 pull request: https://github.com/OpenEnergyPlatform/ontology/pull/607

sustainable flow potential
type: Class
subclass of: flow potential
definition: A sustainable flow potential is a type of flow potential that takes into account all aspects of sustainability, which usually requires careful consideration and evaluation of different ecological and socio-economic aspects. The differentiation of the sustainable potential is blurred, since ecological aspects may already have been considered for the technological or economic potential, depending on the author.
term tracker annotation: issue: https://github.com/OpenEnergyPlatform/ontology/issues/481 pull request: https://github.com/OpenEnergyPlatform/ontology/pull/607

stock potential
type: Class
subclass of: OEO_00290000
definition: A stock potential is a potential of the stock of a source or sink.
term tracker annotation: issue: https://github.com/OpenEnergyPlatform/ontology/issues/481 pull request: https://github.com/OpenEnergyPlatform/ontology/pull/607 change: adjust definition to be based on parent class issue: https://github.com/OpenEnergyPlatform/ontology/issues/1093 pull request: https://github.com/OpenEnergyPlatform/ontology/pull/1102

theoretical stock potential
type: Class
subclass of: stock potential
definition: A theoretical stock potential is a type of stock potential that identifies the physical upper limit of a stock of a source or sink in a spatial region of reference.
term tracker annotation: issue: https://github.com/OpenEnergyPlatform/ontology/issues/481 pull request: https://github.com/OpenEnergyPlatform/ontology/pull/607

technological stock potential
type: Class
subclass of: stock potential
definition: A technological stock potential is a type of a stock potential derived from a theoretical stock potential, taking account of the annual efficiency of the respective conversion technology and the additional restrictions regarding the area that is realistically available for energy generation.
term tracker annotation: issue: https://github.com/OpenEnergyPlatform/ontology/issues/481 pull request: https://github.com/OpenEnergyPlatform/ontology/pull/607

economic stock potential
type: Class
subclass of: stock potential
definition: An economic stock potential is a type of stock potential that identifies the proportion of the technological potential that can be utilised economically (based on economic boundary conditions).
term tracker annotation: issue: https://github.com/OpenEnergyPlatform/ontology/issues/481 pull request: https://github.com/OpenEnergyPlatform/ontology/pull/607

developable stock potential
type: Class
subclass of: stock potential
definition: A developable stock potential is a type of stock potential that describes the fraction of the economic potential that can be developed under realistic conditions (regulations, environmental and social restrictions).
term tracker annotation: issue: https://github.com/OpenEnergyPlatform/ontology/issues/481 pull request: https://github.com/OpenEnergyPlatform/ontology/pull/607

sustainable stock potential
type: Class
subclass of: stock potential
definition: A sustainable stock potential is a type of stock potential that takes into account all aspects of sustainability, which usually requires careful consideration and evaluation of different ecological and socio-economic aspects. The differentiation of the sustainable potential is blurred, since ecological aspects may already have been considered for the technological or economic potential, depending on the author.
term tracker annotation: issue: https://github.com/OpenEnergyPlatform/ontology/issues/481 pull request: https://github.com/OpenEnergyPlatform/ontology/pull/607

aggregation type
type: Class
subclass of: data descriptor
subclass of: Restriction
  on property: is about
  some values from: typical period
example of usage: aggregation of a data set with spatial references
example of usage: temporal aggregation of continuous measurements for a discrete time series
definition: An aggregation type is a data descriptor that contains information on the aggregation method applied on a data set.
alternative label: Aggregationsart @de
term tracker annotation: add axiom `'is about' some 'typical period'`: issue: https://github.com/OpenEnergyPlatform/ontology/issues/880 pull request: https://github.com/OpenEnergyPlatform/ontology/pull/883 issue: https://github.com/OpenEnergyPlatform/ontology/issues/571 pull request: https://github.com/OpenEnergyPlatform/ontology/pull/610

primary energy carrier disposition
type: Class
subclass of: energy carrier disposition
example of usage: coals, cruide oil, natural gas, wood or moving air (wind) have the disposition of being primary energy carriers
definition: Primary energy carrier disposition is an energy carrier disposition of material entities that are extracted directly from natural resources or that are natural energy flows.
term tracker annotation: issue: https://github.com/OpenEnergyPlatform/ontology/issues/575 pull request: https://github.com/OpenEnergyPlatform/ontology/pull/633 move to oeo-shared: issue: https://github.com/OpenEnergyPlatform/ontology/issues/1384 pull request: https://github.com/OpenEnergyPlatform/ontology/pull/1390 rework module structure issue: https://github.com/OpenEnergyPlatform/ontology/issues/1592 pull request: https://github.com/OpenEnergyPlatform/ontology/pull/1652

secondary energy carrier disposition
type: Class
subclass of: energy carrier disposition
example of usage: blast furnace gas, coke oven gas, cokes, motor gasoline or electricity have the disposition to be a secondary energy carrier
definition: Secondary energy carrier disposition is an energy carrier disposition of material entities that are manufactured from primary energy carriers or from a different form of secondary energy carriers.
term tracker annotation: issue: https://github.com/OpenEnergyPlatform/ontology/issues/575 pull request: https://github.com/OpenEnergyPlatform/ontology/pull/633 Move to oeo-shared: issue: https://github.com/OpenEnergyPlatform/ontology/issues/1522 pull request: https://github.com/OpenEnergyPlatform/ontology/pull/1531 rework module structure issue: https://github.com/OpenEnergyPlatform/ontology/issues/1592 pull request: https://github.com/OpenEnergyPlatform/ontology/pull/1652

final energy carrier disposition
type: Class
subclass of: energy carrier disposition
example of usage: district heat or electricity have the disposition of being a final energy carrier
definition: Final energy carrier disposition is an energy carrier disposition of material entities that are delivered to energy consumers for their use.
term tracker annotation: issue: https://github.com/OpenEnergyPlatform/ontology/issues/575 pull request: https://github.com/OpenEnergyPlatform/ontology/pull/633

primary energy carrier
type: Class
equivalent class: Class
  intersection of: material entity
  intersection of: Restriction
    on property: has disposition
    some values from: primary energy carrier disposition
subclass of: energy carrier
definition: A primary energy carrier is an energy carrier that has the disposition primary energy carrier disposition.
alternative label: Primärenergieträger @de
term tracker annotation: issue: https://github.com/OpenEnergyPlatform/ontology/issues/575 pull request: https://github.com/OpenEnergyPlatform/ontology/pull/633

secondary energy carrier
type: Class
equivalent class: Class
  intersection of: material entity
  intersection of: Restriction
    on property: has disposition
    some values from: secondary energy carrier disposition
subclass of: energy carrier
definition: A secondary energy carrier is an energy carrier that has the secondary energy carrier disposition.
alternative label: Sekundärenergieträger @de
term tracker annotation: issue: https://github.com/OpenEnergyPlatform/ontology/issues/575 pull request: https://github.com/OpenEnergyPlatform/ontology/pull/633 fix error in definition issue: https://github.com/OpenEnergyPlatform/ontology/issues/669 pull request: https://github.com/OpenEnergyPlatform/ontology/pull/678 Move to oeo-shared: issue: https://github.com/OpenEnergyPlatform/ontology/issues/1522 pull request: https://github.com/OpenEnergyPlatform/ontology/pull/1531 rework module structure issue: https://github.com/OpenEnergyPlatform/ontology/issues/1592 pull request: https://github.com/OpenEnergyPlatform/ontology/pull/1652

final energy carrier
type: Class
equivalent class: Class
  intersection of: material entity
  intersection of: Restriction
    on property: has disposition
    some values from: final energy carrier disposition
subclass of: energy carrier
definition: A final energy carrier is an energy carrier that has the disposition final energy carrier disposition.
alternative label: Endenergieträger @de
term tracker annotation: issue: https://github.com/OpenEnergyPlatform/ontology/issues/575 pull request: https://github.com/OpenEnergyPlatform/ontology/pull/633

emission rate
type: Class
subclass of: process attribute
subclass of: Restriction
  on property: process attribute of
  some values from: emission
subclass of: Restriction
  on property: has quantity value
  some values from: emission value
definition: An emission rate is a process attribute that describes the output of an emission process.
term tracker annotation: class: issue: https://github.com/OpenEnergyPlatform/ontology/issues/420 pull request: https://github.com/OpenEnergyPlatform/ontology/pull/651 has quantity value axiom: issue: https://github.com/OpenEnergyPlatform/ontology/issues/695 pull request: https://github.com/OpenEnergyPlatform/ontology/pull/697 moved to oeo-shared https://github.com/OpenEnergyPlatform/ontology/pull/956 add axiom to social cost of carbon pull request: https://github.com/OpenEnergyPlatform/ontology/pull/1034 rework module structure issue: https://github.com/OpenEnergyPlatform/ontology/issues/1592 pull request: https://github.com/OpenEnergyPlatform/ontology/pull/1652 restructuring emission rate and emission value issue: https://github.com/OpenEnergyPlatform/ontology/issues/1759 pull request: https://github.com/OpenEnergyPlatform/ontology/pull/1846

greenhouse gas emission rate
type: Class
subclass of: emission rate
subclass of: Restriction
  on property: process attribute of
  some values from: greenhouse gas emission
definition: A greenhouse gas emission rate is an emission rate that describes the output of a greenhouse gas emission process.
term tracker annotation: issue: https://github.com/OpenEnergyPlatform/ontology/issues/420 pull request: https://github.com/OpenEnergyPlatform/ontology/pull/651 restructuring emission rate and emission value issue: https://github.com/OpenEnergyPlatform/ontology/issues/1759 pull request: https://github.com/OpenEnergyPlatform/ontology/pull/1846

carbon dioxide equivalent quantity value
type: Class
subclass of: emission value
definition: A carbon dioxide equivalent quantity is a greenhouse gas emission value that quantifies the combined effect of all emitted greenhouse gases by giving an equivalent amount of CO2 which would have the same effect on the climate.
alternative label: CO2 equivalent quantity
alternative label: CO2-Äquivalent @de
alternative label: Kohlendioxid-Äquivalent @de
term tracker annotation: issue: https://github.com/OpenEnergyPlatform/ontology/issues/420 pull request: https://github.com/OpenEnergyPlatform/ontology/pull/651 restructuring emission rate and emission value issue: https://github.com/OpenEnergyPlatform/ontology/issues/1759 pull request: https://github.com/OpenEnergyPlatform/ontology/pull/1846

plutonium
type: Class
subclass of: portion of matter
subclass of: Restriction
  on property: has role
  some values from: fuel role
subclass of: Restriction
  on property: has disposition
  some values from: nuclear energy carrier disposition
subclass of: Restriction
  on property: has normal state of matter
  has value: OEO_00000390
definition: Plutonium is a portion of matter with the chemical formula Pu. It has a solid normal state of matter.
alternative label: Plutonium @de
term tracker annotation: issue: https://github.com/OpenEnergyPlatform/ontology/issues/694 pull request: https://github.com/OpenEnergyPlatform/ontology/pull/708

thorium
type: Class
subclass of: portion of matter
subclass of: Restriction
  on property: has role
  some values from: fuel role
subclass of: Restriction
  on property: has disposition
  some values from: nuclear energy carrier disposition
subclass of: Restriction
  on property: has normal state of matter
  has value: OEO_00000390
definition: Thorium is a portion of matter with the chemical formula Th. It has a solid normal state of matter.
alternative label: Thorium @de
term tracker annotation: issue: https://github.com/OpenEnergyPlatform/ontology/issues/694 pull request: https://github.com/OpenEnergyPlatform/ontology/pull/708

quality control flag
type: Class
subclass of: data descriptor
subclass of: Restriction
  on property: is about
  some values from: data set
definition: A quality control flag is a data descriptor that describes the measurement quality of a data set, e.g. a time series.
term tracker annotation: issue: https://github.com/OpenEnergyPlatform/ontology/issues/612 pull request: https://github.com/OpenEnergyPlatform/ontology/pull/724

goal description
type: Class
subclass of: objective specification
definition: A goal description is an objective specification that contains statements about a desired future state of a system that a person or organisation envisions or plans, or to which it commits.
alternative label: Zielbeschreibung @de
term tracker annotation: issue: https://github.com/OpenEnergyPlatform/ontology/issues/28 pull request: https://github.com/OpenEnergyPlatform/ontology/pull/729 Changed direct parent class from 'information content entity' to 'objective specification' issue: https://github.com/OpenEnergyPlatform/ontology/issues/2097 pull request: https://github.com/OpenEnergyPlatform/ontology/pull/2102

heat transfer
type: Class
subclass of: energy transfer
subclass of: Class
definition: Heat transfer is an energy transfer of thermal energy.
alternative label: Wärmeübertragung @de
term tracker annotation: issue: https://github.com/OpenEnergyPlatform/ontology/issues/730 pull request: https://github.com/OpenEnergyPlatform/ontology/pull/733 subclass of energy transfer pull request: https://github.com/OpenEnergyPlatform/ontology/pull/895 change 'has physical input / output' axioms to 'has energy input / output': https://github.com/OpenEnergyPlatform/ontology/issues/994 https://github.com/OpenEnergyPlatform/ontology/pull/1041 Shorten definition: issue: https://github.com/OpenEnergyPlatform/ontology/issues/1269 pull request: https://github.com/OpenEnergyPlatform/ontology/pull/1299

Axiom
annotated source: heat transfer
annotated property: subClassOf
annotated target: Class
term tracker annotation: issue: https://github.com/OpenEnergyPlatform/ontology/issues/736 pull request: https://github.com/OpenEnergyPlatform/ontology/pull/766

heat exchanger
type: Class
subclass of: energy converting component
subclass of: Restriction
  on property: participates in
  some values from: heat transfer
definition: A heat exchanger is an energy converting component that is used for a heat transfer process.
alternative label: Wärmetauscher @de
alternative label: Wärmeübertrager @de
term tracker annotation: issue: https://github.com/OpenEnergyPlatform/ontology/issues/713 pull request: https://github.com/OpenEnergyPlatform/ontology/pull/734 use energy converting component in definition: https://github.com/OpenEnergyPlatform/ontology/pull/993 change produces energy and uses energy axioms to 'has energy output' and 'has energy input': issue: https://github.com/OpenEnergyPlatform/ontology/issues/994 pull request: https://github.com/OpenEnergyPlatform/ontology/pull/1006 fix definition: issue: https://github.com/OpenEnergyPlatform/ontology/issues/1263 pull request: https://github.com/OpenEnergyPlatform/ontology/pull/1264

Axiom
annotated source: heat exchanger
annotated property: subClassOf
annotated target: Restriction
term tracker annotation: issue: https://github.com/OpenEnergyPlatform/ontology/issues/761 pull request: https://github.com/OpenEnergyPlatform/ontology/pull/782

Axiom
annotated source: heat exchanger
annotated property: subClassOf
annotated target: Restriction
term tracker annotation: issue: https://github.com/OpenEnergyPlatform/ontology/issues/761 pull request: https://github.com/OpenEnergyPlatform/ontology/pull/782

natural ambient thermal energy
type: Class
subclass of: ambient thermal energy
subclass of: Restriction
  on property: has origin
  some values from: renewable
definition: Natural ambient thermal energy is ambient thermal energy that has a renewable origin.
term tracker annotation: issue: https://github.com/OpenEnergyPlatform/ontology/issues/728 pull request: https://github.com/OpenEnergyPlatform/ontology/pull/742

artificial ambient thermal energy
type: Class
subclass of: ambient thermal energy
subclass of: Restriction
  on property: has origin
  some values from: conventional
subclass of: Restriction
  on property: has origin
  some values from: anthropogenic
definition: Artificial ambient thermal energy is ambient thermal energy that has an anthropogenic origin.
term tracker annotation: issue: https://github.com/OpenEnergyPlatform/ontology/issues/728 pull request: https://github.com/OpenEnergyPlatform/ontology/pull/742

ambient thermal energy transfer
type: Class
subclass of: heat transfer
subclass of: Class
  intersection of: Restriction
    on property: has occurrent part
    some values from: Class
      intersection of: MENO_01013
      intersection of: Restriction
        on property: negatively regulates characteristic
        some values from: ambient thermal energy
  intersection of: Restriction
    on property: has occurrent part
    some values from: Class
      intersection of: MENO_01014
      intersection of: Restriction
        on property: positively regulates characteristic
        some values from: thermal energy
subclass of: Restriction
  on property: has participant
  some values from: material entity
subclass of: Restriction
  on property: has energy input
  some values from: ambient thermal energy
definition: Ambient thermal energy transfer is a heat transfer from the ambient air to a transportable material entity.
term tracker annotation: issue: https://github.com/OpenEnergyPlatform/ontology/issues/728 pull request: https://github.com/OpenEnergyPlatform/ontology/pull/742 change 'has physical input / output' axioms to 'has energy input / output': https://github.com/OpenEnergyPlatform/ontology/issues/994 https://github.com/OpenEnergyPlatform/ontology/pull/1041

contract
type: Class
subclass of: document
definition: A contract is a document that contains an agreement between two or more competent agents to which those agents agree to be legally bound.
alternative label: Vertrag @de
definition source: https://spec.edmcouncil.org/fibo/ontology/FND/Agreements/Contracts/Contract
term tracker annotation: issue: https://github.com/OpenEnergyPlatform/ontology/issues/376 pull request: https://github.com/OpenEnergyPlatform/ontology/pull/756

fluid
type: Class
equivalent class: Class
  intersection of: material entity
  intersection of: Class
    union of: Restriction
      on property: has state of matter
      has value: OEO_00000182
    union of: Restriction
      on property: has state of matter
      has value: OEO_00000256
    union of: Restriction
      on property: has state of matter
      has value: OEO_00000326
subclass of: material entity
definition: A fluid is a material entity which is a liquid, gas or plasma.
alternative label: Fluid @de
term tracker annotation: issue: https://github.com/OpenEnergyPlatform/ontology/issues/763 pull request: https://github.com/OpenEnergyPlatform/ontology/pull/769

delivery time
type: Class
subclass of: one-dimensional temporal region
definition: Delivery time is a one-dimensional temporal region expressing the amount of time that it takes for goods that have been bought to arrive at the place where they are wanted.
alternative label: Lieferzeit @de
term tracker annotation: issue: https://github.com/OpenEnergyPlatform/ontology/issues/376 pull request: https://github.com/OpenEnergyPlatform/ontology/pull/778

delivery time point
type: Class
subclass of: zero-dimensional temporal region
definition: A delivery time point is a zero-dimensional temporal region expressing the point in time when goods that have been bought arrive at the place where they are wanted.
alternative label: Lieferzeitpunkt @de
term tracker annotation: issue: https://github.com/OpenEnergyPlatform/ontology/issues/376 pull request: https://github.com/OpenEnergyPlatform/ontology/pull/778

sender
type: Class
subclass of: agent
definition: A sender is an agent who initiates a communication.
alternative label: Sender @de
term tracker annotation: issue: https://github.com/OpenEnergyPlatform/ontology/issues/376 pull request: https://github.com/OpenEnergyPlatform/ontology/pull/778

receiver
type: Class
subclass of: agent
definition: A receiver is an agent who obtains information from a sender.
alternative label: Empfänger @de
alternative label: Empfängerin @de
term tracker annotation: issue: https://github.com/OpenEnergyPlatform/ontology/issues/376 pull request: https://github.com/OpenEnergyPlatform/ontology/pull/778

bid
type: Class
subclass of: document
definition: A bid is a document describing an offer made by an agent to another agent in an effort to exchange commodities or services via terms relating to price and quantity which will be part of the resulting contract.
alternative label: Gebot @de
term tracker annotation: issue: https://github.com/OpenEnergyPlatform/ontology/issues/376 pull request: https://github.com/OpenEnergyPlatform/ontology/pull/778

award
type: Class
subclass of: document
definition: An award is a document that signifies that a supplier for a particular commodity or service specified in a bid has been accepted.
alternative label: Zuschlag @de
term tracker annotation: issue: https://github.com/OpenEnergyPlatform/ontology/issues/376 pull request: https://github.com/OpenEnergyPlatform/ontology/pull/778

provider
type: Class
subclass of: agent
definition: A provider is an agent that transfers commodities or services to other agents.
definition source: https://spec.edmcouncil.org/fibo/ontology/FND/ProductsAndServices/ProductsAndServices/ServiceProvider (adapted)
comment: The transfer is typically defined in a contract.
term tracker annotation: issue: https://github.com/OpenEnergyPlatform/ontology/issues/376 pull request: https://github.com/OpenEnergyPlatform/ontology/pull/778

service
type: Class
subclass of: process
subclass of: Restriction
  on property: has participant
  some values from: agent
definition: A service is a process that is an intangible activity performed by some agent for the benefit of another agent.
alternative label: Dienstleistung @de
definition source: https://spec.edmcouncil.org/fibo/ontology/FND/ProductsAndServices/ProductsAndServices/Service (adapted)
term tracker annotation: issue: https://github.com/OpenEnergyPlatform/ontology/issues/376 pull request: https://github.com/OpenEnergyPlatform/ontology/pull/778 add 'has participant axiom' and move to oeo-shared: issue: https://github.com/OpenEnergyPlatform/ontology/issues/1327 pull request: https://github.com/OpenEnergyPlatform/ontology/pull/1395 rework module structure issue: https://github.com/OpenEnergyPlatform/ontology/issues/1592 pull request: https://github.com/OpenEnergyPlatform/ontology/pull/1652

delivery interval
type: Class
subclass of: time span
definition: A delivery interval is the duration between repeated deliveries of services or commodities.
alternative label: Lieferintervall @de
comment: This duration is often contractually fixed and regular.
term tracker annotation: issue: https://github.com/OpenEnergyPlatform/ontology/issues/256 pull request: https://github.com/OpenEnergyPlatform/ontology/pull/779

planned availability
type: Class
subclass of: quality
subclass of: Restriction
  on property: characteristic of
  some values from: power plant
subclass of: Restriction
  on property: has quantity value
  some values from: fraction value
definition: Planned availability is a quality that describes the amount of time a power plant is planned to be operational per year.
alternative label: geplante Verfügbarkeit @de
term tracker annotation: issue: https://github.com/OpenEnergyPlatform/ontology/issues/256 pull request: https://github.com/OpenEnergyPlatform/ontology/pull/779 add 'has bearer' axiom issue: https://github.com/OpenEnergyPlatform/ontology/issues/1305 pull request: https://github.com/OpenEnergyPlatform/ontology/pull/1310 replaced 'has bearer' with 'characteristic of' issue: https://github.com/OpenEnergyPlatform/ontology/issues/1907 pull request: https://github.com/OpenEnergyPlatform/ontology/pull/1928

fraction value
type: Class
subclass of: relational quantity value
definition: A fraction value is a relational quantity value that has a fraction as it's unit.
alternative label: share
term tracker annotation: issue: https://github.com/OpenEnergyPlatform/ontology/issues/187 pull request: https://github.com/OpenEnergyPlatform/ontology/pull/779 make subclass or relational quantity value and move to oeo-shared issue: https://github.com/OpenEnergyPlatform/ontology/issues/1875 pull request: https://github.com/OpenEnergyPlatform/ontology/pull/1878

block size
type: Class
subclass of: OEO_00230002
subclass of: Restriction
  on property: quantity value of
  some values from: power generating unit
definition: Block size is the declared net capacity of a power generating unit.
term tracker annotation: issue: https://github.com/OpenEnergyPlatform/ontology/issues/256 pull request: https://github.com/OpenEnergyPlatform/ontology/pull/779

unplanned availability
type: Class
subclass of: quality
subclass of: Restriction
  on property: characteristic of
  some values from: power plant
subclass of: Restriction
  on property: has quantity value
  some values from: fraction value
definition: Unplanned availability is a quality that describes the amount of time a power plant is planned to be operational per year, but is not operation.
term tracker annotation: issue: https://github.com/OpenEnergyPlatform/ontology/issues/256 pull request: https://github.com/OpenEnergyPlatform/ontology/pull/779 add 'has bearer' axiom issue: https://github.com/OpenEnergyPlatform/ontology/issues/1305 pull request: https://github.com/OpenEnergyPlatform/ontology/pull/1310 replaced 'has bearer' with 'characteristic of' issue: https://github.com/OpenEnergyPlatform/ontology/issues/1907 pull request: https://github.com/OpenEnergyPlatform/ontology/pull/1928

power plant operator
type: Class
subclass of: agent
definition: A power plant operator is an agent that operates an electric utility generation station.
alternative label: Kraftwerksbetreiber @de
alternative label: Kraftwerksbetreiberin @de
term tracker annotation: issue: https://github.com/OpenEnergyPlatform/ontology/issues/256 pull request: https://github.com/OpenEnergyPlatform/ontology/pull/779

conventional trader
type: Class
subclass of: trader
definition: A trader that trades the power of fossil fuel power plants.
term tracker annotation: issue: https://github.com/OpenEnergyPlatform/ontology/issues/256 pull request: https://github.com/OpenEnergyPlatform/ontology/pull/779

renewable energy share
type: Class
subclass of: process attribute
subclass of: Restriction
  on property: has quantity value
  some values from: renewable energy share value
definition: A renewable energy share is a process attribute that indicates the fraction of renewable energy related to the total energy of an energy generation or consumption process.
alternative label: RE share
alternative label: erneuerbarer Anteil @de
alternative label: renewables share
oekg annotation: study descriptor
term tracker annotation: issue: https://github.com/OpenEnergyPlatform/ontology/issues/187 pull request: https://github.com/OpenEnergyPlatform/ontology/pull/780 axiom to RE share value and alternative label issue: https://github.com/OpenEnergyPlatform/ontology/issues/1434 pull request: https://github.com/OpenEnergyPlatform/ontology/pull/1561 add oekg annotation issue: https://github.com/OpenEnergyPlatform/ontology/issues/1529 pull request: https://github.com/OpenEnergyPlatform/ontology/pull/1897

hydrogen fuel cell
type: Class
subclass of: fuel cell
subclass of: Restriction
  on property: uses
  some values from: hydrogen
definition: A hydrogen fuel cell is a fuel cell that uses hydrogen.
alternative label: Wasserstoffbrennstoffzelle @de
term tracker annotation: issue: https://github.com/OpenEnergyPlatform/ontology/issues/761 pull request: https://github.com/OpenEnergyPlatform/ontology/pull/782

natural gas turbine
type: Class
subclass of: gas turbine
subclass of: Restriction
  on property: uses
  some values from: natural gas
definition: A natural gas turbine is a gas turbine fueled with natural gas.
alternative label: Erdgasturbine @de
term tracker annotation: issue: https://github.com/OpenEnergyPlatform/ontology/issues/761 pull request: https://github.com/OpenEnergyPlatform/ontology/pull/782

dispatch assignment
type: Class
subclass of: plan specification
definition: Dispatch assignment is a plan specification that refers to resource planning at a power plant (usually by the plant’s operator).
term tracker annotation: issue: https://github.com/OpenEnergyPlatform/ontology/issues/376 pull request: https://github.com/OpenEnergyPlatform/ontology/pull/792

power plant portfolio
type: Class
subclass of: information content entity
definition: A power plant portfolio is an information content entity that describes a particular combination or mix of different power plants, e.g. renewables and fossil plants within one business unit or company or trader.
term tracker annotation: issue: https://github.com/OpenEnergyPlatform/ontology/issues/376 pull request: https://github.com/OpenEnergyPlatform/ontology/pull/792

generation time series
type: Class
subclass of: time series
subclass of: Restriction
  on property: is about
  some values from: Class
    intersection of: OEO_00240014
    intersection of: Restriction
      on property: has participant
      some values from: power plant
definition: A generation time series is a time series that describes the specific electricity generation of a particular power plant.
term tracker annotation: issue: https://github.com/OpenEnergyPlatform/ontology/issues/256 pull request: https://github.com/OpenEnergyPlatform/ontology/pull/793 Add 'is about' axiom: pull request: https://github.com/OpenEnergyPlatform/ontology/pull/1410 move axiom to shared-axioms issue: https://github.com/OpenEnergyPlatform/ontology/issues/1703 pull request: https://github.com/OpenEnergyPlatform/ontology/pull/1706

yield profile
type: Class
subclass of: generation time series
subclass of: Restriction
  on property: is about
  some values from: renewable power plant
definition: A yield profile is a generation time series of a particular renewable power plant.
alternative label: Ertragsprofil @de
term tracker annotation: issue: https://github.com/OpenEnergyPlatform/ontology/issues/256 pull request: https://github.com/OpenEnergyPlatform/ontology/pull/793 Add 'is about' axiom: issue:https://github.com/OpenEnergyPlatform/ontology/issues/1423 pull request: https://github.com/OpenEnergyPlatform/ontology/pull/1437 move axiom to shared-axioms issue: https://github.com/OpenEnergyPlatform/ontology/issues/1703 pull request: https://github.com/OpenEnergyPlatform/ontology/pull/1706

demand trader
type: Class
subclass of: trader
definition: A demand trader is a trader that deals specifically with energy demand.
term tracker annotation: issue: https://github.com/OpenEnergyPlatform/ontology/issues/256 pull request: https://github.com/OpenEnergyPlatform/ontology/pull/793

merit order
type: Class
subclass of: plan specification
definition: A merit order is a plan specification that describes the dispatch ranking of power plants (electrical generation) based on ascending order of price.
alternative label: Merit-Order @de
alternative label: geordnete Grenzkostenkurve @de
term tracker annotation: issue: https://github.com/OpenEnergyPlatform/ontology/issues/256 pull request: https://github.com/OpenEnergyPlatform/ontology/pull/793

direct marketer
type: Class
subclass of: trader
definition: A direct marketer is a trader who is the relay between the energy exchange and power plant operators.
alternative label: Direktvermarkter @de
term tracker annotation: issue: https://github.com/OpenEnergyPlatform/ontology/issues/256 pull request: https://github.com/OpenEnergyPlatform/ontology/pull/793

full load hours
type: Class
subclass of: quantity value
subclass of: Restriction
  on property: has unit
  some values from: hour
definition: Full load hours are a quantity value that describes the utilization of a technical device. The value of the full load hours is obtained by dividing the annual amount of energy generated by the declared net capacity of the plant.
alternative label: Volllaststunden @de
term tracker annotation: issue: https://github.com/OpenEnergyPlatform/ontology/issues/256 pull request: https://github.com/OpenEnergyPlatform/ontology/pull/793

energy demand
type: Class
subclass of: demand
definition: Energy demand is a demand for energy.
alternative label: Energiebedarf @de
alternative label: Energienachfrage @de
oekg annotation: study descriptor
term tracker annotation: issue: https://github.com/OpenEnergyPlatform/ontology/issues/794 pull request: https://github.com/OpenEnergyPlatform/ontology/pull/796 rework module structure issue: https://github.com/OpenEnergyPlatform/ontology/issues/1592 pull request: https://github.com/OpenEnergyPlatform/ontology/pull/1652 add oekg annotation issue: https://github.com/OpenEnergyPlatform/ontology/issues/1529 pull request: https://github.com/OpenEnergyPlatform/ontology/pull/1897

transformative measure
type: Class
subclass of: process
definition: A transformative measure is a process that is an activity that has a direct impact on a specific variable in question.
alternative label: policies and measures
term tracker annotation: issue: https://github.com/OpenEnergyPlatform/ontology/issues/444 pull request: https://github.com/OpenEnergyPlatform/ontology/pull/797 move to oeo-shared, alternative label issue: https://github.com/OpenEnergyPlatform/ontology/issues/1329 pull request: https://github.com/OpenEnergyPlatform/ontology/pull/1614 rework module structure issue: https://github.com/OpenEnergyPlatform/ontology/issues/1592 pull request: https://github.com/OpenEnergyPlatform/ontology/pull/1652

policy
type: Class
subclass of: plan specification
subclass of: Restriction
  on property: has part
  some values from: legal target description
subclass of: Restriction
  on property: has part
  some values from: policy instrument
subclass of: Restriction
  on property: characteristic of
  some values from: organisation
definition: A policy is a plan specification that is a deliberate system of principles, rules and guidelines, adopted by an organisation to guide decision making with respect to particular situations and implemented to achieve stated goals.
alternative label: Politik @de
alternative label: policies and measures
term tracker annotation: issue: https://github.com/OpenEnergyPlatform/ontology/issues/444 pull request: https://github.com/OpenEnergyPlatform/ontology/pull/797 relations: issue: https://github.com/OpenEnergyPlatform/ontology/issues/444 pull request: https://github.com/OpenEnergyPlatform/ontology/pull/853 alternative label issue: https://github.com/OpenEnergyPlatform/ontology/issues/1329 pull request: https://github.com/OpenEnergyPlatform/ontology/pull/1614 reclassify and add axiom to target description issue: https://github.com/OpenEnergyPlatform/ontology/issues/1684 pull request: https://github.com/OpenEnergyPlatform/ontology/pull/1778 replaced 'has bearer' with 'characteristic of' issue: https://github.com/OpenEnergyPlatform/ontology/issues/1907 pull request: https://github.com/OpenEnergyPlatform/ontology/pull/1928

policy instrument
type: Class
subclass of: action specification
subclass of: Restriction
  on property: is about
  some values from: organisation
definition: A policy instrument is an action specification of an organisation (e.g. a government) that promotes transformative measures.
alternative label: Politikinstrument @de
alternative label: policies and measures
oekg annotation: study descriptor
term tracker annotation: issue: https://github.com/OpenEnergyPlatform/ontology/issues/444 pull request: https://github.com/OpenEnergyPlatform/ontology/pull/797 Redefine as 'plan specification' and add axiom: issue: https://github.com/OpenEnergyPlatform/ontology/issues/1507 pull request: https://github.com/OpenEnergyPlatform/ontology/pull/1563 move to oeo-shared, alternative label issue: https://github.com/OpenEnergyPlatform/ontology/issues/1329 pull request: https://github.com/OpenEnergyPlatform/ontology/pull/1614 rework module structure issue: https://github.com/OpenEnergyPlatform/ontology/issues/1592 pull request: https://github.com/OpenEnergyPlatform/ontology/pull/1652 reclassify issue: https://github.com/OpenEnergyPlatform/ontology/issues/1684 pull request: https://github.com/OpenEnergyPlatform/ontology/pull/1778 update definition issue: https://github.com/OpenEnergyPlatform/ontology/issues/1766 pull request: https://github.com/OpenEnergyPlatform/ontology/pull/1791 add oekg annotation issue: https://github.com/OpenEnergyPlatform/ontology/issues/1529 pull request: https://github.com/OpenEnergyPlatform/ontology/pull/1897

Axiom
annotated source: policy instrument
annotated property: subClassOf
annotated target: Restriction
term tracker annotation: issue: https://github.com/OpenEnergyPlatform/ontology/issues/444 pull request: https://github.com/OpenEnergyPlatform/ontology/pull/853

hydrocarbon
type: Class
subclass of: portion of matter
subclass of: Restriction
  on property: has role
  some values from: fuel role
subclass of: Restriction
  on property: has disposition
  some values from: combustible energy carrier disposition
definition: Hydrocarbon is a portion of matter which is member of class of organic chemical compounds composed only of the elements carbon (C) and hydrogen (H).
alternative label: Kohlenwasserstoff @de
definition source: https://www.britannica.com/science/hydrocarbon
term tracker annotation: issue: https://github.com/OpenEnergyPlatform/ontology/issues/786 pull request: https://github.com/OpenEnergyPlatform/ontology/pull/805 move to oeo-shared: issue: https://github.com/OpenEnergyPlatform/ontology/issues/1384 pull request: https://github.com/OpenEnergyPlatform/ontology/pull/1390 rework module structure issue: https://github.com/OpenEnergyPlatform/ontology/issues/1592 pull request: https://github.com/OpenEnergyPlatform/ontology/pull/1652

syngas
type: Class
subclass of: gas mixture
subclass of: Restriction
  on property: has part
  some values from: hydrogen
subclass of: Restriction
  on property: has part
  some values from: carbon monoxide
subclass of: Restriction
  on property: has role
  some values from: fuel role
subclass of: Restriction
  on property: has disposition
  some values from: combustible energy carrier disposition
subclass of: Restriction
  on property: has disposition
  some values from: secondary energy carrier disposition
definition: Syngas is a gas mixture consisting primarily of hydrogen, carbon monoxide, and very often carbon dioxide, that can be used as fuel.
alternative label: Syngas @de
alternative label: Synthesegas @de
definition source: https://en.wikipedia.org/wiki/Syngas
term tracker annotation: issue: https://github.com/OpenEnergyPlatform/ontology/issues/786 pull request: https://github.com/OpenEnergyPlatform/ontology/pull/805 add axioms: pull request: https://github.com/OpenEnergyPlatform/ontology/pull/931 improve definition and make subclass of gas mixture: issue: https://github.com/OpenEnergyPlatform/ontology/issues/988 pull request: https://github.com/OpenEnergyPlatform/ontology/pull/1009 add axiom to secondary energy carrier disposition issue:https://github.com/OpenEnergyPlatform/ontology/issues/1222 pull request: https://github.com/OpenEnergyPlatform/ontology/pull/1243